nutch-dev mailing list archives

Site index · List index
Message view « Date » · « Thread »
Top « Date » · « Thread »
From Apache Jenkins Server <jenk...@builds.apache.org>
Subject Build failed in Jenkins: Nutch-trunk #2470
Date Wed, 01 Jan 2014 04:05:23 GMT
See <https://builds.apache.org/job/Nutch-trunk/2470/>

------------------------------------------
[...truncated 3387 lines...]

init:
    [mkdir] Created dir: <https://builds.apache.org/job/Nutch-trunk/ws/trunk/build/urlnormalizer-host/classes>
    [mkdir] Created dir: <https://builds.apache.org/job/Nutch-trunk/ws/trunk/build/plugins/urlnormalizer-host>

init-plugin:

deps-jar:

clean-lib:

resolve-default:
[ivy:resolve] :: loading settings :: file = <https://builds.apache.org/job/Nutch-trunk/ws/trunk/ivy/ivysettings.xml>

compile:
     [echo] Compiling plugin: urlnormalizer-host
    [javac] Compiling 1 source file to <https://builds.apache.org/job/Nutch-trunk/ws/trunk/build/urlnormalizer-host/classes>
    [javac] warning: [options] bootstrap class path not set in conjunction with -source 1.6
    [javac] 1 warning

jar:
      [jar] Building jar: <https://builds.apache.org/job/Nutch-trunk/ws/trunk/build/urlnormalizer-host/urlnormalizer-host.jar>

deps-test:

deploy:
     [copy] Copying 1 file to <https://builds.apache.org/job/Nutch-trunk/ws/trunk/build/plugins/urlnormalizer-host>

copy-generated-lib:
     [copy] Copying 1 file to <https://builds.apache.org/job/Nutch-trunk/ws/trunk/build/plugins/urlnormalizer-host>

init:
    [mkdir] Created dir: <https://builds.apache.org/job/Nutch-trunk/ws/trunk/build/urlnormalizer-pass>
    [mkdir] Created dir: <https://builds.apache.org/job/Nutch-trunk/ws/trunk/build/urlnormalizer-pass/classes>
    [mkdir] Created dir: <https://builds.apache.org/job/Nutch-trunk/ws/trunk/build/urlnormalizer-pass/test>
    [mkdir] Created dir: <https://builds.apache.org/job/Nutch-trunk/ws/trunk/build/plugins/urlnormalizer-pass>

init-plugin:

deps-jar:

clean-lib:

resolve-default:
[ivy:resolve] :: loading settings :: file = <https://builds.apache.org/job/Nutch-trunk/ws/trunk/ivy/ivysettings.xml>

compile:
     [echo] Compiling plugin: urlnormalizer-pass
    [javac] Compiling 1 source file to <https://builds.apache.org/job/Nutch-trunk/ws/trunk/build/urlnormalizer-pass/classes>
    [javac] warning: [options] bootstrap class path not set in conjunction with -source 1.6
    [javac] 1 warning

jar:
      [jar] Building jar: <https://builds.apache.org/job/Nutch-trunk/ws/trunk/build/urlnormalizer-pass/urlnormalizer-pass.jar>

deps-test:

deploy:
     [copy] Copying 1 file to <https://builds.apache.org/job/Nutch-trunk/ws/trunk/build/plugins/urlnormalizer-pass>

copy-generated-lib:
     [copy] Copying 1 file to <https://builds.apache.org/job/Nutch-trunk/ws/trunk/build/plugins/urlnormalizer-pass>

init:
    [mkdir] Created dir: <https://builds.apache.org/job/Nutch-trunk/ws/trunk/build/urlnormalizer-querystring>
    [mkdir] Created dir: <https://builds.apache.org/job/Nutch-trunk/ws/trunk/build/urlnormalizer-querystring/classes>
    [mkdir] Created dir: <https://builds.apache.org/job/Nutch-trunk/ws/trunk/build/urlnormalizer-querystring/test>
    [mkdir] Created dir: <https://builds.apache.org/job/Nutch-trunk/ws/trunk/build/plugins/urlnormalizer-querystring>

init-plugin:

deps-jar:

clean-lib:

resolve-default:
[ivy:resolve] :: loading settings :: file = <https://builds.apache.org/job/Nutch-trunk/ws/trunk/ivy/ivysettings.xml>

compile:
     [echo] Compiling plugin: urlnormalizer-querystring
    [javac] Compiling 1 source file to <https://builds.apache.org/job/Nutch-trunk/ws/trunk/build/urlnormalizer-querystring/classes>
    [javac] warning: [options] bootstrap class path not set in conjunction with -source 1.6
    [javac] 1 warning

jar:
      [jar] Building jar: <https://builds.apache.org/job/Nutch-trunk/ws/trunk/build/urlnormalizer-querystring/urlnormalizer-querystring.jar>

deps-test:

deploy:
     [copy] Copying 1 file to <https://builds.apache.org/job/Nutch-trunk/ws/trunk/build/plugins/urlnormalizer-querystring>

copy-generated-lib:
     [copy] Copying 1 file to <https://builds.apache.org/job/Nutch-trunk/ws/trunk/build/plugins/urlnormalizer-querystring>
    [mkdir] Created dir: <https://builds.apache.org/job/Nutch-trunk/ws/trunk/build/urlnormalizer-regex/test/data>
     [copy] Copying 4 files to <https://builds.apache.org/job/Nutch-trunk/ws/trunk/build/urlnormalizer-regex/test/data>

init:
    [mkdir] Created dir: <https://builds.apache.org/job/Nutch-trunk/ws/trunk/build/urlnormalizer-regex/classes>
    [mkdir] Created dir: <https://builds.apache.org/job/Nutch-trunk/ws/trunk/build/plugins/urlnormalizer-regex>

init-plugin:

deps-jar:

clean-lib:

resolve-default:
[ivy:resolve] :: loading settings :: file = <https://builds.apache.org/job/Nutch-trunk/ws/trunk/ivy/ivysettings.xml>

compile:
     [echo] Compiling plugin: urlnormalizer-regex
    [javac] Compiling 1 source file to <https://builds.apache.org/job/Nutch-trunk/ws/trunk/build/urlnormalizer-regex/classes>
    [javac] warning: [options] bootstrap class path not set in conjunction with -source 1.6
    [javac] 1 warning

jar:
      [jar] Building jar: <https://builds.apache.org/job/Nutch-trunk/ws/trunk/build/urlnormalizer-regex/urlnormalizer-regex.jar>

deps-test:

init:

init-plugin:

clean-lib:

resolve-default:
[ivy:resolve] :: loading settings :: file = <https://builds.apache.org/job/Nutch-trunk/ws/trunk/ivy/ivysettings.xml>

compile:

jar:

deps-test:

deploy:

copy-generated-lib:

deploy:
     [copy] Copying 1 file to <https://builds.apache.org/job/Nutch-trunk/ws/trunk/build/plugins/urlnormalizer-regex>

copy-generated-lib:
     [copy] Copying 1 file to <https://builds.apache.org/job/Nutch-trunk/ws/trunk/build/plugins/urlnormalizer-regex>

compile:

job:
      [jar] Building jar: <https://builds.apache.org/job/Nutch-trunk/ws/trunk/build/apache-nutch-1.8-SNAPSHOT.job>

resolve-test:
  [taskdef] Could not load definitions from resource org/sonar/ant/antlib.xml. It could not
be found.

copy-libs:

compile-core-test:
    [javac] Compiling 33 source files to <https://builds.apache.org/job/Nutch-trunk/ws/trunk/build/test/classes>
    [javac] warning: [options] bootstrap class path not set in conjunction with -source 1.6
    [javac] 1 warning

test-core:
    [mkdir] Created dir: <https://builds.apache.org/job/Nutch-trunk/ws/trunk/build/test/data>
     [copy] Copying 90 files to <https://builds.apache.org/job/Nutch-trunk/ws/trunk/build/test/data>
     [copy] Copying 1 file to <https://builds.apache.org/job/Nutch-trunk/ws/trunk/build/test/classes>
     [copy] Copying 1 file to <https://builds.apache.org/job/Nutch-trunk/ws/trunk/build/test/classes>
     [copy] Copying 1 file to <https://builds.apache.org/job/Nutch-trunk/ws/trunk/build/test/classes>
     [copy] Copying 1 file to <https://builds.apache.org/job/Nutch-trunk/ws/trunk/build/test/classes>
     [copy] Copying 1 file to <https://builds.apache.org/job/Nutch-trunk/ws/trunk/build/test/classes>
    [junit] WARNING: multiple versions of ant detected in path for junit 
    [junit]          jar:file:/home/hudson/tools/ant/latest/lib/ant.jar!/org/apache/tools/ant/Project.class
    [junit]      and jar:<https://builds.apache.org/job/Nutch-trunk/ws/trunk/build/lib/ant-1.6.5.jar!/org/apache/tools/ant/Project.class>
    [junit] Running org.apache.nutch.crawl.TestCrawlDbFilter
    [junit] Tests run: 1, Failures: 0, Errors: 1, Time elapsed: 0.233 sec
    [junit] Test org.apache.nutch.crawl.TestCrawlDbFilter FAILED
    [junit] Running org.apache.nutch.crawl.TestCrawlDbMerger
    [junit] Tests run: 1, Failures: 0, Errors: 1, Time elapsed: 0.226 sec
    [junit] Test org.apache.nutch.crawl.TestCrawlDbMerger FAILED
    [junit] Running org.apache.nutch.crawl.TestGenerator
    [junit] Tests run: 4, Failures: 0, Errors: 4, Time elapsed: 0.262 sec
    [junit] Test org.apache.nutch.crawl.TestGenerator FAILED
    [junit] Running org.apache.nutch.crawl.TestInjector
    [junit] Tests run: 1, Failures: 0, Errors: 1, Time elapsed: 0.208 sec
    [junit] Test org.apache.nutch.crawl.TestInjector FAILED
    [junit] Running org.apache.nutch.crawl.TestLinkDbMerger
    [junit] Tests run: 1, Failures: 0, Errors: 1, Time elapsed: 0.208 sec
    [junit] Test org.apache.nutch.crawl.TestLinkDbMerger FAILED
    [junit] Running org.apache.nutch.crawl.TestSignatureFactory
    [junit] Tests run: 1, Failures: 0, Errors: 1, Time elapsed: 0.225 sec
    [junit] Test org.apache.nutch.crawl.TestSignatureFactory FAILED
    [junit] Running org.apache.nutch.fetcher.TestFetcher
    [junit] Tests run: 2, Failures: 0, Errors: 2, Time elapsed: 0.229 sec
    [junit] Test org.apache.nutch.fetcher.TestFetcher FAILED
    [junit] Running org.apache.nutch.indexer.TestIndexingFilters
    [junit] Tests run: 3, Failures: 0, Errors: 3, Time elapsed: 0.297 sec
    [junit] Test org.apache.nutch.indexer.TestIndexingFilters FAILED
    [junit] Running org.apache.nutch.metadata.TestMetadata
    [junit] Tests run: 10, Failures: 0, Errors: 0, Time elapsed: 0.114 sec
    [junit] Running org.apache.nutch.metadata.TestSpellCheckedMetadata
    [junit] Tests run: 11, Failures: 0, Errors: 0, Time elapsed: 3.126 sec
    [junit] Running org.apache.nutch.net.TestURLFilters
    [junit] Tests run: 1, Failures: 0, Errors: 1, Time elapsed: 0.216 sec
    [junit] Test org.apache.nutch.net.TestURLFilters FAILED
    [junit] Running org.apache.nutch.net.TestURLNormalizers
    [junit] Tests run: 1, Failures: 0, Errors: 1, Time elapsed: 0.214 sec
    [junit] Test org.apache.nutch.net.TestURLNormalizers FAILED
    [junit] Running org.apache.nutch.parse.TestOutlinkExtractor
    [junit] Tests run: 4, Failures: 0, Errors: 0, Time elapsed: 0.049 sec
    [junit] Running org.apache.nutch.parse.TestParseData
    [junit] Tests run: 2, Failures: 0, Errors: 0, Time elapsed: 0.028 sec
    [junit] Running org.apache.nutch.parse.TestParseText
    [junit] Tests run: 1, Failures: 0, Errors: 0, Time elapsed: 0.114 sec
    [junit] Running org.apache.nutch.parse.TestParserFactory
    [junit] Tests run: 2, Failures: 0, Errors: 2, Time elapsed: 0.248 sec
    [junit] Test org.apache.nutch.parse.TestParserFactory FAILED
    [junit] Running org.apache.nutch.plugin.TestPluginSystem
    [junit] Tests run: 7, Failures: 0, Errors: 7, Time elapsed: 0.4 sec
    [junit] Test org.apache.nutch.plugin.TestPluginSystem FAILED
    [junit] Running org.apache.nutch.protocol.TestContent
    [junit] Tests run: 2, Failures: 0, Errors: 1, Time elapsed: 0.43 sec
    [junit] Test org.apache.nutch.protocol.TestContent FAILED
    [junit] Running org.apache.nutch.protocol.TestProtocolFactory
    [junit] Tests run: 2, Failures: 0, Errors: 2, Time elapsed: 0.252 sec
    [junit] Test org.apache.nutch.protocol.TestProtocolFactory FAILED
    [junit] Running org.apache.nutch.segment.TestSegmentMerger
    [junit] Tests run: 1, Failures: 0, Errors: 1, Time elapsed: 0.214 sec
    [junit] Test org.apache.nutch.segment.TestSegmentMerger FAILED
    [junit] Running org.apache.nutch.util.TestEncodingDetector
    [junit] Tests run: 1, Failures: 0, Errors: 1, Time elapsed: 0.041 sec
    [junit] Test org.apache.nutch.util.TestEncodingDetector FAILED
    [junit] Running org.apache.nutch.util.TestGZIPUtils
    [junit] Tests run: 4, Failures: 0, Errors: 0, Time elapsed: 0.552 sec
    [junit] Running org.apache.nutch.util.TestNodeWalker
    [junit] Tests run: 1, Failures: 0, Errors: 0, Time elapsed: 0.22 sec
    [junit] Running org.apache.nutch.util.TestPrefixStringMatcher
    [junit] Tests run: 1, Failures: 0, Errors: 0, Time elapsed: 0.064 sec
    [junit] Running org.apache.nutch.util.TestStringUtil
    [junit] Tests run: 2, Failures: 0, Errors: 0, Time elapsed: 0.006 sec
    [junit] Running org.apache.nutch.util.TestSuffixStringMatcher
    [junit] Tests run: 1, Failures: 0, Errors: 0, Time elapsed: 0.062 sec
    [junit] Running org.apache.nutch.util.TestURLUtil
    [junit] Tests run: 7, Failures: 0, Errors: 0, Time elapsed: 0.713 sec

BUILD FAILED
<https://builds.apache.org/job/Nutch-trunk/ws/trunk/build.xml>:433: Tests failed!

Total time: 1 minute 5 seconds
Build step 'Invoke Ant' marked build as failure
Publishing Javadoc

Mime
View raw message