nutch-dev mailing list archives

Site index · List index
Message view « Date » · « Thread »
Top « Date » · « Thread »
From Apache Jenkins Server <jenk...@builds.apache.org>
Subject Build failed in Jenkins: Nutch-nutchgora #941
Date Wed, 05 Mar 2014 04:03:41 GMT
See <https://builds.apache.org/job/Nutch-nutchgora/941/>

------------------------------------------
[...truncated 2676 lines...]
     [copy] Copying 1 file to /home/hudson/jenkins-slave/workspace/Nutch-nutchgora/2.x/build/plugins/urlfilter-regex

copy-generated-lib:
     [copy] Copying 1 file to /home/hudson/jenkins-slave/workspace/Nutch-nutchgora/2.x/build/plugins/urlfilter-regex

init:
    [mkdir] Created dir: /home/hudson/jenkins-slave/workspace/Nutch-nutchgora/2.x/build/urlfilter-suffix
    [mkdir] Created dir: /home/hudson/jenkins-slave/workspace/Nutch-nutchgora/2.x/build/urlfilter-suffix/classes
    [mkdir] Created dir: /home/hudson/jenkins-slave/workspace/Nutch-nutchgora/2.x/build/urlfilter-suffix/test
    [mkdir] Created dir: /home/hudson/jenkins-slave/workspace/Nutch-nutchgora/2.x/build/plugins/urlfilter-suffix

init-plugin:

deps-jar:

clean-lib:

resolve-default:
[ivy:resolve] :: loading settings :: file = /home/hudson/jenkins-slave/workspace/Nutch-nutchgora/2.x/ivy/ivysettings.xml

compile:
     [echo] Compiling plugin: urlfilter-suffix
    [javac] Compiling 1 source file to /home/hudson/jenkins-slave/workspace/Nutch-nutchgora/2.x/build/urlfilter-suffix/classes
    [javac] warning: [options] bootstrap class path not set in conjunction with -source 1.6
    [javac] 1 warning

jar:
      [jar] Building jar: /home/hudson/jenkins-slave/workspace/Nutch-nutchgora/2.x/build/urlfilter-suffix/urlfilter-suffix.jar

deps-test:

deploy:
     [copy] Copying 1 file to /home/hudson/jenkins-slave/workspace/Nutch-nutchgora/2.x/build/plugins/urlfilter-suffix

copy-generated-lib:
     [copy] Copying 1 file to /home/hudson/jenkins-slave/workspace/Nutch-nutchgora/2.x/build/plugins/urlfilter-suffix

init:
    [mkdir] Created dir: /home/hudson/jenkins-slave/workspace/Nutch-nutchgora/2.x/build/urlfilter-validator
    [mkdir] Created dir: /home/hudson/jenkins-slave/workspace/Nutch-nutchgora/2.x/build/urlfilter-validator/classes
    [mkdir] Created dir: /home/hudson/jenkins-slave/workspace/Nutch-nutchgora/2.x/build/urlfilter-validator/test
    [mkdir] Created dir: /home/hudson/jenkins-slave/workspace/Nutch-nutchgora/2.x/build/plugins/urlfilter-validator

init-plugin:

deps-jar:

clean-lib:

resolve-default:
[ivy:resolve] :: loading settings :: file = /home/hudson/jenkins-slave/workspace/Nutch-nutchgora/2.x/ivy/ivysettings.xml

compile:
     [echo] Compiling plugin: urlfilter-validator
    [javac] Compiling 1 source file to /home/hudson/jenkins-slave/workspace/Nutch-nutchgora/2.x/build/urlfilter-validator/classes
    [javac] warning: [options] bootstrap class path not set in conjunction with -source 1.6
    [javac] 1 warning

jar:
      [jar] Building jar: /home/hudson/jenkins-slave/workspace/Nutch-nutchgora/2.x/build/urlfilter-validator/urlfilter-validator.jar

deps-test:

deploy:
     [copy] Copying 1 file to /home/hudson/jenkins-slave/workspace/Nutch-nutchgora/2.x/build/plugins/urlfilter-validator

copy-generated-lib:
     [copy] Copying 1 file to /home/hudson/jenkins-slave/workspace/Nutch-nutchgora/2.x/build/plugins/urlfilter-validator

init:
    [mkdir] Created dir: /home/hudson/jenkins-slave/workspace/Nutch-nutchgora/2.x/build/urlnormalizer-basic
    [mkdir] Created dir: /home/hudson/jenkins-slave/workspace/Nutch-nutchgora/2.x/build/urlnormalizer-basic/classes
    [mkdir] Created dir: /home/hudson/jenkins-slave/workspace/Nutch-nutchgora/2.x/build/urlnormalizer-basic/test
    [mkdir] Created dir: /home/hudson/jenkins-slave/workspace/Nutch-nutchgora/2.x/build/plugins/urlnormalizer-basic

init-plugin:

deps-jar:

clean-lib:

resolve-default:
[ivy:resolve] :: loading settings :: file = /home/hudson/jenkins-slave/workspace/Nutch-nutchgora/2.x/ivy/ivysettings.xml

compile:
     [echo] Compiling plugin: urlnormalizer-basic
    [javac] Compiling 1 source file to /home/hudson/jenkins-slave/workspace/Nutch-nutchgora/2.x/build/urlnormalizer-basic/classes
    [javac] warning: [options] bootstrap class path not set in conjunction with -source 1.6
    [javac] 1 warning

jar:
      [jar] Building jar: /home/hudson/jenkins-slave/workspace/Nutch-nutchgora/2.x/build/urlnormalizer-basic/urlnormalizer-basic.jar

deps-test:

deploy:
     [copy] Copying 1 file to /home/hudson/jenkins-slave/workspace/Nutch-nutchgora/2.x/build/plugins/urlnormalizer-basic

copy-generated-lib:
     [copy] Copying 1 file to /home/hudson/jenkins-slave/workspace/Nutch-nutchgora/2.x/build/plugins/urlnormalizer-basic

init:
    [mkdir] Created dir: /home/hudson/jenkins-slave/workspace/Nutch-nutchgora/2.x/build/urlnormalizer-pass
    [mkdir] Created dir: /home/hudson/jenkins-slave/workspace/Nutch-nutchgora/2.x/build/urlnormalizer-pass/classes
    [mkdir] Created dir: /home/hudson/jenkins-slave/workspace/Nutch-nutchgora/2.x/build/urlnormalizer-pass/test
    [mkdir] Created dir: /home/hudson/jenkins-slave/workspace/Nutch-nutchgora/2.x/build/plugins/urlnormalizer-pass

init-plugin:

deps-jar:

clean-lib:

resolve-default:
[ivy:resolve] :: loading settings :: file = /home/hudson/jenkins-slave/workspace/Nutch-nutchgora/2.x/ivy/ivysettings.xml

compile:
     [echo] Compiling plugin: urlnormalizer-pass
    [javac] Compiling 1 source file to /home/hudson/jenkins-slave/workspace/Nutch-nutchgora/2.x/build/urlnormalizer-pass/classes
    [javac] warning: [options] bootstrap class path not set in conjunction with -source 1.6
    [javac] 1 warning

jar:
      [jar] Building jar: /home/hudson/jenkins-slave/workspace/Nutch-nutchgora/2.x/build/urlnormalizer-pass/urlnormalizer-pass.jar

deps-test:

deploy:
     [copy] Copying 1 file to /home/hudson/jenkins-slave/workspace/Nutch-nutchgora/2.x/build/plugins/urlnormalizer-pass

copy-generated-lib:
     [copy] Copying 1 file to /home/hudson/jenkins-slave/workspace/Nutch-nutchgora/2.x/build/plugins/urlnormalizer-pass
    [mkdir] Created dir: /home/hudson/jenkins-slave/workspace/Nutch-nutchgora/2.x/build/urlnormalizer-regex/test/data
     [copy] Copying 4 files to /home/hudson/jenkins-slave/workspace/Nutch-nutchgora/2.x/build/urlnormalizer-regex/test/data

init:
    [mkdir] Created dir: /home/hudson/jenkins-slave/workspace/Nutch-nutchgora/2.x/build/urlnormalizer-regex/classes
    [mkdir] Created dir: /home/hudson/jenkins-slave/workspace/Nutch-nutchgora/2.x/build/plugins/urlnormalizer-regex

init-plugin:

deps-jar:

clean-lib:

resolve-default:
[ivy:resolve] :: loading settings :: file = /home/hudson/jenkins-slave/workspace/Nutch-nutchgora/2.x/ivy/ivysettings.xml

compile:
     [echo] Compiling plugin: urlnormalizer-regex
    [javac] Compiling 1 source file to /home/hudson/jenkins-slave/workspace/Nutch-nutchgora/2.x/build/urlnormalizer-regex/classes
    [javac] warning: [options] bootstrap class path not set in conjunction with -source 1.6
    [javac] 1 warning

jar:
      [jar] Building jar: /home/hudson/jenkins-slave/workspace/Nutch-nutchgora/2.x/build/urlnormalizer-regex/urlnormalizer-regex.jar

deps-test:

init:

init-plugin:

clean-lib:

resolve-default:
[ivy:resolve] :: loading settings :: file = /home/hudson/jenkins-slave/workspace/Nutch-nutchgora/2.x/ivy/ivysettings.xml

compile:

jar:

deps-test:

deploy:

copy-generated-lib:

deploy:
     [copy] Copying 1 file to /home/hudson/jenkins-slave/workspace/Nutch-nutchgora/2.x/build/plugins/urlnormalizer-regex

copy-generated-lib:
     [copy] Copying 1 file to /home/hudson/jenkins-slave/workspace/Nutch-nutchgora/2.x/build/plugins/urlnormalizer-regex

compile:

job:
      [jar] Building jar: /home/hudson/jenkins-slave/workspace/Nutch-nutchgora/2.x/build/apache-nutch-2.3-SNAPSHOT.job

resolve-test:

BUILD FAILED
/home/hudson/jenkins-slave/workspace/Nutch-nutchgora/2.x/build.xml:453: impossible to ivy
retrieve: java.lang.RuntimeException: problem during retrieve of org.apache.nutch#nutch: java.text.ParseException:
failed to parse report: /home/jenkins/.ivy2/cache/org.apache.nutch-nutch-test.xml: XML document
structures must start and end within the same entity.
	at org.apache.ivy.core.retrieve.RetrieveEngine.retrieve(RetrieveEngine.java:206)
	at org.apache.ivy.Ivy.retrieve(Ivy.java:540)
	at org.apache.ivy.ant.IvyRetrieve.doExecute(IvyRetrieve.java:67)
	at org.apache.ivy.ant.IvyTask.execute(IvyTask.java:277)
	at org.apache.tools.ant.UnknownElement.execute(UnknownElement.java:291)
	at sun.reflect.GeneratedMethodAccessor4.invoke(Unknown Source)
	at sun.reflect.DelegatingMethodAccessorImpl.invoke(DelegatingMethodAccessorImpl.java:43)
	at java.lang.reflect.Method.invoke(Method.java:606)
	at org.apache.tools.ant.dispatch.DispatchUtils.execute(DispatchUtils.java:106)
	at org.apache.tools.ant.Task.perform(Task.java:348)
	at org.apache.tools.ant.Target.execute(Target.java:390)
	at org.apache.tools.ant.Target.performTasks(Target.java:411)
	at org.apache.tools.ant.Project.executeSortedTargets(Project.java:1399)
	at org.apache.tools.ant.Project.executeTarget(Project.java:1368)
	at org.apache.tools.ant.helper.DefaultExecutor.executeTargets(DefaultExecutor.java:41)
	at org.apache.tools.ant.Project.executeTargets(Project.java:1251)
	at org.apache.tools.ant.Main.runBuild(Main.java:809)
	at org.apache.tools.ant.Main.startAnt(Main.java:217)
	at org.apache.tools.ant.launch.Launcher.run(Launcher.java:280)
	at org.apache.tools.ant.launch.Launcher.main(Launcher.java:109)
Caused by: java.text.ParseException: failed to parse report: /home/jenkins/.ivy2/cache/org.apache.nutch-nutch-test.xml:
XML document structures must start and end within the same entity.
	at org.apache.ivy.plugins.report.XmlReportParser.parse(XmlReportParser.java:302)
	at org.apache.ivy.core.retrieve.RetrieveEngine.determineArtifactsToCopy(RetrieveEngine.java:288)
	at org.apache.ivy.core.retrieve.RetrieveEngine.retrieve(RetrieveEngine.java:104)
	... 19 more
Caused by: org.xml.sax.SAXParseException; systemId: file:/home/jenkins/.ivy2/cache/org.apache.nutch-nutch-test.xml;
lineNumber: 999; columnNumber: 55; XML document structures must start and end within the same
entity.
	at com.sun.org.apache.xerces.internal.util.ErrorHandlerWrapper.createSAXParseException(ErrorHandlerWrapper.java:198)
	at com.sun.org.apache.xerces.internal.util.ErrorHandlerWrapper.fatalError(ErrorHandlerWrapper.java:177)
	at com.sun.org.apache.xerces.internal.impl.XMLErrorReporter.reportError(XMLErrorReporter.java:441)
	at com.sun.org.apache.xerces.internal.impl.XMLErrorReporter.reportError(XMLErrorReporter.java:368)
	at com.sun.org.apache.xerces.internal.impl.XMLScanner.reportFatalError(XMLScanner.java:1388)
	at com.sun.org.apache.xerces.internal.impl.XMLDocumentFragmentScannerImpl.endEntity(XMLDocumentFragmentScannerImpl.java:865)
	at com.sun.org.apache.xerces.internal.impl.XMLDocumentScannerImpl.endEntity(XMLDocumentScannerImpl.java:564)
	at com.sun.org.apache.xerces.internal.impl.XMLEntityManager.endEntity(XMLEntityManager.java:1356)
	at com.sun.org.apache.xerces.internal.impl.XMLEntityScanner.load(XMLEntityScanner.java:1774)
	at com.sun.org.apache.xerces.internal.impl.XMLEntityScanner.scanLiteral(XMLEntityScanner.java:1074)
	at com.sun.org.apache.xerces.internal.impl.XMLScanner.scanAttributeValue(XMLScanner.java:948)
	at com.sun.org.apache.xerces.internal.impl.XMLDocumentFragmentScannerImpl.scanAttribute(XMLDocumentFragmentScannerImpl.java:1507)
	at com.sun.org.apache.xerces.internal.impl.XMLDocumentFragmentScannerImpl.scanStartElement(XMLDocumentFragmentScannerImpl.java:1280)
	at com.sun.org.apache.xerces.internal.impl.XMLDocumentFragmentScannerImpl$FragmentContentDriver.next(XMLDocumentFragmentScannerImpl.java:2717)
	at com.sun.org.apache.xerces.internal.impl.XMLDocumentScannerImpl.next(XMLDocumentScannerImpl.java:607)
	at com.sun.org.apache.xerces.internal.impl.XMLDocumentFragmentScannerImpl.scanDocument(XMLDocumentFragmentScannerImpl.java:489)
	at com.sun.org.apache.xerces.internal.parsers.XML11Configuration.parse(XML11Configuration.java:835)
	at com.sun.org.apache.xerces.internal.parsers.XML11Configuration.parse(XML11Configuration.java:764)
	at com.sun.org.apache.xerces.internal.parsers.XMLParser.parse(XMLParser.java:123)
	at com.sun.org.apache.xerces.internal.parsers.AbstractSAXParser.parse(AbstractSAXParser.java:1210)
	at com.sun.org.apache.xerces.internal.jaxp.SAXParserImpl$JAXPSAXParser.parse(SAXParserImpl.java:568)
	at com.sun.org.apache.xerces.internal.jaxp.SAXParserImpl.parse(SAXParserImpl.java:302)
	at javax.xml.parsers.SAXParser.parse(SAXParser.java:328)
	at org.apache.ivy.plugins.report.XmlReportParser$SaxXmlReportParser.parse(XmlReportParser.java:258)
	at org.apache.ivy.plugins.report.XmlReportParser.parse(XmlReportParser.java:300)
	... 21 more

Total time: 50 seconds
Build step 'Invoke Ant' marked build as failure
Publishing Javadoc

Mime
View raw message