nutch-dev mailing list archives

Site index · List index
Message view « Date » · « Thread »
Top « Date » · « Thread »
From Apache Jenkins Server <jenk...@builds.apache.org>
Subject Build failed in Jenkins: Nutch-nutchgora #1141
Date Thu, 04 Sep 2014 04:03:09 GMT
See <https://builds.apache.org/job/Nutch-nutchgora/1141/>

------------------------------------------
[...truncated 1435 lines...]
[ivy:resolve] .. (0kB)
[ivy:resolve] 	[SUCCESSFUL ] org.apache.httpcomponents#httpmime;4.2.6!httpmime.jar (329ms)
[ivy:resolve] downloading http://repo1.maven.org/maven2/commons-codec/commons-codec/1.7/commons-codec-1.7.jar
...
[ivy:resolve] ............... (253kB)
[ivy:resolve] .. (0kB)
[ivy:resolve] 	[SUCCESSFUL ] commons-codec#commons-codec;1.7!commons-codec.jar (319ms)
[ivy:resolve] downloading http://repo1.maven.org/maven2/org/codehaus/woodstox/wstx-asl/3.2.7/wstx-asl-3.2.7.jar
...
[ivy:resolve] .............................. (508kB)
[ivy:resolve] .. (0kB)
[ivy:resolve] 	[SUCCESSFUL ] org.codehaus.woodstox#wstx-asl;3.2.7!wstx-asl.jar (422ms)
[ivy:resolve] downloading http://repo1.maven.org/maven2/com/fasterxml/jackson/core/jackson-core/2.2.3/jackson-core-2.2.3.jar
...
[ivy:resolve] ......... (188kB)
[ivy:resolve] .. (0kB)
[ivy:resolve] 	[SUCCESSFUL ] com.fasterxml.jackson.core#jackson-core;2.2.3!jackson-core.jar
(295ms)
[ivy:resolve] downloading http://repo1.maven.org/maven2/com/fasterxml/jackson/core/jackson-annotations/2.2.3/jackson-annotations-2.2.3.jar
...
[ivy:resolve] ... (32kB)
[ivy:resolve] .. (0kB)
[ivy:resolve] 	[SUCCESSFUL ] com.fasterxml.jackson.core#jackson-annotations;2.2.3!jackson-annotations.jar
(295ms)
[ivy:resolve] downloading http://repo1.maven.org/maven2/com/fasterxml/jackson/core/jackson-databind/2.2.3/jackson-databind-2.2.3.jar
...
[ivy:resolve] ..................................................... (845kB)
[ivy:resolve] .. (0kB)
[ivy:resolve] 	[SUCCESSFUL ] com.fasterxml.jackson.core#jackson-databind;2.2.3!jackson-databind.jar
(374ms)
[ivy:resolve] downloading http://repo1.maven.org/maven2/com/fasterxml/jackson/dataformat/jackson-dataformat-csv/2.2.3/jackson-dataformat-csv-2.2.3.jar
...
[ivy:resolve] .... (64kB)
[ivy:resolve] .. (0kB)
[ivy:resolve] 	[SUCCESSFUL ] com.fasterxml.jackson.dataformat#jackson-dataformat-csv;2.2.3!jackson-dataformat-csv.jar
(295ms)
[ivy:resolve] downloading http://repo1.maven.org/maven2/com/fasterxml/jackson/dataformat/jackson-dataformat-smile/2.2.3/jackson-dataformat-smile-2.2.3.jar
...
[ivy:resolve] ..... (62kB)
[ivy:resolve] .. (0kB)
[ivy:resolve] 	[SUCCESSFUL ] com.fasterxml.jackson.dataformat#jackson-dataformat-smile;2.2.3!jackson-dataformat-smile.jar
(300ms)
[ivy:resolve] downloading http://repo1.maven.org/maven2/com/fasterxml/jackson/dataformat/jackson-dataformat-xml/2.2.3/jackson-dataformat-xml-2.2.3.jar
...
[ivy:resolve] ..... (69kB)
[ivy:resolve] .. (0kB)
[ivy:resolve] 	[SUCCESSFUL ] com.fasterxml.jackson.dataformat#jackson-dataformat-xml;2.2.3!jackson-dataformat-xml.jar
(312ms)
[ivy:resolve] downloading http://repo1.maven.org/maven2/com/fasterxml/jackson/dataformat/jackson-dataformat-yaml/2.2.3/jackson-dataformat-yaml-2.2.3.jar
...
[ivy:resolve] ...................... (340kB)
[ivy:resolve] .. (0kB)
[ivy:resolve] 	[SUCCESSFUL ] com.fasterxml.jackson.dataformat#jackson-dataformat-yaml;2.2.3!jackson-dataformat-yaml.jar
(517ms)
[ivy:resolve] downloading http://repo1.maven.org/maven2/com/fasterxml/jackson/module/jackson-module-jaxb-annotations/2.2.3/jackson-module-jaxb-annotations-2.2.3.jar
...
[ivy:resolve] ... (25kB)
[ivy:resolve] .. (0kB)
[ivy:resolve] 	[SUCCESSFUL ] com.fasterxml.jackson.module#jackson-module-jaxb-annotations;2.2.3!jackson-module-jaxb-annotations.jar
(450ms)
[ivy:resolve] downloading http://repo1.maven.org/maven2/org/codehaus/woodstox/woodstox-core-asl/4.2.0/woodstox-core-asl-4.2.0.jar
...
[ivy:resolve] ......................... (470kB)
[ivy:resolve] .. (0kB)
[ivy:resolve] 	[SUCCESSFUL ] org.codehaus.woodstox#woodstox-core-asl;4.2.0!woodstox-core-asl.jar
(486ms)
[ivy:resolve] downloading http://repo1.maven.org/maven2/org/codehaus/woodstox/stax2-api/3.1.3/stax2-api-3.1.3.jar
...
[ivy:resolve] ........ (164kB)
[ivy:resolve] .. (0kB)
[ivy:resolve] 	[SUCCESSFUL ] org.codehaus.woodstox#stax2-api;3.1.3!stax2-api.jar(bundle) (351ms)
[ivy:resolve] downloading http://repo1.maven.org/maven2/org/yaml/snakeyaml/1.13/snakeyaml-1.13.jar
...
[ivy:resolve] .............. (267kB)
[ivy:resolve] .. (0kB)
[ivy:resolve] 	[SUCCESSFUL ] org.yaml#snakeyaml;1.13!snakeyaml.jar(bundle) (800ms)
[ivy:resolve] downloading http://repo1.maven.org/maven2/commons-fileupload/commons-fileupload/1.3/commons-fileupload-1.3.jar
...
[ivy:resolve] .... (67kB)
[ivy:resolve] .. (0kB)
[ivy:resolve] 	[SUCCESSFUL ] commons-fileupload#commons-fileupload;1.3!commons-fileupload.jar
(520ms)
[ivy:resolve] downloading http://repo1.maven.org/maven2/javax/mail/mail/1.4.2/mail-1.4.2.jar
...
[ivy:resolve] ........................ (424kB)
[ivy:resolve] .. (0kB)
[ivy:resolve] 	[SUCCESSFUL ] javax.mail#mail;1.4.2!mail.jar (342ms)
[ivy:resolve] downloading http://repo1.maven.org/maven2/javax/ws/rs/jsr311-api/1.1.1/jsr311-api-1.1.1.jar
...
[ivy:resolve] .... (45kB)
[ivy:resolve] .. (0kB)
[ivy:resolve] 	[SUCCESSFUL ] javax.ws.rs#jsr311-api;1.1.1!jsr311-api.jar (382ms)
[ivy:resolve] downloading http://maven.restlet.org/org/restlet/jse/org.restlet.lib.org.restlet.lib.org.json/2.0/org.restlet.lib.org.restlet.lib.org.json-2.0.jar
...
[ivy:resolve] .......... (47kB)
[ivy:resolve] .. (0kB)
[ivy:resolve] 	[SUCCESSFUL ] org.restlet.jse#org.restlet.lib.org.restlet.lib.org.json;2.0!org.restlet.lib.org.restlet.lib.org.json.jar
(1036ms)
[ivy:resolve] downloading http://repo1.maven.org/maven2/javax/servlet/javax.servlet-api/3.0.1/javax.servlet-api-3.0.1.jar
...
[ivy:resolve] .... (83kB)
[ivy:resolve] .. (0kB)
[ivy:resolve] 	[SUCCESSFUL ] javax.servlet#javax.servlet-api;3.0.1!javax.servlet-api.jar (300ms)
[ivy:resolve] downloading http://repo1.maven.org/maven2/org/apache/cxf/cxf-rt-frontend-jaxrs/2.5.2/cxf-rt-frontend-jaxrs-2.5.2.jar
...
[ivy:resolve] ........................ (588kB)
[ivy:resolve] .. (0kB)
[ivy:resolve] 	[SUCCESSFUL ] org.apache.cxf#cxf-rt-frontend-jaxrs;2.5.2!cxf-rt-frontend-jaxrs.jar
(329ms)
[ivy:resolve] downloading http://repo1.maven.org/maven2/org/apache/avro/avro/1.7.4/avro-1.7.4.jar
...
[ivy:resolve] ................. (296kB)
[ivy:resolve] .. (0kB)
[ivy:resolve] 	[SUCCESSFUL ] org.apache.avro#avro;1.7.4!avro.jar (319ms)
[ivy:resolve] downloading http://repo1.maven.org/maven2/org/apache/avro/avro-mapred/1.7.4/avro-mapred-1.7.4.jar
...
[ivy:resolve] .......... (162kB)
[ivy:resolve] .. (0kB)
[ivy:resolve] 	[SUCCESSFUL ] org.apache.avro#avro-mapred;1.7.4!avro-mapred.jar (321ms)
[ivy:resolve] downloading http://repo1.maven.org/maven2/com/google/guava/guava/13.0/guava-13.0.jar
...
[ivy:resolve] ....................................................................................................................
(1846kB)
[ivy:resolve] .. (0kB)
[ivy:resolve] 	[SUCCESSFUL ] com.google.guava#guava;13.0!guava.jar (680ms)
[ivy:resolve] downloading http://repo1.maven.org/maven2/org/apache/cxf/cxf-common-utilities/2.5.2/cxf-common-utilities-2.5.2.jar
...
[ivy:resolve] ................... (341kB)
[ivy:resolve] .. (0kB)
[ivy:resolve] 	[SUCCESSFUL ] org.apache.cxf#cxf-common-utilities;2.5.2!cxf-common-utilities.jar
(345ms)
[ivy:resolve] downloading http://repo1.maven.org/maven2/org/apache/cxf/cxf-api/2.5.2/cxf-api-2.5.2.jar
...
[ivy:resolve] ..................... (354kB)
[ivy:resolve] .. (0kB)
[ivy:resolve] 	[SUCCESSFUL ] org.apache.cxf#cxf-api;2.5.2!cxf-api.jar (346ms)
[ivy:resolve] downloading http://repo1.maven.org/maven2/org/apache/cxf/cxf-rt-core/2.5.2/cxf-rt-core-2.5.2.jar
...
[ivy:resolve] .............................. (534kB)
[ivy:resolve] .. (0kB)
[ivy:resolve] 	[SUCCESSFUL ] org.apache.cxf#cxf-rt-core;2.5.2!cxf-rt-core.jar (326ms)
[ivy:resolve] downloading http://repo1.maven.org/maven2/org/springframework/spring-core/3.0.6.RELEASE/spring-core-3.0.6.RELEASE.jar
...
[ivy:resolve] ....................... (373kB)
[ivy:resolve] .. (0kB)
[ivy:resolve] 	[SUCCESSFUL ] org.springframework#spring-core;3.0.6.RELEASE!spring-core.jar
(325ms)
[ivy:resolve] downloading http://repo1.maven.org/maven2/org/apache/cxf/cxf-rt-bindings-xml/2.5.2/cxf-rt-bindings-xml-2.5.2.jar
...
[ivy:resolve] .... (36kB)
[ivy:resolve] .. (0kB)
[ivy:resolve] 	[SUCCESSFUL ] org.apache.cxf#cxf-rt-bindings-xml;2.5.2!cxf-rt-bindings-xml.jar
(302ms)
[ivy:resolve] downloading http://repo1.maven.org/maven2/org/apache/cxf/cxf-rt-transports-http/2.5.2/cxf-rt-transports-http-2.5.2.jar
...
[ivy:resolve] ............ (205kB)
[ivy:resolve] .. (0kB)
[ivy:resolve] 	[SUCCESSFUL ] org.apache.cxf#cxf-rt-transports-http;2.5.2!cxf-rt-transports-http.jar
(300ms)
[ivy:resolve] downloading http://repo1.maven.org/maven2/org/codehaus/jettison/jettison/1.3.1/jettison-1.3.1.jar
...
[ivy:resolve] ... (74kB)
[ivy:resolve] .. (0kB)
[ivy:resolve] 	[SUCCESSFUL ] org.codehaus.jettison#jettison;1.3.1!jettison.jar(bundle) (320ms)
[ivy:resolve] downloading http://repo1.maven.org/maven2/org/apache/ws/xmlschema/xmlschema-core/2.0.1/xmlschema-core-2.0.1.jar
...
[ivy:resolve] ......... (159kB)
[ivy:resolve] .. (0kB)
[ivy:resolve] 	[SUCCESSFUL ] org.apache.ws.xmlschema#xmlschema-core;2.0.1!xmlschema-core.jar(bundle)
(314ms)
[ivy:resolve] downloading http://repo1.maven.org/maven2/org/apache/neethi/neethi/3.0.1/neethi-3.0.1.jar
...
[ivy:resolve] .... (69kB)
[ivy:resolve] .. (0kB)
[ivy:resolve] 	[SUCCESSFUL ] org.apache.neethi#neethi;3.0.1!neethi.jar(bundle) (307ms)
[ivy:resolve] downloading http://repo1.maven.org/maven2/wsdl4j/wsdl4j/1.6.2/wsdl4j-1.6.2.jar
...
[ivy:resolve] ........ (144kB)
[ivy:resolve] .. (0kB)
[ivy:resolve] 	[SUCCESSFUL ] wsdl4j#wsdl4j;1.6.2!wsdl4j.jar (299ms)
[ivy:resolve] downloading http://repo1.maven.org/maven2/org/apache/geronimo/specs/geronimo-javamail_1.4_spec/1.7.1/geronimo-javamail_1.4_spec-1.7.1.jar
...
[ivy:resolve] ............ (218kB)
[ivy:resolve] .. (0kB)
[ivy:resolve] 	[SUCCESSFUL ] org.apache.geronimo.specs#geronimo-javamail_1.4_spec;1.7.1!geronimo-javamail_1.4_spec.jar(bundle)
(305ms)
[ivy:resolve] downloading http://repo1.maven.org/maven2/org/springframework/spring-asm/3.0.6.RELEASE/spring-asm-3.0.6.RELEASE.jar
...
[ivy:resolve] .... (51kB)
[ivy:resolve] .. (0kB)
[ivy:resolve] 	[SUCCESSFUL ] org.springframework#spring-asm;3.0.6.RELEASE!spring-asm.jar (304ms)
[ivy:resolve] downloading http://repo1.maven.org/maven2/org/apache/cxf/cxf-rt-transports-common/2.5.2/cxf-rt-transports-common-2.5.2.jar
...
[ivy:resolve] ... (17kB)
[ivy:resolve] .. (0kB)
[ivy:resolve] 	[SUCCESSFUL ] org.apache.cxf#cxf-rt-transports-common;2.5.2!cxf-rt-transports-common.jar
(306ms)
[ivy:resolve] downloading http://repo1.maven.org/maven2/org/springframework/spring-web/3.0.6.RELEASE/spring-web-3.0.6.RELEASE.jar
...
[ivy:resolve] .................. (388kB)
[ivy:resolve] .. (0kB)
[ivy:resolve] 	[SUCCESSFUL ] org.springframework#spring-web;3.0.6.RELEASE!spring-web.jar (398ms)
[ivy:resolve] downloading http://repo1.maven.org/maven2/aopalliance/aopalliance/1.0/aopalliance-1.0.jar
...
[ivy:resolve] .. (4kB)
[ivy:resolve] .. (0kB)
[ivy:resolve] 	[SUCCESSFUL ] aopalliance#aopalliance;1.0!aopalliance.jar (296ms)
[ivy:resolve] downloading http://repo1.maven.org/maven2/org/springframework/spring-beans/3.0.6.RELEASE/spring-beans-3.0.6.RELEASE.jar
...
[ivy:resolve] .................................. (543kB)
[ivy:resolve] .. (0kB)
[ivy:resolve] 	[SUCCESSFUL ] org.springframework#spring-beans;3.0.6.RELEASE!spring-beans.jar
(355ms)
[ivy:resolve] downloading http://repo1.maven.org/maven2/org/springframework/spring-context/3.0.6.RELEASE/spring-context-3.0.6.RELEASE.jar
...
[ivy:resolve] .......................................... (654kB)
[ivy:resolve] .. (0kB)
[ivy:resolve] 	[SUCCESSFUL ] org.springframework#spring-context;3.0.6.RELEASE!spring-context.jar
(402ms)
[ivy:resolve] downloading http://repo1.maven.org/maven2/org/springframework/spring-aop/3.0.6.RELEASE/spring-aop-3.0.6.RELEASE.jar
...
[ivy:resolve] ................... (313kB)
[ivy:resolve] .. (0kB)
[ivy:resolve] 	[SUCCESSFUL ] org.springframework#spring-aop;3.0.6.RELEASE!spring-aop.jar (319ms)
[ivy:resolve] downloading http://repo1.maven.org/maven2/org/springframework/spring-expression/3.0.6.RELEASE/spring-expression-3.0.6.RELEASE.jar
...
[ivy:resolve] ........ (165kB)
[ivy:resolve] .. (0kB)
[ivy:resolve] 	[SUCCESSFUL ] org.springframework#spring-expression;3.0.6.RELEASE!spring-expression.jar
(295ms)
[ivy:resolve] downloading http://repo1.maven.org/maven2/org/xerial/snappy/snappy-java/1.0.4.1/snappy-java-1.0.4.1.jar
...
[ivy:resolve] ............................................................... (972kB)
[ivy:resolve] .. (0kB)
[ivy:resolve] 	[SUCCESSFUL ] org.xerial.snappy#snappy-java;1.0.4.1!snappy-java.jar(bundle)
(394ms)
[ivy:resolve] downloading http://repo1.maven.org/maven2/org/apache/avro/avro-ipc/1.7.4/avro-ipc-1.7.4.jar
...
[ivy:resolve] ........... (183kB)
[ivy:resolve] .. (0kB)
[ivy:resolve] 	[SUCCESSFUL ] org.apache.avro#avro-ipc;1.7.4!avro-ipc.jar (293ms)
[ivy:resolve] downloading http://repo1.maven.org/maven2/com/googlecode/juniversalchardet/juniversalchardet/1.0.3/juniversalchardet-1.0.3.jar
...
[ivy:resolve] .......... (215kB)
[ivy:resolve] .. (0kB)
[ivy:resolve] 	[SUCCESSFUL ] com.googlecode.juniversalchardet#juniversalchardet;1.0.3!juniversalchardet.jar
(373ms)
[ivy:resolve] downloading http://repo1.maven.org/maven2/xalan/serializer/2.7.1/serializer-2.7.1.jar
...
[ivy:resolve] ................ (271kB)
[ivy:resolve] .. (0kB)
[ivy:resolve] 	[SUCCESSFUL ] xalan#serializer;2.7.1!serializer.jar (318ms)
[ivy:resolve] downloading http://repo1.maven.org/maven2/org/mortbay/jetty/jetty-client/6.1.26/jetty-client-6.1.26.jar
...
[ivy:resolve] ..... (68kB)
[ivy:resolve] .. (0kB)
[ivy:resolve] 	[SUCCESSFUL ] org.mortbay.jetty#jetty-client;6.1.26!jetty-client.jar (500ms)
[ivy:resolve] downloading http://repo1.maven.org/maven2/org/mortbay/jetty/jetty-sslengine/6.1.26/jetty-sslengine-6.1.26.jar
...
[ivy:resolve] .. (18kB)
[ivy:resolve] .. (0kB)
[ivy:resolve] 	[SUCCESSFUL ] org.mortbay.jetty#jetty-sslengine;6.1.26!jetty-sslengine.jar
(295ms)
[ivy:resolve] downloading http://repo1.maven.org/maven2/org/mortbay/jetty/jetty-util5/6.1.26/jetty-util5-6.1.26.jar
...
[ivy:resolve] .. (22kB)
[ivy:resolve] .. (0kB)
[ivy:resolve] 	[SUCCESSFUL ] org.mortbay.jetty#jetty-util5;6.1.26!jetty-util5.jar (310ms)
[ivy:resolve] 
[ivy:resolve] :: problems summary ::
[ivy:resolve] :::: WARNINGS
[ivy:resolve] 		[FAILED     ] org.mortbay.jetty#jetty;6.1.26!jetty.zip:  (0ms)
[ivy:resolve] 	==== local: tried
[ivy:resolve] 	  /home/jenkins/.ivy2/local/org.mortbay.jetty/jetty/6.1.26/zips/jetty.zip
[ivy:resolve] 	==== maven2: tried
[ivy:resolve] 	  http://repo1.maven.org/maven2/org/mortbay/jetty/jetty/6.1.26/jetty-6.1.26.zip
[ivy:resolve] 	==== sonatype: tried
[ivy:resolve] 	  http://oss.sonatype.org/content/repositories/releases/org/mortbay/jetty/jetty/6.1.26/jetty-6.1.26.zip
[ivy:resolve] 	==== apache-snapshot: tried
[ivy:resolve] 	  https://repository.apache.org/content/repositories/snapshots/org/mortbay/jetty/jetty/6.1.26/jetty-6.1.26.zip
[ivy:resolve] 		::::::::::::::::::::::::::::::::::::::::::::::
[ivy:resolve] 		::              FAILED DOWNLOADS            ::
[ivy:resolve] 		:: ^ see resolution messages for details  ^ ::
[ivy:resolve] 		::::::::::::::::::::::::::::::::::::::::::::::
[ivy:resolve] 		:: org.mortbay.jetty#jetty;6.1.26!jetty.zip
[ivy:resolve] 		::::::::::::::::::::::::::::::::::::::::::::::
[ivy:resolve] :::: ERRORS
[ivy:resolve] 	unknown resolver fs
[ivy:resolve] 	unknown resolver fs
[ivy:resolve] 	unknown resolver fs
[ivy:resolve] 	unknown resolver fs
[ivy:resolve] 	unknown resolver fs
[ivy:resolve] 	unknown resolver fs
[ivy:resolve] 	unknown resolver fs
[ivy:resolve] 	unknown resolver fs
[ivy:resolve] 	unknown resolver fs
[ivy:resolve] 	unknown resolver fs
[ivy:resolve] 	unknown resolver fs
[ivy:resolve] 	unknown resolver fs
[ivy:resolve] 	unknown resolver fs
[ivy:resolve] 	unknown resolver fs
[ivy:resolve] 	unknown resolver fs
[ivy:resolve] 	unknown resolver fs
[ivy:resolve] 	unknown resolver fs
[ivy:resolve] 	unknown resolver fs
[ivy:resolve] 	unknown resolver fs
[ivy:resolve] 	unknown resolver fs
[ivy:resolve] 	unknown resolver fs
[ivy:resolve] 	unknown resolver fs
[ivy:resolve] 	unknown resolver fs
[ivy:resolve] 	unknown resolver fs
[ivy:resolve] 	unknown resolver fs
[ivy:resolve] 	unknown resolver fs
[ivy:resolve] 
[ivy:resolve] :: USE VERBOSE OR DEBUG MESSAGE LEVEL FOR MORE DETAILS

BUILD FAILED
<https://builds.apache.org/job/Nutch-nutchgora/ws/2.x/build.xml>:462: impossible to
resolve dependencies:
	resolve failed - see output for details

Total time: 1 minute 25 seconds
Build step 'Invoke Ant' marked build as failure
Publishing Javadoc

Mime
View raw message