nutch-dev mailing list archives

Site index · List index
Message view « Date » · « Thread »
Top « Date » · « Thread »
From Apache Jenkins Server <jenk...@builds.apache.org>
Subject Build failed in Jenkins: Nutch-trunk #3238
Date Mon, 03 Aug 2015 00:50:26 GMT
See <https://builds.apache.org/job/Nutch-trunk/3238/changes>

Changes:

[mattmann] Fix for NUTCH-2066: Parameterize Generate REST endpoint contributed by Sujen Shah
<sujen1412@gmail.com> this closes #47.

------------------------------------------
[...truncated 4272 lines...]
     [copy] Copying 1 file to <https://builds.apache.org/job/Nutch-trunk/ws/trunk/build/plugins/urlnormalizer-host>

copy-generated-lib:
     [copy] Copying 1 file to <https://builds.apache.org/job/Nutch-trunk/ws/trunk/build/plugins/urlnormalizer-host>

init:
    [mkdir] Created dir: <https://builds.apache.org/job/Nutch-trunk/ws/trunk/build/urlnormalizer-pass>
    [mkdir] Created dir: <https://builds.apache.org/job/Nutch-trunk/ws/trunk/build/urlnormalizer-pass/classes>
    [mkdir] Created dir: <https://builds.apache.org/job/Nutch-trunk/ws/trunk/build/urlnormalizer-pass/test>
    [mkdir] Created dir: <https://builds.apache.org/job/Nutch-trunk/ws/trunk/build/urlnormalizer-pass/test/lib>
    [mkdir] Created dir: <https://builds.apache.org/job/Nutch-trunk/ws/trunk/build/plugins/urlnormalizer-pass>

init-plugin:

deps-jar:

clean-lib:

resolve-default:
[ivy:resolve] :: loading settings :: file = <https://builds.apache.org/job/Nutch-trunk/ws/trunk/ivy/ivysettings.xml>

compile:
     [echo] Compiling plugin: urlnormalizer-pass
    [javac] Compiling 2 source files to <https://builds.apache.org/job/Nutch-trunk/ws/trunk/build/urlnormalizer-pass/classes>
    [javac] Creating empty <https://builds.apache.org/job/Nutch-trunk/ws/trunk/build/urlnormalizer-pass/classes/org/apache/nutch/net/urlnormalizer/pass/package-info.class>

jar:
      [jar] Building jar: <https://builds.apache.org/job/Nutch-trunk/ws/trunk/build/urlnormalizer-pass/urlnormalizer-pass.jar>

deps-test:

deploy:
     [copy] Copying 1 file to <https://builds.apache.org/job/Nutch-trunk/ws/trunk/build/plugins/urlnormalizer-pass>

copy-generated-lib:
     [copy] Copying 1 file to <https://builds.apache.org/job/Nutch-trunk/ws/trunk/build/plugins/urlnormalizer-pass>

init:
    [mkdir] Created dir: <https://builds.apache.org/job/Nutch-trunk/ws/trunk/build/urlnormalizer-querystring>
    [mkdir] Created dir: <https://builds.apache.org/job/Nutch-trunk/ws/trunk/build/urlnormalizer-querystring/classes>
    [mkdir] Created dir: <https://builds.apache.org/job/Nutch-trunk/ws/trunk/build/urlnormalizer-querystring/test>
    [mkdir] Created dir: <https://builds.apache.org/job/Nutch-trunk/ws/trunk/build/urlnormalizer-querystring/test/lib>
    [mkdir] Created dir: <https://builds.apache.org/job/Nutch-trunk/ws/trunk/build/plugins/urlnormalizer-querystring>

init-plugin:

deps-jar:

clean-lib:

resolve-default:
[ivy:resolve] :: loading settings :: file = <https://builds.apache.org/job/Nutch-trunk/ws/trunk/ivy/ivysettings.xml>

compile:
     [echo] Compiling plugin: urlnormalizer-querystring
    [javac] Compiling 2 source files to <https://builds.apache.org/job/Nutch-trunk/ws/trunk/build/urlnormalizer-querystring/classes>
    [javac] Creating empty <https://builds.apache.org/job/Nutch-trunk/ws/trunk/build/urlnormalizer-querystring/classes/org/apache/nutch/net/urlnormalizer/querystring/package-info.class>

jar:
      [jar] Building jar: <https://builds.apache.org/job/Nutch-trunk/ws/trunk/build/urlnormalizer-querystring/urlnormalizer-querystring.jar>

deps-test:

deploy:
     [copy] Copying 1 file to <https://builds.apache.org/job/Nutch-trunk/ws/trunk/build/plugins/urlnormalizer-querystring>

copy-generated-lib:
     [copy] Copying 1 file to <https://builds.apache.org/job/Nutch-trunk/ws/trunk/build/plugins/urlnormalizer-querystring>
    [mkdir] Created dir: <https://builds.apache.org/job/Nutch-trunk/ws/trunk/build/urlnormalizer-regex/test/data>
     [copy] Copying 4 files to <https://builds.apache.org/job/Nutch-trunk/ws/trunk/build/urlnormalizer-regex/test/data>

init:
    [mkdir] Created dir: <https://builds.apache.org/job/Nutch-trunk/ws/trunk/build/urlnormalizer-regex/classes>
    [mkdir] Created dir: <https://builds.apache.org/job/Nutch-trunk/ws/trunk/build/urlnormalizer-regex/test/lib>
    [mkdir] Created dir: <https://builds.apache.org/job/Nutch-trunk/ws/trunk/build/plugins/urlnormalizer-regex>

init-plugin:

deps-jar:

clean-lib:

resolve-default:
[ivy:resolve] :: loading settings :: file = <https://builds.apache.org/job/Nutch-trunk/ws/trunk/ivy/ivysettings.xml>

compile:
     [echo] Compiling plugin: urlnormalizer-regex
    [javac] Compiling 2 source files to <https://builds.apache.org/job/Nutch-trunk/ws/trunk/build/urlnormalizer-regex/classes>
    [javac] Creating empty <https://builds.apache.org/job/Nutch-trunk/ws/trunk/build/urlnormalizer-regex/classes/org/apache/nutch/net/urlnormalizer/regex/package-info.class>

jar:
      [jar] Building jar: <https://builds.apache.org/job/Nutch-trunk/ws/trunk/build/urlnormalizer-regex/urlnormalizer-regex.jar>

deps-test:

init:

init-plugin:

clean-lib:

resolve-default:
[ivy:resolve] :: loading settings :: file = <https://builds.apache.org/job/Nutch-trunk/ws/trunk/ivy/ivysettings.xml>

compile:

jar:

deps-test:

deploy:

copy-generated-lib:

deploy:
     [copy] Copying 1 file to <https://builds.apache.org/job/Nutch-trunk/ws/trunk/build/plugins/urlnormalizer-regex>

copy-generated-lib:
     [copy] Copying 1 file to <https://builds.apache.org/job/Nutch-trunk/ws/trunk/build/plugins/urlnormalizer-regex>
    [mkdir] Created dir: <https://builds.apache.org/job/Nutch-trunk/ws/trunk/build/urlnormalizer-slash/test/data>
     [copy] Copying 1 file to <https://builds.apache.org/job/Nutch-trunk/ws/trunk/build/urlnormalizer-slash/test/data>

init:
    [mkdir] Created dir: <https://builds.apache.org/job/Nutch-trunk/ws/trunk/build/urlnormalizer-slash/classes>
    [mkdir] Created dir: <https://builds.apache.org/job/Nutch-trunk/ws/trunk/build/urlnormalizer-slash/test/lib>
    [mkdir] Created dir: <https://builds.apache.org/job/Nutch-trunk/ws/trunk/build/plugins/urlnormalizer-slash>

init-plugin:

deps-jar:

clean-lib:

resolve-default:
[ivy:resolve] :: loading settings :: file = <https://builds.apache.org/job/Nutch-trunk/ws/trunk/ivy/ivysettings.xml>

compile:
     [echo] Compiling plugin: urlnormalizer-slash
    [javac] Compiling 1 source file to <https://builds.apache.org/job/Nutch-trunk/ws/trunk/build/urlnormalizer-slash/classes>

jar:
      [jar] Building jar: <https://builds.apache.org/job/Nutch-trunk/ws/trunk/build/urlnormalizer-slash/urlnormalizer-slash.jar>

deps-test:

deploy:
     [copy] Copying 1 file to <https://builds.apache.org/job/Nutch-trunk/ws/trunk/build/plugins/urlnormalizer-slash>

copy-generated-lib:
     [copy] Copying 1 file to <https://builds.apache.org/job/Nutch-trunk/ws/trunk/build/plugins/urlnormalizer-slash>

compile:

job:
      [jar] Building jar: <https://builds.apache.org/job/Nutch-trunk/ws/trunk/build/apache-nutch-1.11-SNAPSHOT.job>

test-core:
    [mkdir] Created dir: <https://builds.apache.org/job/Nutch-trunk/ws/trunk/build/test/data>
     [copy] Copying 48 files to <https://builds.apache.org/job/Nutch-trunk/ws/trunk/build/test/data>
     [copy] Copying 1 file to <https://builds.apache.org/job/Nutch-trunk/ws/trunk/build/test/classes>
     [copy] Copying 1 file to <https://builds.apache.org/job/Nutch-trunk/ws/trunk/build/test/classes>
     [copy] Copying 1 file to <https://builds.apache.org/job/Nutch-trunk/ws/trunk/build/test/classes>
     [copy] Copying 1 file to <https://builds.apache.org/job/Nutch-trunk/ws/trunk/build/test/classes>
     [copy] Copying 1 file to <https://builds.apache.org/job/Nutch-trunk/ws/trunk/build/test/classes>
    [junit] WARNING: multiple versions of ant detected in path for junit 
    [junit]          jar:file:/home/jenkins/tools/ant/latest/lib/ant.jar!/org/apache/tools/ant/Project.class
    [junit]      and jar:<https://builds.apache.org/job/Nutch-trunk/ws/trunk/build/test/lib/ant-1.6.5.jar!/org/apache/tools/ant/Project.class>
    [junit] Running org.apache.nutch.crawl.TestAdaptiveFetchSchedule
    [junit] Tests run: 1, Failures: 0, Errors: 0, Skipped: 0, Time elapsed: 0.285 sec
    [junit] Running org.apache.nutch.crawl.TestCrawlDbFilter
    [junit] Tests run: 1, Failures: 0, Errors: 0, Skipped: 0, Time elapsed: 2.697 sec
    [junit] Running org.apache.nutch.crawl.TestCrawlDbMerger
    [junit] Tests run: 1, Failures: 0, Errors: 0, Skipped: 0, Time elapsed: 2.657 sec
    [junit] Running org.apache.nutch.crawl.TestCrawlDbStates
    [junit] Tests run: 6, Failures: 0, Errors: 0, Skipped: 0, Time elapsed: 3.405 sec
    [junit] Running org.apache.nutch.crawl.TestGenerator
    [junit] Tests run: 4, Failures: 0, Errors: 0, Skipped: 0, Time elapsed: 38.192 sec
    [junit] Running org.apache.nutch.crawl.TestInjector
    [junit] Tests run: 1, Failures: 0, Errors: 0, Skipped: 0, Time elapsed: 6.429 sec
    [junit] Running org.apache.nutch.crawl.TestLinkDbMerger
    [junit] Tests run: 1, Failures: 0, Errors: 0, Skipped: 0, Time elapsed: 2.78 sec
    [junit] Running org.apache.nutch.crawl.TestSignatureFactory
    [junit] Tests run: 1, Failures: 0, Errors: 0, Skipped: 0, Time elapsed: 0.268 sec
    [junit] Running org.apache.nutch.fetcher.TestFetcher
    [junit] Tests run: 2, Failures: 0, Errors: 2, Skipped: 0, Time elapsed: 0.826 sec
    [junit] Test org.apache.nutch.fetcher.TestFetcher FAILED
    [junit] Running org.apache.nutch.indexer.TestIndexingFilters
    [junit] Tests run: 3, Failures: 0, Errors: 0, Skipped: 0, Time elapsed: 0.774 sec
    [junit] Running org.apache.nutch.metadata.TestMetadata
    [junit] Tests run: 10, Failures: 0, Errors: 0, Skipped: 0, Time elapsed: 0.152 sec
    [junit] Running org.apache.nutch.metadata.TestSpellCheckedMetadata
    [junit] Tests run: 11, Failures: 0, Errors: 0, Skipped: 0, Time elapsed: 3.146 sec
    [junit] Running org.apache.nutch.net.TestURLFilters
    [junit] Tests run: 1, Failures: 0, Errors: 0, Skipped: 0, Time elapsed: 0.679 sec
    [junit] Running org.apache.nutch.net.TestURLNormalizers
    [junit] Tests run: 1, Failures: 0, Errors: 0, Skipped: 0, Time elapsed: 0.48 sec
    [junit] Running org.apache.nutch.parse.TestOutlinkExtractor
    [junit] Tests run: 4, Failures: 0, Errors: 0, Skipped: 0, Time elapsed: 0.065 sec
    [junit] Running org.apache.nutch.parse.TestParseData
    [junit] Tests run: 2, Failures: 0, Errors: 0, Skipped: 0, Time elapsed: 0.166 sec
    [junit] Running org.apache.nutch.parse.TestParseText
    [junit] Tests run: 1, Failures: 0, Errors: 0, Skipped: 0, Time elapsed: 0.151 sec
    [junit] Running org.apache.nutch.parse.TestParserFactory
    [junit] Tests run: 2, Failures: 0, Errors: 0, Skipped: 0, Time elapsed: 13.555 sec
    [junit] Running org.apache.nutch.plugin.TestPluginSystem
    [junit] Tests run: 7, Failures: 0, Errors: 0, Skipped: 0, Time elapsed: 1.459 sec
    [junit] Running org.apache.nutch.protocol.TestContent
    [junit] Tests run: 2, Failures: 0, Errors: 0, Skipped: 0, Time elapsed: 0.589 sec
    [junit] Running org.apache.nutch.protocol.TestProtocolFactory
    [junit] Tests run: 2, Failures: 0, Errors: 0, Skipped: 0, Time elapsed: 0.69 sec
    [junit] Running org.apache.nutch.segment.TestSegmentMerger
    [junit] Tests run: 1, Failures: 0, Errors: 0, Skipped: 0, Time elapsed: 140.685 sec
    [junit] Running org.apache.nutch.segment.TestSegmentMergerCrawlDatums
    [junit] Tests run: 7, Failures: 0, Errors: 0, Skipped: 0, Time elapsed: 104.718 sec
    [junit] Running org.apache.nutch.tools.TestCommonCrawlDataDumper
    [junit] Tests run: 1, Failures: 0, Errors: 0, Skipped: 0, Time elapsed: 1.519 sec
    [junit] Running org.apache.nutch.util.TestEncodingDetector
    [junit] Tests run: 1, Failures: 0, Errors: 0, Skipped: 0, Time elapsed: 0.626 sec
    [junit] Running org.apache.nutch.util.TestGZIPUtils
    [junit] Tests run: 3, Failures: 0, Errors: 0, Skipped: 0, Time elapsed: 0.406 sec
    [junit] Running org.apache.nutch.util.TestMimeUtil
    [junit] Tests run: 4, Failures: 0, Errors: 0, Skipped: 0, Time elapsed: 1.453 sec
    [junit] Running org.apache.nutch.util.TestNodeWalker
    [junit] Tests run: 1, Failures: 0, Errors: 0, Skipped: 0, Time elapsed: 0.236 sec
    [junit] Running org.apache.nutch.util.TestPrefixStringMatcher
    [junit] Tests run: 1, Failures: 0, Errors: 0, Skipped: 0, Time elapsed: 0.118 sec
    [junit] Running org.apache.nutch.util.TestStringUtil
    [junit] Tests run: 1, Failures: 0, Errors: 0, Skipped: 0, Time elapsed: 0.062 sec
    [junit] Running org.apache.nutch.util.TestSuffixStringMatcher
    [junit] Tests run: 1, Failures: 0, Errors: 0, Skipped: 0, Time elapsed: 0.12 sec
    [junit] Running org.apache.nutch.util.TestURLUtil
    [junit] Tests run: 8, Failures: 0, Errors: 0, Skipped: 0, Time elapsed: 0.635 sec

BUILD FAILED
<https://builds.apache.org/job/Nutch-trunk/ws/trunk/build.xml>:462: Tests failed!

Total time: 6 minutes 20 seconds
Build step 'Invoke Ant' marked build as failure
Publishing Javadoc
[xUnit] [INFO] - Starting to record.
[xUnit] [INFO] - Processing JUnit
[xUnit] [INFO] - [JUnit] - 32 test report file(s) were found with the pattern 'trunk/build/test/TEST-*.xml'
relative to '<https://builds.apache.org/job/Nutch-trunk/ws/'> for the testing framework
'JUnit'.
[xUnit] [INFO] - Processing JUnit
[xUnit] [INFO] - [JUnit] - 32 test report file(s) were found with the pattern 'trunk/build/**/test/TEST-*.xml'
relative to '<https://builds.apache.org/job/Nutch-trunk/ws/'> for the testing framework
'JUnit'.
[xUnit] [INFO] - Check 'Failed Tests' threshold.
[xUnit] [INFO] - Check 'Skipped Tests' threshold.
[xUnit] [INFO] - Setting the build status to FAILURE
[xUnit] [INFO] - Stopping recording.
Updating NUTCH-2066

Mime
View raw message