nutch-dev mailing list archives

Site index · List index
Message view « Date » · « Thread »
Top « Date » · « Thread »
From Apache Jenkins Server <jenk...@builds.apache.org>
Subject Build failed in Jenkins: Nutch-trunk #3253
Date Fri, 14 Aug 2015 04:09:21 GMT
See <https://builds.apache.org/job/Nutch-trunk/3253/>

------------------------------------------
[...truncated 13849 lines...]
resolve-default:
[ivy:resolve] :: loading settings :: file = <https://builds.apache.org/job/Nutch-trunk/ws/trunk/ivy/ivysettings.xml>

compile:
     [echo] Compiling plugin: urlnormalizer-host

deps-test-compile:

compile-test:

jar:

deps-test:

deploy:

copy-generated-lib:

test:
     [echo] Testing plugin: urlnormalizer-host
    [junit] WARNING: multiple versions of ant detected in path for junit 
    [junit]          jar:file:/home/jenkins/tools/ant/latest/lib/ant.jar!/org/apache/tools/ant/Project.class
    [junit]      and jar:<https://builds.apache.org/job/Nutch-trunk/ws/trunk/build/test/lib/ant-1.6.5.jar!/org/apache/tools/ant/Project.class>
    [junit] Running org.apache.nutch.tika.TestRTFParser
    [junit] Tests run: 1, Failures: 0, Errors: 0, Skipped: 1, Time elapsed: 0.059 sec
    [junit] Running org.apache.nutch.net.urlnormalizer.host.TestHostURLNormalizer
    [junit] Tests run: 1, Failures: 0, Errors: 0, Skipped: 0, Time elapsed: 0.455 sec

init:

init-plugin:

deps-jar:

clean-lib:

resolve-default:
[ivy:resolve] :: loading settings :: file = <https://builds.apache.org/job/Nutch-trunk/ws/trunk/ivy/ivysettings.xml>

compile:
     [echo] Compiling plugin: urlnormalizer-pass

deps-test-compile:

compile-test:

jar:

deps-test:

deploy:

copy-generated-lib:

test:
     [echo] Testing plugin: urlnormalizer-pass
    [junit] Running org.apache.nutch.tika.TestRobotsMetaProcessor
    [junit] WARNING: multiple versions of ant detected in path for junit 
    [junit]          jar:file:/home/jenkins/tools/ant/latest/lib/ant.jar!/org/apache/tools/ant/Project.class
    [junit]      and jar:<https://builds.apache.org/job/Nutch-trunk/ws/trunk/build/test/lib/ant-1.6.5.jar!/org/apache/tools/ant/Project.class>
    [junit] Running org.apache.nutch.net.urlnormalizer.pass.TestPassURLNormalizer
    [junit] Tests run: 1, Failures: 0, Errors: 0, Skipped: 0, Time elapsed: 0.2 sec

init:

init-plugin:

deps-jar:

clean-lib:

resolve-default:
[ivy:resolve] :: loading settings :: file = <https://builds.apache.org/job/Nutch-trunk/ws/trunk/ivy/ivysettings.xml>

compile:
     [echo] Compiling plugin: urlnormalizer-querystring

deps-test-compile:

compile-test:

jar:

deps-test:

deploy:

copy-generated-lib:

test:
     [echo] Testing plugin: urlnormalizer-querystring
    [junit] WARNING: multiple versions of ant detected in path for junit 
    [junit]          jar:file:/home/jenkins/tools/ant/latest/lib/ant.jar!/org/apache/tools/ant/Project.class
    [junit]      and jar:<https://builds.apache.org/job/Nutch-trunk/ws/trunk/build/test/lib/ant-1.6.5.jar!/org/apache/tools/ant/Project.class>
    [junit] Tests run: 1, Failures: 0, Errors: 0, Skipped: 0, Time elapsed: 1.012 sec

init:

init-plugin:

deps-jar:

clean-lib:

resolve-default:
[ivy:resolve] :: loading settings :: file = <https://builds.apache.org/job/Nutch-trunk/ws/trunk/ivy/ivysettings.xml>

compile:
     [echo] Compiling plugin: urlnormalizer-regex

deps-test-compile:

compile-test:

jar:

deps-test:

init:

init-plugin:

clean-lib:

resolve-default:
[ivy:resolve] :: loading settings :: file = <https://builds.apache.org/job/Nutch-trunk/ws/trunk/ivy/ivysettings.xml>

compile:

jar:

deps-test:

deploy:
    [junit] Running org.apache.nutch.net.urlnormalizer.querystring.TestQuerystringURLNormalizer

copy-generated-lib:

deploy:

copy-generated-lib:

test:
     [echo] Testing plugin: urlnormalizer-regex
    [junit] WARNING: multiple versions of ant detected in path for junit 
    [junit]          jar:file:/home/jenkins/tools/ant/latest/lib/ant.jar!/org/apache/tools/ant/Project.class
    [junit]      and jar:<https://builds.apache.org/job/Nutch-trunk/ws/trunk/build/test/lib/ant-1.6.5.jar!/org/apache/tools/ant/Project.class>
    [junit] Tests run: 1, Failures: 0, Errors: 0, Skipped: 0, Time elapsed: 0.233 sec

init:

init-plugin:

deps-jar:

clean-lib:

resolve-default:
[ivy:resolve] :: loading settings :: file = <https://builds.apache.org/job/Nutch-trunk/ws/trunk/ivy/ivysettings.xml>

compile:
     [echo] Compiling plugin: urlnormalizer-slash

deps-test-compile:

compile-test:

jar:

deps-test:

deploy:

copy-generated-lib:

test:
     [echo] Testing plugin: urlnormalizer-slash
    [junit] WARNING: multiple versions of ant detected in path for junit 
    [junit]          jar:file:/home/jenkins/tools/ant/latest/lib/ant.jar!/org/apache/tools/ant/Project.class
    [junit]      and jar:<https://builds.apache.org/job/Nutch-trunk/ws/trunk/build/test/lib/ant-1.6.5.jar!/org/apache/tools/ant/Project.class>
    [junit] Running org.apache.nutch.net.urlnormalizer.regex.TestRegexURLNormalizer
    [junit] Running org.apache.nutch.net.urlnormalizer.slash.TestSlashURLNormalizer
    [junit] Tests run: 2, Failures: 0, Errors: 0, Skipped: 0, Time elapsed: 0.329 sec
    [junit] Tests run: 1, Failures: 0, Errors: 0, Skipped: 0, Time elapsed: 0.462 sec

BUILD SUCCESSFUL
Total time: 8 minutes 23 seconds
[xUnit] [INFO] - Starting to record.
[xUnit] [INFO] - Processing JUnit
[xUnit] [INFO] - [JUnit] - 32 test report file(s) were found with the pattern 'trunk/build/test/TEST-*.xml'
relative to '<https://builds.apache.org/job/Nutch-trunk/ws/'> for the testing framework
'JUnit'.
[xUnit] [ERROR] - Test reports were found but not all of them are new. Did all the tests run?
  * <https://builds.apache.org/job/Nutch-trunk/ws/trunk/build/test/TEST-org.apache.nutch.crawl.TestAdaptiveFetchSchedule.xml>
is 4 min 6 sec old
  * <https://builds.apache.org/job/Nutch-trunk/ws/trunk/build/test/TEST-org.apache.nutch.crawl.TestCrawlDbFilter.xml>
is 4 min 3 sec old
  * <https://builds.apache.org/job/Nutch-trunk/ws/trunk/build/test/TEST-org.apache.nutch.crawl.TestCrawlDbMerger.xml>
is 4 min 0 sec old
  * <https://builds.apache.org/job/Nutch-trunk/ws/trunk/build/test/TEST-org.apache.nutch.crawl.TestCrawlDbStates.xml>
is 3 min 56 sec old
  * <https://builds.apache.org/job/Nutch-trunk/ws/trunk/build/test/TEST-org.apache.nutch.crawl.TestGenerator.xml>
is 3 min 16 sec old
  * <https://builds.apache.org/job/Nutch-trunk/ws/trunk/build/test/TEST-org.apache.nutch.crawl.TestInjector.xml>
is 3 min 9 sec old
  * <https://builds.apache.org/job/Nutch-trunk/ws/trunk/build/test/TEST-org.apache.nutch.crawl.TestLinkDbMerger.xml>
is 3 min 6 sec old
  * <https://builds.apache.org/job/Nutch-trunk/ws/trunk/build/test/TEST-org.apache.nutch.crawl.TestSignatureFactory.xml>
is 3 min 5 sec old
  * <https://builds.apache.org/job/Nutch-trunk/ws/trunk/build/test/TEST-org.apache.nutch.fetcher.TestFetcher.xml>
is 2 min 52 sec old
  * <https://builds.apache.org/job/Nutch-trunk/ws/trunk/build/test/TEST-org.apache.nutch.indexer.TestIndexingFilters.xml>
is 2 min 50 sec old
  * <https://builds.apache.org/job/Nutch-trunk/ws/trunk/build/test/TEST-org.apache.nutch.metadata.TestMetadata.xml>
is 2 min 50 sec old
  * <https://builds.apache.org/job/Nutch-trunk/ws/trunk/build/test/TEST-org.apache.nutch.metadata.TestSpellCheckedMetadata.xml>
is 2 min 46 sec old
  * <https://builds.apache.org/job/Nutch-trunk/ws/trunk/build/test/TEST-org.apache.nutch.net.TestURLFilters.xml>
is 2 min 45 sec old
  * <https://builds.apache.org/job/Nutch-trunk/ws/trunk/build/test/TEST-org.apache.nutch.net.TestURLNormalizers.xml>
is 2 min 44 sec old
  * <https://builds.apache.org/job/Nutch-trunk/ws/trunk/build/test/TEST-org.apache.nutch.parse.TestOutlinkExtractor.xml>
is 2 min 43 sec old
  * <https://builds.apache.org/job/Nutch-trunk/ws/trunk/build/test/TEST-org.apache.nutch.parse.TestParseData.xml>
is 2 min 43 sec old
  * <https://builds.apache.org/job/Nutch-trunk/ws/trunk/build/test/TEST-org.apache.nutch.parse.TestParseText.xml>
is 2 min 42 sec old
  * <https://builds.apache.org/job/Nutch-trunk/ws/trunk/build/test/TEST-org.apache.nutch.parse.TestParserFactory.xml>
is 2 min 28 sec old
  * <https://builds.apache.org/job/Nutch-trunk/ws/trunk/build/test/TEST-org.apache.nutch.plugin.TestPluginSystem.xml>
is 2 min 26 sec old
  * <https://builds.apache.org/job/Nutch-trunk/ws/trunk/build/test/TEST-org.apache.nutch.protocol.TestContent.xml>
is 2 min 25 sec old
  * <https://builds.apache.org/job/Nutch-trunk/ws/trunk/build/test/TEST-org.apache.nutch.protocol.TestProtocolFactory.xml>
is 2 min 24 sec old

[xUnit] [INFO] - Failing BUILD because 'set build failed if errors' option is activated.
[xUnit] [INFO] - There are errors when processing test results.
[xUnit] [INFO] - Skipping tests recording.
[xUnit] [INFO] - Stop build.
Build step 'Process xUnit test result report' changed build result to FAILURE
Publishing Javadoc
[xUnit] [INFO] - Starting to record.
[xUnit] [INFO] - Processing JUnit
[xUnit] [INFO] - [JUnit] - 32 test report file(s) were found with the pattern 'trunk/build/test/TEST-*.xml'
relative to '<https://builds.apache.org/job/Nutch-trunk/ws/'> for the testing framework
'JUnit'.
[xUnit] [ERROR] - Test reports were found but not all of them are new. Did all the tests run?
  * <https://builds.apache.org/job/Nutch-trunk/ws/trunk/build/test/TEST-org.apache.nutch.crawl.TestAdaptiveFetchSchedule.xml>
is 4 min 6 sec old
  * <https://builds.apache.org/job/Nutch-trunk/ws/trunk/build/test/TEST-org.apache.nutch.crawl.TestCrawlDbFilter.xml>
is 4 min 3 sec old
  * <https://builds.apache.org/job/Nutch-trunk/ws/trunk/build/test/TEST-org.apache.nutch.crawl.TestCrawlDbMerger.xml>
is 4 min 0 sec old
  * <https://builds.apache.org/job/Nutch-trunk/ws/trunk/build/test/TEST-org.apache.nutch.crawl.TestCrawlDbStates.xml>
is 3 min 56 sec old
  * <https://builds.apache.org/job/Nutch-trunk/ws/trunk/build/test/TEST-org.apache.nutch.crawl.TestGenerator.xml>
is 3 min 16 sec old
  * <https://builds.apache.org/job/Nutch-trunk/ws/trunk/build/test/TEST-org.apache.nutch.crawl.TestInjector.xml>
is 3 min 9 sec old
  * <https://builds.apache.org/job/Nutch-trunk/ws/trunk/build/test/TEST-org.apache.nutch.crawl.TestLinkDbMerger.xml>
is 3 min 6 sec old
  * <https://builds.apache.org/job/Nutch-trunk/ws/trunk/build/test/TEST-org.apache.nutch.crawl.TestSignatureFactory.xml>
is 3 min 5 sec old
  * <https://builds.apache.org/job/Nutch-trunk/ws/trunk/build/test/TEST-org.apache.nutch.fetcher.TestFetcher.xml>
is 2 min 52 sec old
  * <https://builds.apache.org/job/Nutch-trunk/ws/trunk/build/test/TEST-org.apache.nutch.indexer.TestIndexingFilters.xml>
is 2 min 50 sec old
  * <https://builds.apache.org/job/Nutch-trunk/ws/trunk/build/test/TEST-org.apache.nutch.metadata.TestMetadata.xml>
is 2 min 50 sec old
  * <https://builds.apache.org/job/Nutch-trunk/ws/trunk/build/test/TEST-org.apache.nutch.metadata.TestSpellCheckedMetadata.xml>
is 2 min 46 sec old
  * <https://builds.apache.org/job/Nutch-trunk/ws/trunk/build/test/TEST-org.apache.nutch.net.TestURLFilters.xml>
is 2 min 45 sec old
  * <https://builds.apache.org/job/Nutch-trunk/ws/trunk/build/test/TEST-org.apache.nutch.net.TestURLNormalizers.xml>
is 2 min 44 sec old
  * <https://builds.apache.org/job/Nutch-trunk/ws/trunk/build/test/TEST-org.apache.nutch.parse.TestOutlinkExtractor.xml>
is 2 min 43 sec old
  * <https://builds.apache.org/job/Nutch-trunk/ws/trunk/build/test/TEST-org.apache.nutch.parse.TestParseData.xml>
is 2 min 43 sec old
  * <https://builds.apache.org/job/Nutch-trunk/ws/trunk/build/test/TEST-org.apache.nutch.parse.TestParseText.xml>
is 2 min 42 sec old
  * <https://builds.apache.org/job/Nutch-trunk/ws/trunk/build/test/TEST-org.apache.nutch.parse.TestParserFactory.xml>
is 2 min 28 sec old
  * <https://builds.apache.org/job/Nutch-trunk/ws/trunk/build/test/TEST-org.apache.nutch.plugin.TestPluginSystem.xml>
is 2 min 26 sec old
  * <https://builds.apache.org/job/Nutch-trunk/ws/trunk/build/test/TEST-org.apache.nutch.protocol.TestContent.xml>
is 2 min 25 sec old
  * <https://builds.apache.org/job/Nutch-trunk/ws/trunk/build/test/TEST-org.apache.nutch.protocol.TestProtocolFactory.xml>
is 2 min 24 sec old

[xUnit] [INFO] - Failing BUILD because 'set build failed if errors' option is activated.
[xUnit] [INFO] - There are errors when processing test results.
[xUnit] [INFO] - Skipping tests recording.
[xUnit] [INFO] - Stop build.

Mime
View raw message