nutch-dev mailing list archives

Site index · List index
Message view « Date » · « Thread »
Top « Date » · « Thread »
From Apache Jenkins Server <jenk...@builds.apache.org>
Subject Build failed in Jenkins: Nutch-trunk #3360
Date Mon, 18 Apr 2016 10:56:20 GMT
See <https://builds.apache.org/job/Nutch-trunk/3360/changes>

Changes:

[connect.karanjeet] fix for NUTCH-2191 - fixing Nutch build - contributed by karanjeets

------------------------------------------
[...truncated 13660 lines...]

compile:
     [echo] Compiling plugin: urlnormalizer-basic

deps-test-compile:

compile-test:

jar:

deps-test:

deploy:

copy-generated-lib:

test:
     [echo] Testing plugin: urlnormalizer-basic
    [junit] Running org.apache.nutch.tika.TestRobotsMetaProcessor
    [junit] Running org.apache.nutch.net.urlnormalizer.basic.TestBasicURLNormalizer
    [junit] Tests run: 1, Failures: 0, Errors: 0, Skipped: 0, Time elapsed: 0.871 sec

init:

init-plugin:

deps-jar:

clean-lib:

resolve-default:
[ivy:resolve] :: loading settings :: file = <https://builds.apache.org/job/Nutch-trunk/ws/ivy/ivysettings.xml>

compile:
     [echo] Compiling plugin: urlnormalizer-host

deps-test-compile:

compile-test:

jar:

deps-test:

deploy:

copy-generated-lib:

test:
     [echo] Testing plugin: urlnormalizer-host
    [junit] Tests run: 3, Failures: 0, Errors: 0, Skipped: 0, Time elapsed: 0.543 sec

init:

init-plugin:

deps-jar:

clean-lib:

resolve-default:
[ivy:resolve] :: loading settings :: file = <https://builds.apache.org/job/Nutch-trunk/ws/ivy/ivysettings.xml>

compile:
     [echo] Compiling plugin: urlnormalizer-pass

deps-test-compile:

compile-test:

jar:

deps-test:

deploy:

copy-generated-lib:

test:
     [echo] Testing plugin: urlnormalizer-pass
    [junit] Running org.apache.nutch.net.urlnormalizer.host.TestHostURLNormalizer
    [junit] Running org.apache.nutch.net.urlnormalizer.pass.TestPassURLNormalizer
    [junit] Tests run: 1, Failures: 0, Errors: 0, Skipped: 0, Time elapsed: 0.434 sec
    [junit] Tests run: 1, Failures: 0, Errors: 0, Skipped: 0, Time elapsed: 0.937 sec

init:

init-plugin:

deps-jar:

clean-lib:

resolve-default:
[ivy:resolve] :: loading settings :: file = <https://builds.apache.org/job/Nutch-trunk/ws/ivy/ivysettings.xml>

compile:
     [echo] Compiling plugin: urlnormalizer-protocol

deps-test-compile:

compile-test:

jar:

deps-test:

deploy:

copy-generated-lib:

test:
     [echo] Testing plugin: urlnormalizer-protocol

init:

init-plugin:

deps-jar:

clean-lib:

resolve-default:
[ivy:resolve] :: loading settings :: file = <https://builds.apache.org/job/Nutch-trunk/ws/ivy/ivysettings.xml>

compile:
     [echo] Compiling plugin: urlnormalizer-querystring

deps-test-compile:

compile-test:

jar:

deps-test:

deploy:

copy-generated-lib:

test:
     [echo] Testing plugin: urlnormalizer-querystring
    [junit] Running org.apache.nutch.net.urlnormalizer.protocol.TestProtocolURLNormalizer
    [junit] Running org.apache.nutch.net.urlnormalizer.querystring.TestQuerystringURLNormalizer
    [junit] Tests run: 1, Failures: 0, Errors: 0, Skipped: 0, Time elapsed: 0.408 sec

init:

init-plugin:

deps-jar:

clean-lib:

resolve-default:
[ivy:resolve] :: loading settings :: file = <https://builds.apache.org/job/Nutch-trunk/ws/ivy/ivysettings.xml>

compile:
     [echo] Compiling plugin: urlnormalizer-regex

deps-test-compile:

compile-test:

jar:

deps-test:

init:

init-plugin:

clean-lib:

resolve-default:
[ivy:resolve] :: loading settings :: file = <https://builds.apache.org/job/Nutch-trunk/ws/ivy/ivysettings.xml>

compile:

jar:

deps-test:

deploy:

copy-generated-lib:

deploy:

copy-generated-lib:

test:
     [echo] Testing plugin: urlnormalizer-regex
    [junit] Tests run: 1, Failures: 0, Errors: 0, Skipped: 0, Time elapsed: 0.813 sec

init:

init-plugin:

deps-jar:

clean-lib:

resolve-default:
[ivy:resolve] :: loading settings :: file = <https://builds.apache.org/job/Nutch-trunk/ws/ivy/ivysettings.xml>

compile:
     [echo] Compiling plugin: urlnormalizer-slash

deps-test-compile:

compile-test:

jar:

deps-test:

deploy:

copy-generated-lib:

test:
     [echo] Testing plugin: urlnormalizer-slash
    [junit] Running org.apache.nutch.net.urlnormalizer.regex.TestRegexURLNormalizer
    [junit] Running org.apache.nutch.net.urlnormalizer.slash.TestSlashURLNormalizer
    [junit] Tests run: 2, Failures: 0, Errors: 0, Skipped: 0, Time elapsed: 0.735 sec
    [junit] Tests run: 1, Failures: 0, Errors: 0, Skipped: 0, Time elapsed: 0.894 sec

BUILD SUCCESSFUL
Total time: 12 minutes 37 seconds
[xUnit] [INFO] - Starting to record.
[xUnit] [INFO] - Processing JUnit
[xUnit] [INFO] - [JUnit] - No test report file(s) were found with the pattern 'trunk/build/test/TEST-*.xml'
relative to '<https://builds.apache.org/job/Nutch-trunk/ws/'> for the testing framework
'JUnit'.  Did you enter a pattern relative to the correct directory?  Did you generate the
result report(s) for 'JUnit'?
[xUnit] [ERROR] - No test reports found for the metric 'JUnit' with the resolved pattern 'trunk/build/test/TEST-*.xml'.
Configuration error?.
[xUnit] [INFO] - Failing BUILD.
[xUnit] [INFO] - There are errors when processing test results.
[xUnit] [INFO] - Skipping tests recording.
[xUnit] [INFO] - Stop build.
Build step 'Process xUnit test result report' changed build result to FAILURE
Publishing Javadoc
[xUnit] [INFO] - Starting to record.
[xUnit] [INFO] - Processing JUnit
[xUnit] [INFO] - [JUnit] - No test report file(s) were found with the pattern 'trunk/build/test/TEST-*.xml'
relative to '<https://builds.apache.org/job/Nutch-trunk/ws/'> for the testing framework
'JUnit'.  Did you enter a pattern relative to the correct directory?  Did you generate the
result report(s) for 'JUnit'?
[xUnit] [ERROR] - No test reports found for the metric 'JUnit' with the resolved pattern 'trunk/build/test/TEST-*.xml'.
Configuration error?.
[xUnit] [INFO] - Failing BUILD.
[xUnit] [INFO] - There are errors when processing test results.
[xUnit] [INFO] - Skipping tests recording.
[xUnit] [INFO] - Stop build.
Updating NUTCH-2191

Mime
View raw message