nutch-dev mailing list archives

Site index · List index
Message view « Date » · « Thread »
Top « Date » · « Thread »
From Apache Jenkins Server <jenk...@builds.apache.org>
Subject Build failed in Jenkins: Nutch-trunk #3364
Date Sat, 07 May 2016 20:51:31 GMT
See <https://builds.apache.org/job/Nutch-trunk/3364/changes>

Changes:

[tgowdan] option to inlcude inlinks in commons crawl dump

[tgowdan] Handling duplicate inlinks

[tgowdan] Fix code format issues

[tgowdan] Code style :  2 spaces instead of tabs

[mattmann] Record entry for GitHub-106: Option to include inlinks in commonscrawl

------------------------------------------
[...truncated 2468 lines...]
jar:

deps-test:

deploy:

copy-generated-lib:

init:

init-plugin:

deps-jar:

clean-lib:

resolve-default:
[ivy:resolve] :: loading settings :: file = <https://builds.apache.org/job/Nutch-trunk/ws/ivy/ivysettings.xml>

compile:
     [echo] Compiling plugin: urlnormalizer-regex

jar:

deps-test:

init:

init-plugin:

clean-lib:

resolve-default:
[ivy:resolve] :: loading settings :: file = <https://builds.apache.org/job/Nutch-trunk/ws/ivy/ivysettings.xml>

compile:

jar:

deps-test:

deploy:

copy-generated-lib:

deploy:

copy-generated-lib:

init:

init-plugin:

deps-jar:

clean-lib:

resolve-default:
[ivy:resolve] :: loading settings :: file = <https://builds.apache.org/job/Nutch-trunk/ws/ivy/ivysettings.xml>

compile:
     [echo] Compiling plugin: urlnormalizer-slash

jar:

deps-test:

deploy:

copy-generated-lib:

compile:

job:
      [jar] Building jar: <https://builds.apache.org/job/Nutch-trunk/ws/build/apache-nutch-1.12-SNAPSHOT.job>

test-core:
   [delete] Deleting directory <https://builds.apache.org/job/Nutch-trunk/ws/build/test/data>
    [mkdir] Created dir: <https://builds.apache.org/job/Nutch-trunk/ws/build/test/data>
     [copy] Copying 48 files to <https://builds.apache.org/job/Nutch-trunk/ws/build/test/data>
    [junit] Running org.apache.nutch.crawl.TestAdaptiveFetchSchedule
    [junit] Tests run: 1, Failures: 0, Errors: 0, Skipped: 0, Time elapsed: 0.517 sec
    [junit] Running org.apache.nutch.crawl.TestCrawlDbFilter
    [junit] Tests run: 1, Failures: 0, Errors: 0, Skipped: 0, Time elapsed: 5.546 sec
    [junit] Running org.apache.nutch.crawl.TestCrawlDbMerger
    [junit] Tests run: 1, Failures: 0, Errors: 0, Skipped: 0, Time elapsed: 4.53 sec
    [junit] Running org.apache.nutch.crawl.TestCrawlDbStates
    [junit] Tests run: 6, Failures: 0, Errors: 0, Skipped: 0, Time elapsed: 5.007 sec
    [junit] Running org.apache.nutch.crawl.TestGenerator
    [junit] Tests run: 4, Failures: 0, Errors: 0, Skipped: 0, Time elapsed: 46.244 sec
    [junit] Running org.apache.nutch.crawl.TestInjector
    [junit] Tests run: 1, Failures: 0, Errors: 0, Skipped: 0, Time elapsed: 7.592 sec
    [junit] Running org.apache.nutch.crawl.TestLinkDbMerger
    [junit] Tests run: 1, Failures: 0, Errors: 0, Skipped: 0, Time elapsed: 4.444 sec
    [junit] Running org.apache.nutch.crawl.TestSignatureFactory
    [junit] Tests run: 1, Failures: 0, Errors: 0, Skipped: 0, Time elapsed: 0.465 sec
    [junit] Running org.apache.nutch.fetcher.TestFetcher
    [junit] Tests run: 2, Failures: 0, Errors: 0, Skipped: 0, Time elapsed: 17.024 sec
    [junit] Running org.apache.nutch.indexer.TestIndexerMapReduce
    [junit] Tests run: 1, Failures: 0, Errors: 0, Skipped: 0, Time elapsed: 2.134 sec
    [junit] Running org.apache.nutch.indexer.TestIndexingFilters
    [junit] Tests run: 3, Failures: 0, Errors: 0, Skipped: 0, Time elapsed: 1.204 sec
    [junit] Running org.apache.nutch.metadata.TestMetadata
    [junit] Tests run: 10, Failures: 0, Errors: 0, Skipped: 0, Time elapsed: 0.164 sec
    [junit] Running org.apache.nutch.metadata.TestSpellCheckedMetadata
    [junit] Tests run: 11, Failures: 0, Errors: 0, Skipped: 0, Time elapsed: 3.639 sec
    [junit] Running org.apache.nutch.net.TestURLFilters
    [junit] Tests run: 1, Failures: 0, Errors: 0, Skipped: 0, Time elapsed: 0.773 sec
    [junit] Running org.apache.nutch.net.TestURLNormalizers
    [junit] Tests run: 1, Failures: 0, Errors: 0, Skipped: 0, Time elapsed: 0.82 sec
    [junit] Running org.apache.nutch.parse.TestOutlinkExtractor
    [junit] Tests run: 4, Failures: 0, Errors: 0, Skipped: 0, Time elapsed: 0.099 sec
    [junit] Running org.apache.nutch.parse.TestParseData
    [junit] Tests run: 2, Failures: 0, Errors: 0, Skipped: 0, Time elapsed: 0.135 sec
    [junit] Running org.apache.nutch.parse.TestParseText
    [junit] Tests run: 1, Failures: 0, Errors: 0, Skipped: 0, Time elapsed: 0.088 sec
    [junit] Running org.apache.nutch.parse.TestParserFactory
    [junit] Tests run: 2, Failures: 0, Errors: 0, Skipped: 0, Time elapsed: 2.637 sec
    [junit] Running org.apache.nutch.plugin.TestPluginSystem
    [junit] Tests run: 7, Failures: 0, Errors: 0, Skipped: 0, Time elapsed: 2.254 sec
    [junit] Running org.apache.nutch.protocol.TestContent
    [junit] Tests run: 2, Failures: 0, Errors: 0, Skipped: 0, Time elapsed: 0.847 sec
    [junit] Running org.apache.nutch.protocol.TestProtocolFactory
    [junit] Tests run: 2, Failures: 0, Errors: 0, Skipped: 0, Time elapsed: 1.032 sec
    [junit] Running org.apache.nutch.segment.TestSegmentMerger
    [junit] Tests run: 1, Failures: 0, Errors: 0, Skipped: 0, Time elapsed: 155.58 sec
    [junit] Running org.apache.nutch.segment.TestSegmentMergerCrawlDatums
    [junit] Tests run: 7, Failures: 0, Errors: 0, Skipped: 0, Time elapsed: 133.37 sec
    [junit] Running org.apache.nutch.service.TestNutchServer
    [junit] Tests run: 1, Failures: 0, Errors: 0, Skipped: 0, Time elapsed: 1.989 sec
    [junit] Running org.apache.nutch.tools.TestCommonCrawlDataDumper
    [junit] Tests run: 1, Failures: 0, Errors: 1, Skipped: 0, Time elapsed: 0.215 sec
    [junit] Test org.apache.nutch.tools.TestCommonCrawlDataDumper FAILED
    [junit] Running org.apache.nutch.util.TestEncodingDetector
    [junit] Tests run: 1, Failures: 0, Errors: 0, Skipped: 0, Time elapsed: 0.923 sec
    [junit] Running org.apache.nutch.util.TestGZIPUtils
    [junit] Tests run: 3, Failures: 0, Errors: 0, Skipped: 0, Time elapsed: 0.478 sec
    [junit] Running org.apache.nutch.util.TestMimeUtil
    [junit] Tests run: 4, Failures: 0, Errors: 0, Skipped: 0, Time elapsed: 1.818 sec
    [junit] Running org.apache.nutch.util.TestNodeWalker
    [junit] Tests run: 1, Failures: 0, Errors: 0, Skipped: 0, Time elapsed: 0.311 sec
    [junit] Running org.apache.nutch.util.TestPrefixStringMatcher
    [junit] Tests run: 1, Failures: 0, Errors: 0, Skipped: 0, Time elapsed: 0.167 sec
    [junit] Running org.apache.nutch.util.TestStringUtil
    [junit] Tests run: 1, Failures: 0, Errors: 0, Skipped: 0, Time elapsed: 0.076 sec
    [junit] Running org.apache.nutch.util.TestSuffixStringMatcher
    [junit] Tests run: 1, Failures: 0, Errors: 0, Skipped: 0, Time elapsed: 0.164 sec
    [junit] Running org.apache.nutch.util.TestTableUtil
    [junit] Tests run: 2, Failures: 0, Errors: 0, Skipped: 0, Time elapsed: 0.101 sec
    [junit] Running org.apache.nutch.util.TestURLUtil
    [junit] Tests run: 8, Failures: 0, Errors: 0, Skipped: 0, Time elapsed: 0.866 sec

BUILD FAILED
<https://builds.apache.org/job/Nutch-trunk/ws/build.xml>:495: Tests failed!

Total time: 8 minutes 12 seconds
Build step 'Invoke Ant' marked build as failure
Publishing Javadoc
[xUnit] [INFO] - Starting to record.
[xUnit] [INFO] - Processing JUnit
[xUnit] [INFO] - [JUnit] - 35 test report file(s) were found with the pattern 'build/test/TEST-*.xml'
relative to '<https://builds.apache.org/job/Nutch-trunk/ws/'> for the testing framework
'JUnit'.
[xUnit] [INFO] - Converting '<https://builds.apache.org/job/Nutch-trunk/ws/build/test/TEST-org.apache.nutch.crawl.TestAdaptiveFetchSchedule.xml'>
.
[xUnit] [INFO] - Converting '<https://builds.apache.org/job/Nutch-trunk/ws/build/test/TEST-org.apache.nutch.crawl.TestCrawlDbFilter.xml'>
.
[xUnit] [INFO] - Converting '<https://builds.apache.org/job/Nutch-trunk/ws/build/test/TEST-org.apache.nutch.crawl.TestCrawlDbMerger.xml'>
.
[xUnit] [INFO] - Converting '<https://builds.apache.org/job/Nutch-trunk/ws/build/test/TEST-org.apache.nutch.crawl.TestCrawlDbStates.xml'>
.
[xUnit] [INFO] - Converting '<https://builds.apache.org/job/Nutch-trunk/ws/build/test/TEST-org.apache.nutch.crawl.TestGenerator.xml'>
.
[xUnit] [INFO] - Converting '<https://builds.apache.org/job/Nutch-trunk/ws/build/test/TEST-org.apache.nutch.crawl.TestInjector.xml'>
.
[xUnit] [INFO] - Converting '<https://builds.apache.org/job/Nutch-trunk/ws/build/test/TEST-org.apache.nutch.crawl.TestLinkDbMerger.xml'>
.
[xUnit] [INFO] - Converting '<https://builds.apache.org/job/Nutch-trunk/ws/build/test/TEST-org.apache.nutch.crawl.TestSignatureFactory.xml'>
.
[xUnit] [INFO] - Converting '<https://builds.apache.org/job/Nutch-trunk/ws/build/test/TEST-org.apache.nutch.fetcher.TestFetcher.xml'>
.
[xUnit] [INFO] - Converting '<https://builds.apache.org/job/Nutch-trunk/ws/build/test/TEST-org.apache.nutch.indexer.TestIndexerMapReduce.xml'>
.
[xUnit] [INFO] - Converting '<https://builds.apache.org/job/Nutch-trunk/ws/build/test/TEST-org.apache.nutch.indexer.TestIndexingFilters.xml'>
.
[xUnit] [INFO] - Converting '<https://builds.apache.org/job/Nutch-trunk/ws/build/test/TEST-org.apache.nutch.metadata.TestMetadata.xml'>
.
[xUnit] [INFO] - Converting '<https://builds.apache.org/job/Nutch-trunk/ws/build/test/TEST-org.apache.nutch.metadata.TestSpellCheckedMetadata.xml'>
.
[xUnit] [INFO] - Converting '<https://builds.apache.org/job/Nutch-trunk/ws/build/test/TEST-org.apache.nutch.net.TestURLFilters.xml'>
.
[xUnit] [INFO] - Converting '<https://builds.apache.org/job/Nutch-trunk/ws/build/test/TEST-org.apache.nutch.net.TestURLNormalizers.xml'>
.
[xUnit] [INFO] - Converting '<https://builds.apache.org/job/Nutch-trunk/ws/build/test/TEST-org.apache.nutch.parse.TestOutlinkExtractor.xml'>
.
[xUnit] [INFO] - Converting '<https://builds.apache.org/job/Nutch-trunk/ws/build/test/TEST-org.apache.nutch.parse.TestParseData.xml'>
.
[xUnit] [INFO] - Converting '<https://builds.apache.org/job/Nutch-trunk/ws/build/test/TEST-org.apache.nutch.parse.TestParseText.xml'>
.
[xUnit] [INFO] - Converting '<https://builds.apache.org/job/Nutch-trunk/ws/build/test/TEST-org.apache.nutch.parse.TestParserFactory.xml'>
.
[xUnit] [INFO] - Converting '<https://builds.apache.org/job/Nutch-trunk/ws/build/test/TEST-org.apache.nutch.plugin.TestPluginSystem.xml'>
.
[xUnit] [INFO] - Converting '<https://builds.apache.org/job/Nutch-trunk/ws/build/test/TEST-org.apache.nutch.protocol.TestContent.xml'>
.
[xUnit] [INFO] - Converting '<https://builds.apache.org/job/Nutch-trunk/ws/build/test/TEST-org.apache.nutch.protocol.TestProtocolFactory.xml'>
.
[xUnit] [INFO] - Converting '<https://builds.apache.org/job/Nutch-trunk/ws/build/test/TEST-org.apache.nutch.segment.TestSegmentMerger.xml'>
.
[xUnit] [INFO] - Converting '<https://builds.apache.org/job/Nutch-trunk/ws/build/test/TEST-org.apache.nutch.segment.TestSegmentMergerCrawlDatums.xml'>
.
[xUnit] [INFO] - Converting '<https://builds.apache.org/job/Nutch-trunk/ws/build/test/TEST-org.apache.nutch.service.TestNutchServer.xml'>
.
[xUnit] [INFO] - Converting '<https://builds.apache.org/job/Nutch-trunk/ws/build/test/TEST-org.apache.nutch.tools.TestCommonCrawlDataDumper.xml'>
.
[xUnit] [INFO] - Converting '<https://builds.apache.org/job/Nutch-trunk/ws/build/test/TEST-org.apache.nutch.util.TestEncodingDetector.xml'>
.
[xUnit] [INFO] - Converting '<https://builds.apache.org/job/Nutch-trunk/ws/build/test/TEST-org.apache.nutch.util.TestGZIPUtils.xml'>
.
[xUnit] [INFO] - Converting '<https://builds.apache.org/job/Nutch-trunk/ws/build/test/TEST-org.apache.nutch.util.TestMimeUtil.xml'>
.
[xUnit] [INFO] - Converting '<https://builds.apache.org/job/Nutch-trunk/ws/build/test/TEST-org.apache.nutch.util.TestNodeWalker.xml'>
.
[xUnit] [INFO] - Converting '<https://builds.apache.org/job/Nutch-trunk/ws/build/test/TEST-org.apache.nutch.util.TestPrefixStringMatcher.xml'>
.
[xUnit] [INFO] - Converting '<https://builds.apache.org/job/Nutch-trunk/ws/build/test/TEST-org.apache.nutch.util.TestStringUtil.xml'>
.
[xUnit] [INFO] - Converting '<https://builds.apache.org/job/Nutch-trunk/ws/build/test/TEST-org.apache.nutch.util.TestSuffixStringMatcher.xml'>
.
[xUnit] [INFO] - Converting '<https://builds.apache.org/job/Nutch-trunk/ws/build/test/TEST-org.apache.nutch.util.TestTableUtil.xml'>
.
[xUnit] [INFO] - Converting '<https://builds.apache.org/job/Nutch-trunk/ws/build/test/TEST-org.apache.nutch.util.TestURLUtil.xml'>
.
[xUnit] [INFO] - Processing JUnit
[xUnit] [INFO] - [JUnit] - 80 test report file(s) were found with the pattern 'build/**/test/TEST-*.xml'
relative to '<https://builds.apache.org/job/Nutch-trunk/ws/'> for the testing framework
'JUnit'.
[xUnit] [ERROR] - Test reports were found but not all of them are new. Did all the tests run?
  * <https://builds.apache.org/job/Nutch-trunk/ws/build/creativecommons/test/TEST-org.creativecommons.nutch.TestCCParseFilter.xml>
is 19 days old
  * <https://builds.apache.org/job/Nutch-trunk/ws/build/feed/test/TEST-org.apache.nutch.parse.feed.TestFeedParser.xml>
is 19 days old
  * <https://builds.apache.org/job/Nutch-trunk/ws/build/index-anchor/test/TEST-org.apache.nutch.indexer.anchor.TestAnchorIndexingFilter.xml>
is 19 days old
  * <https://builds.apache.org/job/Nutch-trunk/ws/build/index-basic/test/TEST-org.apache.nutch.indexer.basic.TestBasicIndexingFilter.xml>
is 19 days old
  * <https://builds.apache.org/job/Nutch-trunk/ws/build/index-links/test/TEST-org.apache.nutch.indexer.links.TestLinksIndexingFilter.xml>
is 19 days old
  * <https://builds.apache.org/job/Nutch-trunk/ws/build/index-links/test/TEST-org.apache.nutch.parse.TestOutlinks.xml>
is 19 days old
  * <https://builds.apache.org/job/Nutch-trunk/ws/build/index-more/test/TEST-org.apache.nutch.indexer.more.TestMoreIndexingFilter.xml>
is 19 days old
  * <https://builds.apache.org/job/Nutch-trunk/ws/build/index-replace/test/TEST-org.apache.nutch.indexer.replace.TestIndexReplace.xml>
is 19 days old
  * <https://builds.apache.org/job/Nutch-trunk/ws/build/index-static/test/TEST-org.apache.nutch.indexer.staticfield.TestStaticFieldIndexerTest.xml>
is 19 days old
  * <https://builds.apache.org/job/Nutch-trunk/ws/build/language-identifier/test/TEST-org.apache.nutch.analysis.lang.TestHTMLLanguageParser.xml>
is 19 days old
  * <https://builds.apache.org/job/Nutch-trunk/ws/build/lib-http/test/TEST-org.apache.nutch.protocol.http.api.TestRobotRulesParser.xml>
is 19 days old
  * <https://builds.apache.org/job/Nutch-trunk/ws/build/parse-html/test/TEST-org.apache.nutch.parse.html.TestDOMContentUtils.xml>
is 19 days old
  * <https://builds.apache.org/job/Nutch-trunk/ws/build/parse-html/test/TEST-org.apache.nutch.parse.html.TestHtmlParser.xml>
is 19 days old
  * <https://builds.apache.org/job/Nutch-trunk/ws/build/parse-html/test/TEST-org.apache.nutch.parse.html.TestRobotsMetaProcessor.xml>
is 19 days old
  * <https://builds.apache.org/job/Nutch-trunk/ws/build/parse-metatags/test/TEST-org.apache.nutch.parse.metatags.TestMetatagParser.xml>
is 19 days old
  * <https://builds.apache.org/job/Nutch-trunk/ws/build/parse-swf/test/TEST-org.apache.nutch.parse.swf.TestSWFParser.xml>
is 19 days old
  * <https://builds.apache.org/job/Nutch-trunk/ws/build/parse-tika/test/TEST-org.apache.nutch.tika.TestDOMContentUtils.xml>
is 19 days old
  * <https://builds.apache.org/job/Nutch-trunk/ws/build/parse-tika/test/TEST-org.apache.nutch.tika.TestFeedParser.xml>
is 19 days old
  * <https://builds.apache.org/job/Nutch-trunk/ws/build/parse-tika/test/TEST-org.apache.nutch.tika.TestImageMetadata.xml>
is 19 days old
  * <https://builds.apache.org/job/Nutch-trunk/ws/build/parse-tika/test/TEST-org.apache.nutch.tika.TestMSWordParser.xml>
is 19 days old
  * <https://builds.apache.org/job/Nutch-trunk/ws/build/parse-tika/test/TEST-org.apache.nutch.tika.TestOOParser.xml>
is 19 days old
  * <https://builds.apache.org/job/Nutch-trunk/ws/build/parse-tika/test/TEST-org.apache.nutch.tika.TestPdfParser.xml>
is 19 days old
  * <https://builds.apache.org/job/Nutch-trunk/ws/build/parse-tika/test/TEST-org.apache.nutch.tika.TestRTFParser.xml>
is 19 days old
  * <https://builds.apache.org/job/Nutch-trunk/ws/build/parse-tika/test/TEST-org.apache.nutch.tika.TestRobotsMetaProcessor.xml>
is 19 days old
  * <https://builds.apache.org/job/Nutch-trunk/ws/build/parse-zip/test/TEST-org.apache.nutch.parse.zip.TestZipParser.xml>
is 19 days old
  * <https://builds.apache.org/job/Nutch-trunk/ws/build/parsefilter-regex/test/TEST-org.apache.nutch.parsefilter.regex.TestRegexParseFilter.xml>
is 19 days old
  * <https://builds.apache.org/job/Nutch-trunk/ws/build/protocol-file/test/TEST-org.apache.nutch.protocol.file.TestProtocolFile.xml>
is 19 days old
  * <https://builds.apache.org/job/Nutch-trunk/ws/build/protocol-http/test/TEST-org.apache.nutch.protocol.http.TestProtocolHttp.xml>
is 19 days old
  * <https://builds.apache.org/job/Nutch-trunk/ws/build/protocol-httpclient/test/TEST-org.apache.nutch.protocol.httpclient.TestProtocolHttpClient.xml>
is 19 days old
  * <https://builds.apache.org/job/Nutch-trunk/ws/build/subcollection/test/TEST-org.apache.nutch.collection.TestSubcollection.xml>
is 19 days old
  * <https://builds.apache.org/job/Nutch-trunk/ws/build/urlfilter-automaton/test/TEST-org.apache.nutch.urlfilter.automaton.TestAutomatonURLFilter.xml>
is 19 days old
  * <https://builds.apache.org/job/Nutch-trunk/ws/build/urlfilter-domain/test/TEST-org.apache.nutch.urlfilter.domain.TestDomainURLFilter.xml>
is 19 days old
  * <https://builds.apache.org/job/Nutch-trunk/ws/build/urlfilter-domainblacklist/test/TEST-org.apache.nutch.urlfilter.domainblacklist.TestDomainBlacklistURLFilter.xml>
is 19 days old
  * <https://builds.apache.org/job/Nutch-trunk/ws/build/urlfilter-prefix/test/TEST-org.apache.nutch.urlfilter.prefix.TestPrefixURLFilter.xml>
is 19 days old
  * <https://builds.apache.org/job/Nutch-trunk/ws/build/urlfilter-regex/test/TEST-org.apache.nutch.urlfilter.regex.TestRegexURLFilter.xml>
is 19 days old
  * <https://builds.apache.org/job/Nutch-trunk/ws/build/urlfilter-suffix/test/TEST-org.apache.nutch.urlfilter.suffix.TestSuffixURLFilter.xml>
is 19 days old
  * <https://builds.apache.org/job/Nutch-trunk/ws/build/urlfilter-validator/test/TEST-org.apache.nutch.urlfilter.validator.TestUrlValidator.xml>
is 19 days old
  * <https://builds.apache.org/job/Nutch-trunk/ws/build/urlnormalizer-ajax/test/TEST-org.apache.nutch.net.urlnormalizer.ajax.TestAjaxURLNormalizer.xml>
is 19 days old
  * <https://builds.apache.org/job/Nutch-trunk/ws/build/urlnormalizer-basic/test/TEST-org.apache.nutch.net.urlnormalizer.basic.TestBasicURLNormalizer.xml>
is 19 days old
  * <https://builds.apache.org/job/Nutch-trunk/ws/build/urlnormalizer-host/test/TEST-org.apache.nutch.net.urlnormalizer.host.TestHostURLNormalizer.xml>
is 19 days old
  * <https://builds.apache.org/job/Nutch-trunk/ws/build/urlnormalizer-pass/test/TEST-org.apache.nutch.net.urlnormalizer.pass.TestPassURLNormalizer.xml>
is 19 days old
  * <https://builds.apache.org/job/Nutch-trunk/ws/build/urlnormalizer-protocol/test/TEST-org.apache.nutch.net.urlnormalizer.protocol.TestProtocolURLNormalizer.xml>
is 19 days old
  * <https://builds.apache.org/job/Nutch-trunk/ws/build/urlnormalizer-querystring/test/TEST-org.apache.nutch.net.urlnormalizer.querystring.TestQuerystringURLNormalizer.xml>
is 19 days old
  * <https://builds.apache.org/job/Nutch-trunk/ws/build/urlnormalizer-regex/test/TEST-org.apache.nutch.net.urlnormalizer.regex.TestRegexURLNormalizer.xml>
is 19 days old
  * <https://builds.apache.org/job/Nutch-trunk/ws/build/urlnormalizer-slash/test/TEST-org.apache.nutch.net.urlnormalizer.slash.TestSlashURLNormalizer.xml>
is 19 days old

[xUnit] [INFO] - Failing BUILD.
[xUnit] [INFO] - There are errors when processing test results.
[xUnit] [INFO] - Skipping tests recording.
[xUnit] [INFO] - Stop build.

Mime
View raw message