nutch-dev mailing list archives

Site index · List index
Message view « Date » · « Thread »
Top « Date » · « Thread »
From Apache Jenkins Server <jenk...@builds.apache.org>
Subject Build failed in Jenkins: Nutch-trunk #3377
Date Thu, 30 Jun 2016 07:54:03 GMT
See <https://builds.apache.org/job/Nutch-trunk/3377/changes>

Changes:

[snagel] NUTCH-1553 Property 'indexer.delete.robots.noindex' not working when

------------------------------------------
[...truncated 3456 lines...]
    [mkdir] Created dir: <https://builds.apache.org/job/Nutch-trunk/ws/build/urlnormalizer-regex/classes>
    [mkdir] Created dir: <https://builds.apache.org/job/Nutch-trunk/ws/build/urlnormalizer-regex/test/lib>
    [mkdir] Created dir: <https://builds.apache.org/job/Nutch-trunk/ws/build/plugins/urlnormalizer-regex>

init-plugin:

deps-jar:

clean-lib:

resolve-default:
[ivy:resolve] :: loading settings :: file = <https://builds.apache.org/job/Nutch-trunk/ws/ivy/ivysettings.xml>

compile:
     [echo] Compiling plugin: urlnormalizer-regex
    [javac] Compiling 2 source files to <https://builds.apache.org/job/Nutch-trunk/ws/build/urlnormalizer-regex/classes>
    [javac] Creating empty <https://builds.apache.org/job/Nutch-trunk/ws/build/urlnormalizer-regex/classes/org/apache/nutch/net/urlnormalizer/regex/package-info.class>

jar:
      [jar] Building jar: <https://builds.apache.org/job/Nutch-trunk/ws/build/urlnormalizer-regex/urlnormalizer-regex.jar>

deps-test:

init:

init-plugin:

clean-lib:

resolve-default:
[ivy:resolve] :: loading settings :: file = <https://builds.apache.org/job/Nutch-trunk/ws/ivy/ivysettings.xml>

compile:

jar:

deps-test:

deploy:

copy-generated-lib:

deploy:
     [copy] Copying 1 file to <https://builds.apache.org/job/Nutch-trunk/ws/build/plugins/urlnormalizer-regex>

copy-generated-lib:
     [copy] Copying 1 file to <https://builds.apache.org/job/Nutch-trunk/ws/build/plugins/urlnormalizer-regex>
    [mkdir] Created dir: <https://builds.apache.org/job/Nutch-trunk/ws/build/urlnormalizer-slash/test/data>
     [copy] Copying 1 file to <https://builds.apache.org/job/Nutch-trunk/ws/build/urlnormalizer-slash/test/data>

init:
    [mkdir] Created dir: <https://builds.apache.org/job/Nutch-trunk/ws/build/urlnormalizer-slash/classes>
    [mkdir] Created dir: <https://builds.apache.org/job/Nutch-trunk/ws/build/urlnormalizer-slash/test/lib>
    [mkdir] Created dir: <https://builds.apache.org/job/Nutch-trunk/ws/build/plugins/urlnormalizer-slash>

init-plugin:

deps-jar:

clean-lib:

resolve-default:
[ivy:resolve] :: loading settings :: file = <https://builds.apache.org/job/Nutch-trunk/ws/ivy/ivysettings.xml>

compile:
     [echo] Compiling plugin: urlnormalizer-slash
    [javac] Compiling 1 source file to <https://builds.apache.org/job/Nutch-trunk/ws/build/urlnormalizer-slash/classes>

jar:
      [jar] Building jar: <https://builds.apache.org/job/Nutch-trunk/ws/build/urlnormalizer-slash/urlnormalizer-slash.jar>

deps-test:

deploy:
     [copy] Copying 1 file to <https://builds.apache.org/job/Nutch-trunk/ws/build/plugins/urlnormalizer-slash>

copy-generated-lib:
     [copy] Copying 1 file to <https://builds.apache.org/job/Nutch-trunk/ws/build/plugins/urlnormalizer-slash>

compile:

job:
      [jar] Building jar: <https://builds.apache.org/job/Nutch-trunk/ws/build/apache-nutch-1.13-SNAPSHOT.job>

test-core:
    [mkdir] Created dir: <https://builds.apache.org/job/Nutch-trunk/ws/build/test/data>
     [copy] Copying 48 files to <https://builds.apache.org/job/Nutch-trunk/ws/build/test/data>
     [copy] Copying 1 file to <https://builds.apache.org/job/Nutch-trunk/ws/build/test/classes>
     [copy] Copying 1 file to <https://builds.apache.org/job/Nutch-trunk/ws/build/test/classes>
     [copy] Copying 1 file to <https://builds.apache.org/job/Nutch-trunk/ws/build/test/classes>
     [copy] Copying 1 file to <https://builds.apache.org/job/Nutch-trunk/ws/build/test/classes>
    [junit] Running org.apache.nutch.crawl.TestAdaptiveFetchSchedule
    [junit] Tests run: 1, Failures: 0, Errors: 0, Skipped: 0, Time elapsed: 0.66 sec
    [junit] Running org.apache.nutch.crawl.TestCrawlDbFilter
    [junit] Tests run: 1, Failures: 0, Errors: 0, Skipped: 0, Time elapsed: 5.724 sec
    [junit] Running org.apache.nutch.crawl.TestCrawlDbMerger
    [junit] Tests run: 1, Failures: 0, Errors: 0, Skipped: 0, Time elapsed: 4.997 sec
    [junit] Running org.apache.nutch.crawl.TestCrawlDbStates
    [junit] Tests run: 6, Failures: 0, Errors: 1, Skipped: 0, Time elapsed: 7.116 sec
    [junit] Test org.apache.nutch.crawl.TestCrawlDbStates FAILED
    [junit] Running org.apache.nutch.crawl.TestGenerator
    [junit] Tests run: 4, Failures: 0, Errors: 0, Skipped: 0, Time elapsed: 52.052 sec
    [junit] Running org.apache.nutch.crawl.TestInjector
    [junit] Tests run: 1, Failures: 0, Errors: 0, Skipped: 0, Time elapsed: 12.189 sec
    [junit] Running org.apache.nutch.crawl.TestLinkDbMerger
    [junit] Tests run: 1, Failures: 0, Errors: 0, Skipped: 0, Time elapsed: 5.34 sec
    [junit] Running org.apache.nutch.crawl.TestSignatureFactory
    [junit] Tests run: 1, Failures: 0, Errors: 0, Skipped: 0, Time elapsed: 0.749 sec
    [junit] Running org.apache.nutch.fetcher.TestFetcher
    [junit] Tests run: 2, Failures: 0, Errors: 0, Skipped: 0, Time elapsed: 23.933 sec
    [junit] Running org.apache.nutch.indexer.TestIndexerMapReduce
    [junit] Tests run: 1, Failures: 0, Errors: 0, Skipped: 0, Time elapsed: 2.11 sec
    [junit] Running org.apache.nutch.indexer.TestIndexingFilters
    [junit] Tests run: 3, Failures: 0, Errors: 0, Skipped: 0, Time elapsed: 1.577 sec
    [junit] Running org.apache.nutch.metadata.TestMetadata
    [junit] Tests run: 10, Failures: 0, Errors: 0, Skipped: 0, Time elapsed: 0.312 sec
    [junit] Running org.apache.nutch.metadata.TestSpellCheckedMetadata
    [junit] Tests run: 11, Failures: 0, Errors: 0, Skipped: 0, Time elapsed: 4.656 sec
    [junit] Running org.apache.nutch.net.TestURLFilters
    [junit] Tests run: 1, Failures: 0, Errors: 0, Skipped: 0, Time elapsed: 0.904 sec
    [junit] Running org.apache.nutch.net.TestURLNormalizers
    [junit] Tests run: 1, Failures: 0, Errors: 0, Skipped: 0, Time elapsed: 0.887 sec
    [junit] Running org.apache.nutch.parse.TestOutlinkExtractor
    [junit] Tests run: 4, Failures: 0, Errors: 0, Skipped: 0, Time elapsed: 0.122 sec
    [junit] Running org.apache.nutch.parse.TestParseData
    [junit] Tests run: 2, Failures: 0, Errors: 0, Skipped: 0, Time elapsed: 0.37 sec
    [junit] Running org.apache.nutch.parse.TestParseText
    [junit] Tests run: 1, Failures: 0, Errors: 0, Skipped: 0, Time elapsed: 0.301 sec
    [junit] Running org.apache.nutch.parse.TestParserFactory
    [junit] Tests run: 2, Failures: 0, Errors: 0, Skipped: 0, Time elapsed: 3.25 sec
    [junit] Running org.apache.nutch.plugin.TestPluginSystem
    [junit] Tests run: 7, Failures: 0, Errors: 0, Skipped: 0, Time elapsed: 2.785 sec
    [junit] Running org.apache.nutch.protocol.TestContent
    [junit] Tests run: 2, Failures: 0, Errors: 0, Skipped: 0, Time elapsed: 1.108 sec
    [junit] Running org.apache.nutch.protocol.TestProtocolFactory
    [junit] Tests run: 2, Failures: 0, Errors: 0, Skipped: 0, Time elapsed: 1.294 sec
    [junit] Running org.apache.nutch.segment.TestSegmentMerger
    [junit] Tests run: 1, Failures: 0, Errors: 0, Skipped: 0, Time elapsed: 172.043 sec
    [junit] Running org.apache.nutch.segment.TestSegmentMergerCrawlDatums
    [junit] Tests run: 7, Failures: 0, Errors: 0, Skipped: 0, Time elapsed: 142.543 sec
    [junit] Running org.apache.nutch.service.TestNutchServer
    [junit] Tests run: 1, Failures: 0, Errors: 0, Skipped: 0, Time elapsed: 2.194 sec
    [junit] Running org.apache.nutch.tools.TestCommonCrawlDataDumper
    [junit] Tests run: 1, Failures: 0, Errors: 0, Skipped: 0, Time elapsed: 3.056 sec
    [junit] Running org.apache.nutch.util.TestEncodingDetector
    [junit] Tests run: 1, Failures: 0, Errors: 0, Skipped: 0, Time elapsed: 1.034 sec
    [junit] Running org.apache.nutch.util.TestGZIPUtils
    [junit] Tests run: 3, Failures: 0, Errors: 0, Skipped: 0, Time elapsed: 0.446 sec
    [junit] Running org.apache.nutch.util.TestMimeUtil
    [junit] Tests run: 4, Failures: 0, Errors: 0, Skipped: 0, Time elapsed: 1.875 sec
    [junit] Running org.apache.nutch.util.TestNodeWalker
    [junit] Tests run: 1, Failures: 0, Errors: 0, Skipped: 0, Time elapsed: 0.303 sec
    [junit] Running org.apache.nutch.util.TestPrefixStringMatcher
    [junit] Tests run: 1, Failures: 0, Errors: 0, Skipped: 0, Time elapsed: 0.142 sec
    [junit] Running org.apache.nutch.util.TestStringUtil
    [junit] Tests run: 1, Failures: 0, Errors: 0, Skipped: 0, Time elapsed: 0.097 sec
    [junit] Running org.apache.nutch.util.TestSuffixStringMatcher
    [junit] Tests run: 1, Failures: 0, Errors: 0, Skipped: 0, Time elapsed: 0.128 sec
    [junit] Running org.apache.nutch.util.TestTableUtil
    [junit] Tests run: 2, Failures: 0, Errors: 0, Skipped: 0, Time elapsed: 0.106 sec
    [junit] Running org.apache.nutch.util.TestURLUtil
    [junit] Tests run: 8, Failures: 0, Errors: 0, Skipped: 0, Time elapsed: 0.965 sec

BUILD FAILED
<https://builds.apache.org/job/Nutch-trunk/ws/build.xml>:497: Tests failed!

Total time: 10 minutes 24 seconds
Build step 'Invoke Ant' marked build as failure
Publishing Javadoc
[xUnit] [INFO] - Starting to record.
[xUnit] [INFO] - Processing JUnit
[xUnit] [INFO] - [JUnit] - 35 test report file(s) were found with the pattern 'build/test/TEST-*.xml'
relative to '<https://builds.apache.org/job/Nutch-trunk/ws/'> for the testing framework
'JUnit'.
[xUnit] [INFO] - Converting '<https://builds.apache.org/job/Nutch-trunk/ws/build/test/TEST-org.apache.nutch.crawl.TestAdaptiveFetchSchedule.xml'>
.
[xUnit] [INFO] - Converting '<https://builds.apache.org/job/Nutch-trunk/ws/build/test/TEST-org.apache.nutch.crawl.TestCrawlDbFilter.xml'>
.
[xUnit] [INFO] - Converting '<https://builds.apache.org/job/Nutch-trunk/ws/build/test/TEST-org.apache.nutch.crawl.TestCrawlDbMerger.xml'>
.
[xUnit] [INFO] - Converting '<https://builds.apache.org/job/Nutch-trunk/ws/build/test/TEST-org.apache.nutch.crawl.TestCrawlDbStates.xml'>
.
[xUnit] [INFO] - Converting '<https://builds.apache.org/job/Nutch-trunk/ws/build/test/TEST-org.apache.nutch.crawl.TestGenerator.xml'>
.
[xUnit] [INFO] - Converting '<https://builds.apache.org/job/Nutch-trunk/ws/build/test/TEST-org.apache.nutch.crawl.TestInjector.xml'>
.
[xUnit] [INFO] - Converting '<https://builds.apache.org/job/Nutch-trunk/ws/build/test/TEST-org.apache.nutch.crawl.TestLinkDbMerger.xml'>
.
[xUnit] [INFO] - Converting '<https://builds.apache.org/job/Nutch-trunk/ws/build/test/TEST-org.apache.nutch.crawl.TestSignatureFactory.xml'>
.
[xUnit] [INFO] - Converting '<https://builds.apache.org/job/Nutch-trunk/ws/build/test/TEST-org.apache.nutch.fetcher.TestFetcher.xml'>
.
[xUnit] [INFO] - Converting '<https://builds.apache.org/job/Nutch-trunk/ws/build/test/TEST-org.apache.nutch.indexer.TestIndexerMapReduce.xml'>
.
[xUnit] [INFO] - Converting '<https://builds.apache.org/job/Nutch-trunk/ws/build/test/TEST-org.apache.nutch.indexer.TestIndexingFilters.xml'>
.
[xUnit] [INFO] - Converting '<https://builds.apache.org/job/Nutch-trunk/ws/build/test/TEST-org.apache.nutch.metadata.TestMetadata.xml'>
.
[xUnit] [INFO] - Converting '<https://builds.apache.org/job/Nutch-trunk/ws/build/test/TEST-org.apache.nutch.metadata.TestSpellCheckedMetadata.xml'>
.
[xUnit] [INFO] - Converting '<https://builds.apache.org/job/Nutch-trunk/ws/build/test/TEST-org.apache.nutch.net.TestURLFilters.xml'>
.
[xUnit] [INFO] - Converting '<https://builds.apache.org/job/Nutch-trunk/ws/build/test/TEST-org.apache.nutch.net.TestURLNormalizers.xml'>
.
[xUnit] [INFO] - Converting '<https://builds.apache.org/job/Nutch-trunk/ws/build/test/TEST-org.apache.nutch.parse.TestOutlinkExtractor.xml'>
.
[xUnit] [INFO] - Converting '<https://builds.apache.org/job/Nutch-trunk/ws/build/test/TEST-org.apache.nutch.parse.TestParseData.xml'>
.
[xUnit] [INFO] - Converting '<https://builds.apache.org/job/Nutch-trunk/ws/build/test/TEST-org.apache.nutch.parse.TestParseText.xml'>
.
[xUnit] [INFO] - Converting '<https://builds.apache.org/job/Nutch-trunk/ws/build/test/TEST-org.apache.nutch.parse.TestParserFactory.xml'>
.
[xUnit] [INFO] - Converting '<https://builds.apache.org/job/Nutch-trunk/ws/build/test/TEST-org.apache.nutch.plugin.TestPluginSystem.xml'>
.
[xUnit] [INFO] - Converting '<https://builds.apache.org/job/Nutch-trunk/ws/build/test/TEST-org.apache.nutch.protocol.TestContent.xml'>
.
[xUnit] [INFO] - Converting '<https://builds.apache.org/job/Nutch-trunk/ws/build/test/TEST-org.apache.nutch.protocol.TestProtocolFactory.xml'>
.
[xUnit] [INFO] - Converting '<https://builds.apache.org/job/Nutch-trunk/ws/build/test/TEST-org.apache.nutch.segment.TestSegmentMerger.xml'>
.
[xUnit] [INFO] - Converting '<https://builds.apache.org/job/Nutch-trunk/ws/build/test/TEST-org.apache.nutch.segment.TestSegmentMergerCrawlDatums.xml'>
.
[xUnit] [INFO] - Converting '<https://builds.apache.org/job/Nutch-trunk/ws/build/test/TEST-org.apache.nutch.service.TestNutchServer.xml'>
.
[xUnit] [INFO] - Converting '<https://builds.apache.org/job/Nutch-trunk/ws/build/test/TEST-org.apache.nutch.tools.TestCommonCrawlDataDumper.xml'>
.
[xUnit] [INFO] - Converting '<https://builds.apache.org/job/Nutch-trunk/ws/build/test/TEST-org.apache.nutch.util.TestEncodingDetector.xml'>
.
[xUnit] [INFO] - Converting '<https://builds.apache.org/job/Nutch-trunk/ws/build/test/TEST-org.apache.nutch.util.TestGZIPUtils.xml'>
.
[xUnit] [INFO] - Converting '<https://builds.apache.org/job/Nutch-trunk/ws/build/test/TEST-org.apache.nutch.util.TestMimeUtil.xml'>
.
[xUnit] [INFO] - Converting '<https://builds.apache.org/job/Nutch-trunk/ws/build/test/TEST-org.apache.nutch.util.TestNodeWalker.xml'>
.
[xUnit] [INFO] - Converting '<https://builds.apache.org/job/Nutch-trunk/ws/build/test/TEST-org.apache.nutch.util.TestPrefixStringMatcher.xml'>
.
[xUnit] [INFO] - Converting '<https://builds.apache.org/job/Nutch-trunk/ws/build/test/TEST-org.apache.nutch.util.TestStringUtil.xml'>
.
[xUnit] [INFO] - Converting '<https://builds.apache.org/job/Nutch-trunk/ws/build/test/TEST-org.apache.nutch.util.TestSuffixStringMatcher.xml'>
.
[xUnit] [INFO] - Converting '<https://builds.apache.org/job/Nutch-trunk/ws/build/test/TEST-org.apache.nutch.util.TestTableUtil.xml'>
.
[xUnit] [INFO] - Converting '<https://builds.apache.org/job/Nutch-trunk/ws/build/test/TEST-org.apache.nutch.util.TestURLUtil.xml'>
.
[xUnit] [INFO] - Processing JUnit
[xUnit] [INFO] - [JUnit] - 35 test report file(s) were found with the pattern 'build/**/test/TEST-*.xml'
relative to '<https://builds.apache.org/job/Nutch-trunk/ws/'> for the testing framework
'JUnit'.
[xUnit] [INFO] - Converting '<https://builds.apache.org/job/Nutch-trunk/ws/build/test/TEST-org.apache.nutch.crawl.TestAdaptiveFetchSchedule.xml'>
.
[xUnit] [INFO] - Converting '<https://builds.apache.org/job/Nutch-trunk/ws/build/test/TEST-org.apache.nutch.crawl.TestCrawlDbFilter.xml'>
.
[xUnit] [INFO] - Converting '<https://builds.apache.org/job/Nutch-trunk/ws/build/test/TEST-org.apache.nutch.crawl.TestCrawlDbMerger.xml'>
.
[xUnit] [INFO] - Converting '<https://builds.apache.org/job/Nutch-trunk/ws/build/test/TEST-org.apache.nutch.crawl.TestCrawlDbStates.xml'>
.
[xUnit] [INFO] - Converting '<https://builds.apache.org/job/Nutch-trunk/ws/build/test/TEST-org.apache.nutch.crawl.TestGenerator.xml'>
.
[xUnit] [INFO] - Converting '<https://builds.apache.org/job/Nutch-trunk/ws/build/test/TEST-org.apache.nutch.crawl.TestInjector.xml'>
.
[xUnit] [INFO] - Converting '<https://builds.apache.org/job/Nutch-trunk/ws/build/test/TEST-org.apache.nutch.crawl.TestLinkDbMerger.xml'>
.
[xUnit] [INFO] - Converting '<https://builds.apache.org/job/Nutch-trunk/ws/build/test/TEST-org.apache.nutch.crawl.TestSignatureFactory.xml'>
.
[xUnit] [INFO] - Converting '<https://builds.apache.org/job/Nutch-trunk/ws/build/test/TEST-org.apache.nutch.fetcher.TestFetcher.xml'>
.
[xUnit] [INFO] - Converting '<https://builds.apache.org/job/Nutch-trunk/ws/build/test/TEST-org.apache.nutch.indexer.TestIndexerMapReduce.xml'>
.
[xUnit] [INFO] - Converting '<https://builds.apache.org/job/Nutch-trunk/ws/build/test/TEST-org.apache.nutch.indexer.TestIndexingFilters.xml'>
.
[xUnit] [INFO] - Converting '<https://builds.apache.org/job/Nutch-trunk/ws/build/test/TEST-org.apache.nutch.metadata.TestMetadata.xml'>
.
[xUnit] [INFO] - Converting '<https://builds.apache.org/job/Nutch-trunk/ws/build/test/TEST-org.apache.nutch.metadata.TestSpellCheckedMetadata.xml'>
.
[xUnit] [INFO] - Converting '<https://builds.apache.org/job/Nutch-trunk/ws/build/test/TEST-org.apache.nutch.net.TestURLFilters.xml'>
.
[xUnit] [INFO] - Converting '<https://builds.apache.org/job/Nutch-trunk/ws/build/test/TEST-org.apache.nutch.net.TestURLNormalizers.xml'>
.
[xUnit] [INFO] - Converting '<https://builds.apache.org/job/Nutch-trunk/ws/build/test/TEST-org.apache.nutch.parse.TestOutlinkExtractor.xml'>
.
[xUnit] [INFO] - Converting '<https://builds.apache.org/job/Nutch-trunk/ws/build/test/TEST-org.apache.nutch.parse.TestParseData.xml'>
.
[xUnit] [INFO] - Converting '<https://builds.apache.org/job/Nutch-trunk/ws/build/test/TEST-org.apache.nutch.parse.TestParseText.xml'>
.
[xUnit] [INFO] - Converting '<https://builds.apache.org/job/Nutch-trunk/ws/build/test/TEST-org.apache.nutch.parse.TestParserFactory.xml'>
.
[xUnit] [INFO] - Converting '<https://builds.apache.org/job/Nutch-trunk/ws/build/test/TEST-org.apache.nutch.plugin.TestPluginSystem.xml'>
.
[xUnit] [INFO] - Converting '<https://builds.apache.org/job/Nutch-trunk/ws/build/test/TEST-org.apache.nutch.protocol.TestContent.xml'>
.
[xUnit] [INFO] - Converting '<https://builds.apache.org/job/Nutch-trunk/ws/build/test/TEST-org.apache.nutch.protocol.TestProtocolFactory.xml'>
.
[xUnit] [INFO] - Converting '<https://builds.apache.org/job/Nutch-trunk/ws/build/test/TEST-org.apache.nutch.segment.TestSegmentMerger.xml'>
.
[xUnit] [INFO] - Converting '<https://builds.apache.org/job/Nutch-trunk/ws/build/test/TEST-org.apache.nutch.segment.TestSegmentMergerCrawlDatums.xml'>
.
[xUnit] [INFO] - Converting '<https://builds.apache.org/job/Nutch-trunk/ws/build/test/TEST-org.apache.nutch.service.TestNutchServer.xml'>
.
[xUnit] [INFO] - Converting '<https://builds.apache.org/job/Nutch-trunk/ws/build/test/TEST-org.apache.nutch.tools.TestCommonCrawlDataDumper.xml'>
.
[xUnit] [INFO] - Converting '<https://builds.apache.org/job/Nutch-trunk/ws/build/test/TEST-org.apache.nutch.util.TestEncodingDetector.xml'>
.
[xUnit] [INFO] - Converting '<https://builds.apache.org/job/Nutch-trunk/ws/build/test/TEST-org.apache.nutch.util.TestGZIPUtils.xml'>
.
[xUnit] [INFO] - Converting '<https://builds.apache.org/job/Nutch-trunk/ws/build/test/TEST-org.apache.nutch.util.TestMimeUtil.xml'>
.
[xUnit] [INFO] - Converting '<https://builds.apache.org/job/Nutch-trunk/ws/build/test/TEST-org.apache.nutch.util.TestNodeWalker.xml'>
.
[xUnit] [INFO] - Converting '<https://builds.apache.org/job/Nutch-trunk/ws/build/test/TEST-org.apache.nutch.util.TestPrefixStringMatcher.xml'>
.
[xUnit] [INFO] - Converting '<https://builds.apache.org/job/Nutch-trunk/ws/build/test/TEST-org.apache.nutch.util.TestStringUtil.xml'>
.
[xUnit] [INFO] - Converting '<https://builds.apache.org/job/Nutch-trunk/ws/build/test/TEST-org.apache.nutch.util.TestSuffixStringMatcher.xml'>
.
[xUnit] [INFO] - Converting '<https://builds.apache.org/job/Nutch-trunk/ws/build/test/TEST-org.apache.nutch.util.TestTableUtil.xml'>
.
[xUnit] [INFO] - Converting '<https://builds.apache.org/job/Nutch-trunk/ws/build/test/TEST-org.apache.nutch.util.TestURLUtil.xml'>
.
[xUnit] [INFO] - Check 'Failed Tests' threshold.
[xUnit] [INFO] - Check 'Skipped Tests' threshold.
[xUnit] [INFO] - Setting the build status to FAILURE
[xUnit] [INFO] - Stopping recording.
Updating NUTCH-1553

Mime
View raw message