nutch-dev mailing list archives

Site index · List index
Message view « Date » · « Thread »
Top « Date » · « Thread »
From Apache Jenkins Server <jenk...@builds.apache.org>
Subject Build failed in Jenkins: Nutch-trunk #3402
Date Tue, 13 Dec 2016 13:57:08 GMT
See <https://builds.apache.org/job/Nutch-trunk/3402/changes>

Changes:

[snagel] NUTCH-2337 urlnormalizer-basic to strip empty port, closes #160 - make

------------------------------------------
[...truncated 11300 lines...]
  [javadoc] import org.apache.lucene.analysis.en.PorterStemFilter;
  [javadoc]                                     ^
  [javadoc] <https://builds.apache.org/job/Nutch-trunk/ws/src/plugin/scoring-similarity/src/java/org/apache/nutch/scoring/similarity/util/LuceneAnalyzerUtil.java>:29:
error: package org.apache.lucene.analysis.standard does not exist
  [javadoc] import org.apache.lucene.analysis.standard.ClassicTokenizer;
  [javadoc]                                           ^
  [javadoc] <https://builds.apache.org/job/Nutch-trunk/ws/src/plugin/scoring-similarity/src/java/org/apache/nutch/scoring/similarity/util/LuceneAnalyzerUtil.java>:30:
error: package org.apache.lucene.analysis.standard does not exist
  [javadoc] import org.apache.lucene.analysis.standard.StandardAnalyzer;
  [javadoc]                                           ^
  [javadoc] <https://builds.apache.org/job/Nutch-trunk/ws/src/plugin/scoring-similarity/src/java/org/apache/nutch/scoring/similarity/util/LuceneAnalyzerUtil.java>:31:
error: package org.apache.lucene.analysis.util does not exist
  [javadoc] import org.apache.lucene.analysis.util.CharArraySet;
  [javadoc]                                       ^
  [javadoc] <https://builds.apache.org/job/Nutch-trunk/ws/src/plugin/scoring-similarity/src/java/org/apache/nutch/scoring/similarity/util/LuceneAnalyzerUtil.java>:37:
error: cannot find symbol
  [javadoc] public class LuceneAnalyzerUtil extends Analyzer{ 
  [javadoc]                                         ^
  [javadoc]   symbol: class Analyzer
  [javadoc] <https://builds.apache.org/job/Nutch-trunk/ws/src/plugin/scoring-similarity/src/java/org/apache/nutch/scoring/similarity/util/LuceneTokenizer.java>:22:
error: package org.apache.lucene.analysis does not exist
  [javadoc] import org.apache.lucene.analysis.Tokenizer;
  [javadoc]                                  ^
  [javadoc] <https://builds.apache.org/job/Nutch-trunk/ws/src/plugin/scoring-similarity/src/java/org/apache/nutch/scoring/similarity/util/LuceneTokenizer.java>:23:
error: package org.apache.lucene.analysis does not exist
  [javadoc] import org.apache.lucene.analysis.TokenStream;
  [javadoc]                                  ^
  [javadoc] <https://builds.apache.org/job/Nutch-trunk/ws/src/plugin/scoring-similarity/src/java/org/apache/nutch/scoring/similarity/util/LuceneTokenizer.java>:24:
error: package org.apache.lucene.analysis.core does not exist
  [javadoc] import org.apache.lucene.analysis.core.LowerCaseFilter;
  [javadoc]                                       ^
  [javadoc] <https://builds.apache.org/job/Nutch-trunk/ws/src/plugin/scoring-similarity/src/java/org/apache/nutch/scoring/similarity/util/LuceneTokenizer.java>:25:
error: package org.apache.lucene.analysis.core does not exist
  [javadoc] import org.apache.lucene.analysis.core.StopFilter;
  [javadoc]                                       ^
  [javadoc] <https://builds.apache.org/job/Nutch-trunk/ws/src/plugin/scoring-similarity/src/java/org/apache/nutch/scoring/similarity/util/LuceneTokenizer.java>:26:
error: package org.apache.lucene.analysis.en does not exist
  [javadoc] import org.apache.lucene.analysis.en.EnglishMinimalStemFilter;
  [javadoc]                                     ^
  [javadoc] <https://builds.apache.org/job/Nutch-trunk/ws/src/plugin/scoring-similarity/src/java/org/apache/nutch/scoring/similarity/util/LuceneTokenizer.java>:27:
error: package org.apache.lucene.analysis.en does not exist
  [javadoc] import org.apache.lucene.analysis.en.PorterStemFilter;
  [javadoc]                                     ^
  [javadoc] <https://builds.apache.org/job/Nutch-trunk/ws/src/plugin/scoring-similarity/src/java/org/apache/nutch/scoring/similarity/util/LuceneTokenizer.java>:28:
error: package org.apache.lucene.analysis.standard does not exist
  [javadoc] import org.apache.lucene.analysis.standard.ClassicTokenizer;
  [javadoc]                                           ^
  [javadoc] <https://builds.apache.org/job/Nutch-trunk/ws/src/plugin/scoring-similarity/src/java/org/apache/nutch/scoring/similarity/util/LuceneTokenizer.java>:29:
error: package org.apache.lucene.analysis.standard does not exist
  [javadoc] import org.apache.lucene.analysis.standard.StandardAnalyzer;
  [javadoc]                                           ^
  [javadoc] <https://builds.apache.org/job/Nutch-trunk/ws/src/plugin/scoring-similarity/src/java/org/apache/nutch/scoring/similarity/util/LuceneTokenizer.java>:30:
error: package org.apache.lucene.analysis.standard does not exist
  [javadoc] import org.apache.lucene.analysis.standard.StandardTokenizer;
  [javadoc]                                           ^
  [javadoc] <https://builds.apache.org/job/Nutch-trunk/ws/src/plugin/scoring-similarity/src/java/org/apache/nutch/scoring/similarity/util/LuceneTokenizer.java>:31:
error: package org.apache.lucene.analysis.shingle does not exist
  [javadoc] import org.apache.lucene.analysis.shingle.ShingleFilter;
  [javadoc]                                          ^
  [javadoc] <https://builds.apache.org/job/Nutch-trunk/ws/src/plugin/scoring-similarity/src/java/org/apache/nutch/scoring/similarity/util/LuceneTokenizer.java>:32:
error: package org.apache.lucene.analysis.util does not exist
  [javadoc] import org.apache.lucene.analysis.util.CharArraySet;
  [javadoc]                                       ^
  [javadoc] <https://builds.apache.org/job/Nutch-trunk/ws/src/plugin/scoring-similarity/src/java/org/apache/nutch/scoring/similarity/util/LuceneAnalyzerUtil.java>:42:
error: cannot find symbol
  [javadoc]   private static CharArraySet stopSet;
  [javadoc]                  ^
  [javadoc]   symbol:   class CharArraySet
  [javadoc]   location: class LuceneAnalyzerUtil
  [javadoc] <https://builds.apache.org/job/Nutch-trunk/ws/src/plugin/scoring-similarity/src/java/org/apache/nutch/scoring/similarity/util/LuceneAnalyzerUtil.java>:73:
error: cannot find symbol
  [javadoc]   protected TokenStreamComponents createComponents(String fieldName) {
  [javadoc]             ^
  [javadoc]   symbol:   class TokenStreamComponents
  [javadoc]   location: class LuceneAnalyzerUtil
  [javadoc] <https://builds.apache.org/job/Nutch-trunk/ws/src/plugin/scoring-similarity/src/java/org/apache/nutch/scoring/similarity/util/LuceneTokenizer.java>:37:
error: cannot find symbol
  [javadoc]   private TokenStream tokenStream; 
  [javadoc]           ^
  [javadoc]   symbol:   class TokenStream
  [javadoc]   location: class LuceneTokenizer
  [javadoc] <https://builds.apache.org/job/Nutch-trunk/ws/src/plugin/scoring-similarity/src/java/org/apache/nutch/scoring/similarity/util/LuceneTokenizer.java>:40:
error: cannot find symbol
  [javadoc]   private CharArraySet stopSet = null;
  [javadoc]           ^
  [javadoc]   symbol:   class CharArraySet
  [javadoc]   location: class LuceneTokenizer
  [javadoc] <https://builds.apache.org/job/Nutch-trunk/ws/src/plugin/scoring-similarity/src/java/org/apache/nutch/scoring/similarity/util/LuceneTokenizer.java>:89:
error: cannot find symbol
  [javadoc]   public TokenStream getTokenStream() {
  [javadoc]          ^
  [javadoc]   symbol:   class TokenStream
  [javadoc]   location: class LuceneTokenizer
  [javadoc] <https://builds.apache.org/job/Nutch-trunk/ws/src/plugin/scoring-similarity/src/java/org/apache/nutch/scoring/similarity/util/LuceneTokenizer.java>:107:
error: cannot find symbol
  [javadoc]   private TokenStream createTokenStream(String content) {
  [javadoc]           ^
  [javadoc]   symbol:   class TokenStream
  [javadoc]   location: class LuceneTokenizer
  [javadoc] <https://builds.apache.org/job/Nutch-trunk/ws/src/plugin/scoring-similarity/src/java/org/apache/nutch/scoring/similarity/util/LuceneTokenizer.java>:117:
error: cannot find symbol
  [javadoc]   private TokenStream generateTokenStreamFromText(String content, TokenizerType
tokenizerType){
  [javadoc]           ^
  [javadoc]   symbol:   class TokenStream
  [javadoc]   location: class LuceneTokenizer
  [javadoc] <https://builds.apache.org/job/Nutch-trunk/ws/src/plugin/scoring-similarity/src/java/org/apache/nutch/scoring/similarity/util/LuceneTokenizer.java>:136:
error: cannot find symbol
  [javadoc]   private TokenStream createNGramTokenStream(String content, int mingram, int
maxgram) {
  [javadoc]           ^
  [javadoc]   symbol:   class TokenStream
  [javadoc]   location: class LuceneTokenizer
  [javadoc] <https://builds.apache.org/job/Nutch-trunk/ws/src/plugin/scoring-similarity/src/java/org/apache/nutch/scoring/similarity/util/LuceneTokenizer.java>:147:
error: cannot find symbol
  [javadoc]   private TokenStream applyStopFilter(CharArraySet stopWords) {
  [javadoc]                                       ^
  [javadoc]   symbol:   class CharArraySet
  [javadoc]   location: class LuceneTokenizer
  [javadoc] <https://builds.apache.org/job/Nutch-trunk/ws/src/plugin/scoring-similarity/src/java/org/apache/nutch/scoring/similarity/util/LuceneTokenizer.java>:147:
error: cannot find symbol
  [javadoc]   private TokenStream applyStopFilter(CharArraySet stopWords) {
  [javadoc]           ^
  [javadoc]   symbol:   class TokenStream
  [javadoc]   location: class LuceneTokenizer
  [javadoc] <https://builds.apache.org/job/Nutch-trunk/ws/src/plugin/scoring-similarity/src/java/org/apache/nutch/scoring/similarity/util/LuceneTokenizer.java>:152:
error: cannot find symbol
  [javadoc]   private TokenStream applyStemmer(StemFilterType stemFilterType) {
  [javadoc]           ^
  [javadoc]   symbol:   class TokenStream
  [javadoc]   location: class LuceneTokenizer
  [javadoc] <https://builds.apache.org/job/Nutch-trunk/ws/src/plugin/urlfilter-automaton/src/java/org/apache/nutch/urlfilter/automaton/AutomatonURLFilter.java>:29:
error: package dk.brics.automaton does not exist
  [javadoc] import dk.brics.automaton.RegExp;
  [javadoc]                          ^
  [javadoc] <https://builds.apache.org/job/Nutch-trunk/ws/src/plugin/urlfilter-automaton/src/java/org/apache/nutch/urlfilter/automaton/AutomatonURLFilter.java>:30:
error: package dk.brics.automaton does not exist
  [javadoc] import dk.brics.automaton.RunAutomaton;
  [javadoc]                          ^
  [javadoc] <https://builds.apache.org/job/Nutch-trunk/ws/src/plugin/urlfilter-automaton/src/java/org/apache/nutch/urlfilter/automaton/AutomatonURLFilter.java>:99:
error: cannot find symbol
  [javadoc]     private RunAutomaton automaton;
  [javadoc]             ^
  [javadoc]   symbol:   class RunAutomaton
  [javadoc]   location: class AutomatonURLFilter.Rule
  [javadoc] Standard Doclet version 1.7.0_80
  [javadoc] Building tree for all the packages and classes...
  [javadoc] <https://builds.apache.org/job/Nutch-trunk/ws/src/java/org/apache/nutch/hostdb/ReadHostDb.java>:57:
warning - Tag @see:illegal character: "58" in "http://commons.apache.org/proper/commons-jexl/reference/syntax.html"
  [javadoc] <https://builds.apache.org/job/Nutch-trunk/ws/src/java/org/apache/nutch/hostdb/ReadHostDb.java>:57:
warning - Tag @see:illegal character: "47" in "http://commons.apache.org/proper/commons-jexl/reference/syntax.html"
  [javadoc] <https://builds.apache.org/job/Nutch-trunk/ws/src/java/org/apache/nutch/hostdb/ReadHostDb.java>:57:
warning - Tag @see:illegal character: "47" in "http://commons.apache.org/proper/commons-jexl/reference/syntax.html"
  [javadoc] <https://builds.apache.org/job/Nutch-trunk/ws/src/java/org/apache/nutch/hostdb/ReadHostDb.java>:57:
warning - Tag @see:illegal character: "47" in "http://commons.apache.org/proper/commons-jexl/reference/syntax.html"
  [javadoc] <https://builds.apache.org/job/Nutch-trunk/ws/src/java/org/apache/nutch/hostdb/ReadHostDb.java>:57:
warning - Tag @see:illegal character: "47" in "http://commons.apache.org/proper/commons-jexl/reference/syntax.html"
  [javadoc] <https://builds.apache.org/job/Nutch-trunk/ws/src/java/org/apache/nutch/hostdb/ReadHostDb.java>:57:
warning - Tag @see:illegal character: "45" in "http://commons.apache.org/proper/commons-jexl/reference/syntax.html"
  [javadoc] <https://builds.apache.org/job/Nutch-trunk/ws/src/java/org/apache/nutch/hostdb/ReadHostDb.java>:57:
warning - Tag @see:illegal character: "47" in "http://commons.apache.org/proper/commons-jexl/reference/syntax.html"
  [javadoc] <https://builds.apache.org/job/Nutch-trunk/ws/src/java/org/apache/nutch/hostdb/ReadHostDb.java>:57:
warning - Tag @see:illegal character: "47" in "http://commons.apache.org/proper/commons-jexl/reference/syntax.html"
  [javadoc] <https://builds.apache.org/job/Nutch-trunk/ws/src/plugin/index-anchor/src/java/org/apache/nutch/indexer/anchor/AnchorIndexingFilter.java>:38:
warning - Tag @see:illegal character: "123" in "{@code anchorIndexingFilter.deduplicate} in
nutch-default.xml."
  [javadoc] <https://builds.apache.org/job/Nutch-trunk/ws/src/plugin/index-anchor/src/java/org/apache/nutch/indexer/anchor/AnchorIndexingFilter.java>:38:
warning - Tag @see:illegal character: "64" in "{@code anchorIndexingFilter.deduplicate} in
nutch-default.xml."
  [javadoc] <https://builds.apache.org/job/Nutch-trunk/ws/src/java/org/apache/nutch/fetcher/FetcherThreadEvent.java>:74:
warning - @return tag has no arguments.
  [javadoc] <https://builds.apache.org/job/Nutch-trunk/ws/src/java/org/apache/nutch/hostdb/ReadHostDb.java>:57:
warning - Tag @see: reference not found: http://commons.apache.org/proper/commons-jexl/reference/syntax.html
  [javadoc] <https://builds.apache.org/job/Nutch-trunk/ws/src/java/org/apache/nutch/hostdb/UpdateHostDbMapper.java>:69:
warning - @param argument "JobConf" is not a parameter name.
  [javadoc] <https://builds.apache.org/job/Nutch-trunk/ws/src/java/org/apache/nutch/hostdb/UpdateHostDbMapper.java>:69:
warning - @return tag cannot be used in method with void return type.
  [javadoc] <https://builds.apache.org/job/Nutch-trunk/ws/src/java/org/apache/nutch/hostdb/UpdateHostDbMapper.java>:86:
warning - @param argument "String" is not a parameter name.
  [javadoc] <https://builds.apache.org/job/Nutch-trunk/ws/src/java/org/apache/nutch/hostdb/UpdateHostDbMapper.java>:117:
warning - @param argument "Text" is not a parameter name.
  [javadoc] <https://builds.apache.org/job/Nutch-trunk/ws/src/java/org/apache/nutch/hostdb/UpdateHostDbMapper.java>:117:
warning - @param argument "Writable" is not a parameter name.
  [javadoc] <https://builds.apache.org/job/Nutch-trunk/ws/src/java/org/apache/nutch/hostdb/UpdateHostDbMapper.java>:117:
warning - @param argument "OutputCollector<Text,NutchWritable>" is not a parameter name.
  [javadoc] <https://builds.apache.org/job/Nutch-trunk/ws/src/java/org/apache/nutch/hostdb/UpdateHostDbMapper.java>:117:
warning - @param argument "Reporter" is not a parameter name.
  [javadoc] <https://builds.apache.org/job/Nutch-trunk/ws/src/java/org/apache/nutch/hostdb/UpdateHostDbMapper.java>:117:
warning - @return tag cannot be used in method with void return type.
  [javadoc] <https://builds.apache.org/job/Nutch-trunk/ws/src/java/org/apache/nutch/hostdb/UpdateHostDbReducer.java>:78:
warning - @param argument "JobConf" is not a parameter name.
  [javadoc] <https://builds.apache.org/job/Nutch-trunk/ws/src/java/org/apache/nutch/hostdb/UpdateHostDbReducer.java>:363:
warning - @param argument "HostDatum" is not a parameter name.
  [javadoc] <https://builds.apache.org/job/Nutch-trunk/ws/src/java/org/apache/nutch/hostdb/UpdateHostDbReducer.java>:389:
warning - @param argument "HostDatum" is not a parameter name.
  [javadoc] <https://builds.apache.org/job/Nutch-trunk/ws/src/java/org/apache/nutch/parse/ParseResult.java>:80:
warning - @return tag has no arguments.
  [javadoc] <https://builds.apache.org/job/Nutch-trunk/ws/src/java/org/apache/nutch/protocol/RobotRulesParser.java>:61:
warning - Tag @link: reference not found: getRobotRulesSet
  [javadoc] <https://builds.apache.org/job/Nutch-trunk/ws/src/java/org/apache/nutch/service/impl/ConfManagerImpl.java>:92:
warning - @param argument "NutchConfig" is not a parameter name.
  [javadoc] <https://builds.apache.org/job/Nutch-trunk/ws/src/java/org/apache/nutch/service/impl/NutchServerPoolExecutor.java>:77:
warning - @return tag has no arguments.
  [javadoc] <https://builds.apache.org/job/Nutch-trunk/ws/src/java/org/apache/nutch/service/impl/NutchServerPoolExecutor.java>:92:
warning - @return tag has no arguments.
  [javadoc] <https://builds.apache.org/job/Nutch-trunk/ws/src/java/org/apache/nutch/service/impl/NutchServerPoolExecutor.java>:100:
warning - @return tag has no arguments.
  [javadoc] <https://builds.apache.org/job/Nutch-trunk/ws/src/java/org/apache/nutch/service/impl/NutchServerPoolExecutor.java>:109:
warning - @return tag has no arguments.
  [javadoc] <https://builds.apache.org/job/Nutch-trunk/ws/src/java/org/apache/nutch/service/resources/AdminResource.java>:43:
warning - @return tag has no arguments.
  [javadoc] <https://builds.apache.org/job/Nutch-trunk/ws/src/java/org/apache/nutch/service/resources/AdminResource.java>:59:
warning - @return tag has no arguments.
  [javadoc] <https://builds.apache.org/job/Nutch-trunk/ws/src/java/org/apache/nutch/service/resources/JobResource.java>:72:
warning - @return tag has no arguments.
  [javadoc] <https://builds.apache.org/job/Nutch-trunk/ws/src/java/org/apache/nutch/service/resources/ReaderResouce.java>:101:
warning - @return tag has no arguments.
  [javadoc] <https://builds.apache.org/job/Nutch-trunk/ws/src/java/org/apache/nutch/service/resources/ReaderResouce.java>:118:
warning - @return tag has no arguments.
  [javadoc] <https://builds.apache.org/job/Nutch-trunk/ws/src/java/org/apache/nutch/service/resources/ReaderResouce.java>:143:
warning - @return tag has no arguments.
  [javadoc] <https://builds.apache.org/job/Nutch-trunk/ws/src/java/org/apache/nutch/service/resources/SeedResource.java>:54:
warning - @return tag has no arguments.
  [javadoc] <https://builds.apache.org/job/Nutch-trunk/ws/src/java/org/apache/nutch/service/resources/SeedResource.java>:73:
warning - @return tag has no arguments.
  [javadoc] <https://builds.apache.org/job/Nutch-trunk/ws/src/java/org/apache/nutch/tools/CommonCrawlFormat.java>:53:
warning - @return tag has no arguments.
  [javadoc] <https://builds.apache.org/job/Nutch-trunk/ws/src/java/org/apache/nutch/tools/CommonCrawlFormat.java>:65:
warning - @return tag has no arguments.
  [javadoc] <https://builds.apache.org/job/Nutch-trunk/ws/src/java/org/apache/nutch/tools/AbstractCommonCrawlFormat.java>:45:
warning - Tag @see cannot be used in inline documentation.  It can only be used in the following
types of documentation: overview, package, class/interface, constructor, field, method.
  [javadoc] <https://builds.apache.org/job/Nutch-trunk/ws/src/java/org/apache/nutch/tools/AbstractCommonCrawlFormat.java>:45:
warning - Tag @see cannot be used in inline documentation.  It can only be used in the following
types of documentation: overview, package, class/interface, constructor, field, method.
  [javadoc] <https://builds.apache.org/job/Nutch-trunk/ws/src/java/org/apache/nutch/tools/CommonCrawlFormat.java>:43:
warning - @param argument "mapAll" is not a parameter name.
  [javadoc] <https://builds.apache.org/job/Nutch-trunk/ws/src/java/org/apache/nutch/tools/CommonCrawlFormatFactory.java>:30:
warning - Tag @see cannot be used in inline documentation.  It can only be used in the following
types of documentation: overview, package, class/interface, constructor, field, method.
  [javadoc] <https://builds.apache.org/job/Nutch-trunk/ws/src/java/org/apache/nutch/tools/CommonCrawlFormatFactory.java>:30:
warning - Tag @see cannot be used in inline documentation.  It can only be used in the following
types of documentation: overview, package, class/interface, constructor, field, method.
  [javadoc] <https://builds.apache.org/job/Nutch-trunk/ws/src/java/org/apache/nutch/tools/CommonCrawlFormatFactory.java>:44:
warning - Tag @see cannot be used in inline documentation.  It can only be used in the following
types of documentation: overview, package, class/interface, constructor, field, method.
  [javadoc] <https://builds.apache.org/job/Nutch-trunk/ws/src/java/org/apache/nutch/tools/CommonCrawlFormatFactory.java>:44:
warning - Tag @see cannot be used in inline documentation.  It can only be used in the following
types of documentation: overview, package, class/interface, constructor, field, method.
  [javadoc] <https://builds.apache.org/job/Nutch-trunk/ws/src/java/org/apache/nutch/tools/CommonCrawlFormatFactory.java>:44:
warning - Tag @see cannot be used in inline documentation.  It can only be used in the following
types of documentation: overview, package, class/interface, constructor, field, method.
  [javadoc] <https://builds.apache.org/job/Nutch-trunk/ws/src/java/org/apache/nutch/tools/CommonCrawlFormatSimple.java>:30:
warning - Tag @see cannot be used in inline documentation.  It can only be used in the following
types of documentation: overview, package, class/interface, constructor, field, method.
  [javadoc] <https://builds.apache.org/job/Nutch-trunk/ws/src/java/org/apache/nutch/tools/CommonCrawlFormatSimple.java>:30:
warning - Tag @see cannot be used in inline documentation.  It can only be used in the following
types of documentation: overview, package, class/interface, constructor, field, method.
  [javadoc] <https://builds.apache.org/job/Nutch-trunk/ws/src/java/org/apache/nutch/tools/arc/ArcRecordReader.java>:55:
warning - Tag @link:illegal character: "58" in "http://www.archive.org/ "
  [javadoc] <https://builds.apache.org/job/Nutch-trunk/ws/src/java/org/apache/nutch/tools/arc/ArcRecordReader.java>:55:
warning - Tag @link:illegal character: "47" in "http://www.archive.org/ "
  [javadoc] <https://builds.apache.org/job/Nutch-trunk/ws/src/java/org/apache/nutch/tools/arc/ArcRecordReader.java>:55:
warning - Tag @link:illegal character: "47" in "http://www.archive.org/ "
  [javadoc] <https://builds.apache.org/job/Nutch-trunk/ws/src/java/org/apache/nutch/tools/arc/ArcRecordReader.java>:55:
warning - Tag @link:illegal character: "47" in "http://www.archive.org/ "
  [javadoc] <https://builds.apache.org/job/Nutch-trunk/ws/src/java/org/apache/nutch/tools/arc/ArcRecordReader.java>:55:
warning - Tag @link:illegal character: "58" in "http://www.grub.org/ "
  [javadoc] <https://builds.apache.org/job/Nutch-trunk/ws/src/java/org/apache/nutch/tools/arc/ArcRecordReader.java>:55:
warning - Tag @link:illegal character: "47" in "http://www.grub.org/ "
  [javadoc] <https://builds.apache.org/job/Nutch-trunk/ws/src/java/org/apache/nutch/tools/arc/ArcRecordReader.java>:55:
warning - Tag @link:illegal character: "47" in "http://www.grub.org/ "
  [javadoc] <https://builds.apache.org/job/Nutch-trunk/ws/src/java/org/apache/nutch/tools/arc/ArcRecordReader.java>:55:
warning - Tag @link:illegal character: "47" in "http://www.grub.org/ "
  [javadoc] <https://builds.apache.org/job/Nutch-trunk/ws/src/java/org/apache/nutch/tools/arc/ArcRecordReader.java>:55:
warning - Tag @link: reference not found: http
  [javadoc]  ://www.archive.org/web/researcher/ArcFileFormat.php 
  [javadoc] <https://builds.apache.org/job/Nutch-trunk/ws/src/java/org/apache/nutch/tools/arc/ArcRecordReader.java>:55:
warning - Tag @link: reference not found: http://www.archive.org/ 
  [javadoc] <https://builds.apache.org/job/Nutch-trunk/ws/src/java/org/apache/nutch/tools/arc/ArcRecordReader.java>:55:
warning - Tag @link: reference not found: http://www.grub.org/ 
  [javadoc] <https://builds.apache.org/job/Nutch-trunk/ws/src/java/org/apache/nutch/util/MimeUtil.java>:237:
warning - Tag @link: reference not found: URL
  [javadoc] <https://builds.apache.org/job/Nutch-trunk/ws/src/java/org/apache/nutch/util/TableUtil.java>:41:
warning - @param argument "url" is not a parameter name.
  [javadoc] <https://builds.apache.org/job/Nutch-trunk/ws/src/java/org/apache/nutch/webui/client/NutchClient.java>:48:
warning - @return tag has no arguments.
  [javadoc] <https://builds.apache.org/job/Nutch-trunk/ws/src/plugin/feed/src/java/org/apache/nutch/indexer/feed/FeedIndexingFilter.java>:70:
warning - Tag @link: reference not found: Indexer
  [javadoc] <https://builds.apache.org/job/Nutch-trunk/ws/src/plugin/feed/src/java/org/apache/nutch/indexer/feed/FeedIndexingFilter.java>:70:
warning - Tag @link: reference not found: Indexer
  [javadoc] <https://builds.apache.org/job/Nutch-trunk/ws/src/plugin/index-anchor/src/java/org/apache/nutch/indexer/anchor/AnchorIndexingFilter.java>:38:
warning - Tag @see: reference not found: {@code anchorIndexingFilter.deduplicate} in nutch-default.xml.
  [javadoc] <https://builds.apache.org/job/Nutch-trunk/ws/src/plugin/index-more/src/java/org/apache/nutch/indexer/more/MoreIndexingFilter.java>:186:
warning - @return tag has no arguments.
  [javadoc] <https://builds.apache.org/job/Nutch-trunk/ws/src/plugin/index-more/src/java/org/apache/nutch/indexer/more/MoreIndexingFilter.java>:253:
warning - @return tag has no arguments.
  [javadoc] <https://builds.apache.org/job/Nutch-trunk/ws/src/plugin/index-replace/src/java/org/apache/nutch/indexer/replace/FieldReplacer.java>:141:
warning - @return tag has no arguments.
  [javadoc] <https://builds.apache.org/job/Nutch-trunk/ws/src/plugin/index-replace/src/java/org/apache/nutch/indexer/replace/FieldReplacer.java>:158:
warning - @return tag has no arguments.
  [javadoc] <https://builds.apache.org/job/Nutch-trunk/ws/src/plugin/indexer-solr/src/java/org/apache/nutch/indexwriter/solr/SolrUtils.java>:41:
warning - @param argument "JobConf" is not a parameter name.
  [javadoc] <https://builds.apache.org/job/Nutch-trunk/ws/src/plugin/lib-htmlunit/src/java/org/apache/nutch/protocol/htmlunit/HtmlUnitWebDriver.java>:140:
warning - Tag @link: reference not found: org.openqa.selenium.WebDriver
  [javadoc] <https://builds.apache.org/job/Nutch-trunk/ws/src/plugin/lib-htmlunit/src/java/org/apache/nutch/protocol/htmlunit/HtmlUnitWebDriver.java>:140:
warning - Tag @link: reference not found: org.openqa.selenium.WebDriver
  [javadoc] <https://builds.apache.org/job/Nutch-trunk/ws/src/plugin/lib-selenium/src/java/org/apache/nutch/protocol/selenium/HttpWebClient.java>:187:
warning - Tag @link: reference not found: org.openqa.selenium.WebDriver
  [javadoc] <https://builds.apache.org/job/Nutch-trunk/ws/src/plugin/lib-selenium/src/java/org/apache/nutch/protocol/selenium/HttpWebClient.java>:187:
warning - Tag @link: reference not found: org.openqa.selenium.WebDriver
  [javadoc] <https://builds.apache.org/job/Nutch-trunk/ws/src/plugin/protocol-file/src/java/org/apache/nutch/protocol/file/FileResponse.java>:279:
warning - @return tag has no arguments.
  [javadoc] <https://builds.apache.org/job/Nutch-trunk/ws/src/plugin/protocol-ftp/src/java/org/apache/nutch/protocol/ftp/Client.java>:149:
warning - @return tag has no arguments.
  [javadoc] <https://builds.apache.org/job/Nutch-trunk/ws/src/plugin/protocol-ftp/src/java/org/apache/nutch/protocol/ftp/Client.java>:474:
warning - @return tag has no arguments.
  [javadoc] <https://builds.apache.org/job/Nutch-trunk/ws/src/plugin/scoring-similarity/src/java/org/apache/nutch/scoring/similarity/util/LuceneTokenizer.java>:89:
warning - @return tag has no arguments.
  [javadoc] <https://builds.apache.org/job/Nutch-trunk/ws/src/plugin/scoring-similarity/src/java/org/apache/nutch/scoring/similarity/util/LuceneTokenizer.java>:69:
warning - @param argument "stopSet" is not a parameter name.
  [javadoc] <https://builds.apache.org/job/Nutch-trunk/ws/src/plugin/subcollection/src/java/org/apache/nutch/indexer/subcollection/SubcollectionIndexingFilter.java>:55:
warning - @param argument "Configuration" is not a parameter name.
  [javadoc] <https://builds.apache.org/job/Nutch-trunk/ws/src/plugin/urlmeta/src/java/org/apache/nutch/scoring/urlmeta/URLMetaScoringFilter.java>:44:
warning - Tag @see: reference not found: URLMetaIndexingFilter
  [javadoc] <https://builds.apache.org/job/Nutch-trunk/ws/src/java/org/apache/nutch/tools/AbstractCommonCrawlFormat.java>:45:
warning - Tag @see cannot be used in inline documentation.  It can only be used in the following
types of documentation: overview, package, class/interface, constructor, field, method.
  [javadoc] <https://builds.apache.org/job/Nutch-trunk/ws/src/java/org/apache/nutch/tools/CommonCrawlFormatFactory.java>:30:
warning - Tag @see cannot be used in inline documentation.  It can only be used in the following
types of documentation: overview, package, class/interface, constructor, field, method.
  [javadoc] <https://builds.apache.org/job/Nutch-trunk/ws/src/java/org/apache/nutch/tools/CommonCrawlFormatSimple.java>:30:
warning - Tag @see cannot be used in inline documentation.  It can only be used in the following
types of documentation: overview, package, class/interface, constructor, field, method.
  [javadoc] <https://builds.apache.org/job/Nutch-trunk/ws/src/plugin/feed/src/java/org/apache/nutch/indexer/feed/FeedIndexingFilter.java>:70:
warning - Tag @link: reference not found: Indexer
  [javadoc] <https://builds.apache.org/job/Nutch-trunk/ws/src/plugin/feed/src/java/org/apache/nutch/indexer/feed/FeedIndexingFilter.java>:70:
warning - Tag @link: reference not found: Indexer
  [javadoc] <https://builds.apache.org/job/Nutch-trunk/ws/src/plugin/feed/src/java/org/apache/nutch/indexer/feed/FeedIndexingFilter.java>:70:
warning - Tag @link: reference not found: Indexer
  [javadoc] <https://builds.apache.org/job/Nutch-trunk/ws/src/plugin/feed/src/java/org/apache/nutch/indexer/feed/FeedIndexingFilter.java>:70:
warning - Tag @link: reference not found: Indexer
  [javadoc] <https://builds.apache.org/job/Nutch-trunk/ws/src/plugin/feed/src/java/org/apache/nutch/indexer/feed/FeedIndexingFilter.java>:70:
warning - Tag @link: reference not found: Indexer
  [javadoc] <https://builds.apache.org/job/Nutch-trunk/ws/src/plugin/feed/src/java/org/apache/nutch/indexer/feed/FeedIndexingFilter.java>:70:
warning - Tag @link: reference not found: Indexer
  [javadoc] <https://builds.apache.org/job/Nutch-trunk/ws/src/java/org/apache/nutch/tools/CommonCrawlFormatSimple.java>:30:
warning - Tag @see cannot be used in inline documentation.  It can only be used in the following
types of documentation: overview, package, class/interface, constructor, field, method.
  [javadoc] <https://builds.apache.org/job/Nutch-trunk/ws/src/java/org/apache/nutch/tools/AbstractCommonCrawlFormat.java>:45:
warning - Tag @see cannot be used in inline documentation.  It can only be used in the following
types of documentation: overview, package, class/interface, constructor, field, method.
  [javadoc] <https://builds.apache.org/job/Nutch-trunk/ws/src/java/org/apache/nutch/tools/CommonCrawlFormatSimple.java>:30:
warning - Tag @see cannot be used in inline documentation.  It can only be used in the following
types of documentation: overview, package, class/interface, constructor, field, method.
  [javadoc] Building index for all the packages and classes...
  [javadoc] <https://builds.apache.org/job/Nutch-trunk/ws/src/java/org/apache/nutch/tools/AbstractCommonCrawlFormat.java>:45:
warning - Tag @see cannot be used in inline documentation.  It can only be used in the following
types of documentation: overview, package, class/interface, constructor, field, method.
  [javadoc] <https://builds.apache.org/job/Nutch-trunk/ws/src/java/org/apache/nutch/tools/AbstractCommonCrawlFormat.java>:45:
warning - Tag @see cannot be used in inline documentation.  It can only be used in the following
types of documentation: overview, package, class/interface, constructor, field, method.
  [javadoc] <https://builds.apache.org/job/Nutch-trunk/ws/src/java/org/apache/nutch/tools/CommonCrawlFormatFactory.java>:30:
warning - Tag @see cannot be used in inline documentation.  It can only be used in the following
types of documentation: overview, package, class/interface, constructor, field, method.
  [javadoc] <https://builds.apache.org/job/Nutch-trunk/ws/src/java/org/apache/nutch/tools/CommonCrawlFormatSimple.java>:30:
warning - Tag @see cannot be used in inline documentation.  It can only be used in the following
types of documentation: overview, package, class/interface, constructor, field, method.
  [javadoc] <https://builds.apache.org/job/Nutch-trunk/ws/src/plugin/feed/src/java/org/apache/nutch/indexer/feed/FeedIndexingFilter.java>:70:
warning - Tag @link: reference not found: Indexer
  [javadoc] <https://builds.apache.org/job/Nutch-trunk/ws/src/plugin/lib-htmlunit/src/java/org/apache/nutch/protocol/htmlunit/HtmlUnitWebDriver.java>:140:
warning - Tag @link: reference not found: org.openqa.selenium.WebDriver
  [javadoc] <https://builds.apache.org/job/Nutch-trunk/ws/src/plugin/lib-selenium/src/java/org/apache/nutch/protocol/selenium/HttpWebClient.java>:187:
warning - Tag @link: reference not found: org.openqa.selenium.WebDriver
  [javadoc] Building index for all classes...
  [javadoc] Generating <https://builds.apache.org/job/Nutch-trunk/ws/build/docs/api/help-doc.html...>
  [javadoc] 290 warnings

BUILD SUCCESSFUL
Total time: 11 minutes 21 seconds
[xUnit] [INFO] - Starting to record.
[xUnit] [INFO] - Processing JUnit
[xUnit] [INFO] - [JUnit] - 35 test report file(s) were found with the pattern 'build/test/TEST-*.xml'
relative to '<https://builds.apache.org/job/Nutch-trunk/ws/'> for the testing framework
'JUnit'.
[xUnit] [ERROR] - Clock on this slave is out of sync with the master, and therefore 
I can't figure out what test results are new and what are old.
Please keep the slave clock in sync with the master.
[xUnit] [INFO] - Failing BUILD.
[xUnit] [INFO] - There are errors when processing test results.
[xUnit] [INFO] - Skipping tests recording.
[xUnit] [INFO] - Stop build.
Build step 'Process xUnit test result report' changed build result to FAILURE
Publishing Javadoc
[xUnit] [INFO] - Starting to record.
[xUnit] [INFO] - Processing JUnit
[xUnit] [INFO] - [JUnit] - 35 test report file(s) were found with the pattern 'build/test/TEST-*.xml'
relative to '<https://builds.apache.org/job/Nutch-trunk/ws/'> for the testing framework
'JUnit'.
[xUnit] [ERROR] - Clock on this slave is out of sync with the master, and therefore 
I can't figure out what test results are new and what are old.
Please keep the slave clock in sync with the master.
[xUnit] [INFO] - Failing BUILD.
[xUnit] [INFO] - There are errors when processing test results.
[xUnit] [INFO] - Skipping tests recording.
[xUnit] [INFO] - Stop build.
Updating NUTCH-2337

Mime
View raw message