nutch-dev mailing list archives

Site index · List index
Message view « Date » · « Thread »
Top « Date » · « Thread »
From Apache Jenkins Server <jenk...@builds.apache.org>
Subject Build failed in Jenkins: Nutch-trunk #3425
Date Sat, 15 Apr 2017 11:31:55 GMT
See <https://builds.apache.org/job/Nutch-trunk/3425/display/redirect?page=changes>

Changes:

[gitRoann3l;fhdez] Fixes for NUTCH-2333: Added the lines for ant runtime task

[gitRoann3l;fhdez] Fixes for NUTCH-2333: Added the logic for indexing process

[gitRoann3l;fhdez] Fixes for NUTCH-2333: Added the properties for RabbitMQ indexer.

[gitRoann3l;fhdez] Fixes for NUTCH-2333: Added new properties to indexer

[gitRoann3l;fhdez] Fixes for NUTCH-2132: Added the library amqp

[gitRoann3l;fhdez] Fixes for NUTCH-2132: Added new properties

[gitRoann3l;fhdez] Fixes for NUTCH-2132: Deleted empty comments

[gitRoann3l;fhdez] Fixes for NUTCH-2132: Fixed the default port

[gitRoann3l;fhdez] Fixes for NUTCH-2333: Corrected some comments in the configuration file

[omkarreddy2008] NUTCH-2372 Fixing the errors in documentation

------------------------------------------
[...truncated 312.81 KB...]
[ivy:resolve] downloading http://repo1.maven.org/maven2/net/sf/ehcache/ehcache-core/2.6.2/ehcache-core-2.6.2.jar
...
[ivy:resolve] ............................... (1306kB)
[ivy:resolve] .. (0kB)
[ivy:resolve] 	[SUCCESSFUL ] net.sf.ehcache#ehcache-core;2.6.2!ehcache-core.jar (25ms)
[ivy:resolve] downloading http://repo1.maven.org/maven2/com/google/guava/guava/17.0/guava-17.0.jar
...
[ivy:resolve] ................................................... (2190kB)
[ivy:resolve] .. (0kB)
[ivy:resolve] 	[SUCCESSFUL ] com.google.guava#guava;17.0!guava.jar(bundle) (37ms)
[ivy:resolve] downloading http://repo1.maven.org/maven2/com/beust/jcommander/1.35/jcommander-1.35.jar
...
[ivy:resolve] .. (59kB)
[ivy:resolve] .. (0kB)
[ivy:resolve] 	[SUCCESSFUL ] com.beust#jcommander;1.35!jcommander.jar (8ms)
[ivy:resolve] downloading http://repo1.maven.org/maven2/org/apache/httpcomponents/httpmime/4.2.6/httpmime-4.2.6.jar
...
[ivy:resolve] ... (26kB)
[ivy:resolve] .. (0kB)
[ivy:resolve] 	[SUCCESSFUL ] org.apache.httpcomponents#httpmime;4.2.6!httpmime.jar (8ms)
[ivy:resolve] downloading http://repo1.maven.org/maven2/c3p0/c3p0/0.9.1.1/c3p0-0.9.1.1.jar
...
[ivy:resolve] ............... (594kB)
[ivy:resolve] .. (0kB)
[ivy:resolve] 	[SUCCESSFUL ] c3p0#c3p0;0.9.1.1!c3p0.jar (15ms)
[ivy:resolve] downloading http://repo1.maven.org/maven2/javax/measure/jsr-275/0.9.3/jsr-275-0.9.3.jar
...
[ivy:resolve] ...... (253kB)
[ivy:resolve] .. (0kB)
[ivy:resolve] 	[SUCCESSFUL ] javax.measure#jsr-275;0.9.3!jsr-275.jar (11ms)
[ivy:resolve] downloading http://repo1.maven.org/maven2/org/apache/sis/storage/sis-storage/0.5/sis-storage-0.5.jar
...
[ivy:resolve] ... (68kB)
[ivy:resolve] .. (0kB)
[ivy:resolve] 	[SUCCESSFUL ] org.apache.sis.storage#sis-storage;0.5!sis-storage.jar(bundle)
(9ms)
[ivy:resolve] downloading http://repo1.maven.org/maven2/org/apache/sis/core/sis-referencing/0.5/sis-referencing-0.5.jar
...
[ivy:resolve] .......... (400kB)
[ivy:resolve] .. (0kB)
[ivy:resolve] 	[SUCCESSFUL ] org.apache.sis.core#sis-referencing;0.5!sis-referencing.jar(bundle)
(12ms)

compile:
     [echo] Compiling plugin: parse-tika
    [javac] Compiling 7 source files to <https://builds.apache.org/job/Nutch-trunk/ws/build/parse-tika/classes>
    [javac] Creating empty <https://builds.apache.org/job/Nutch-trunk/ws/build/parse-tika/classes/org/apache/nutch/parse/tika/package-info.class>

jar:
      [jar] Building jar: <https://builds.apache.org/job/Nutch-trunk/ws/build/parse-tika/parse-tika.jar>

deps-test:

init:

init-plugin:

clean-lib:

resolve-default:
[ivy:resolve] :: loading settings :: file = <https://builds.apache.org/job/Nutch-trunk/ws/ivy/ivysettings.xml>

compile:

jar:

deps-test:

deploy:

copy-generated-lib:

init:

init-plugin:

deps-jar:

clean-lib:

resolve-default:
[ivy:resolve] :: loading settings :: file = <https://builds.apache.org/job/Nutch-trunk/ws/ivy/ivysettings.xml>

compile:
     [echo] Compiling plugin: protocol-file

jar:

deps-test:

deploy:

copy-generated-lib:

init:

init-plugin:

clean-lib:

resolve-default:
[ivy:resolve] :: loading settings :: file = <https://builds.apache.org/job/Nutch-trunk/ws/ivy/ivysettings.xml>

compile:

jar:

deps-test:

deploy:

copy-generated-lib:

deploy:
     [copy] Copying 1 file to <https://builds.apache.org/job/Nutch-trunk/ws/build/plugins/parse-tika>

copy-generated-lib:
     [copy] Copying 1 file to <https://builds.apache.org/job/Nutch-trunk/ws/build/plugins/parse-tika>
    [mkdir] Created dir: <https://builds.apache.org/job/Nutch-trunk/ws/build/parse-zip/test/data>
     [copy] Copying 1 file to <https://builds.apache.org/job/Nutch-trunk/ws/build/parse-zip/test/data>

init:
    [mkdir] Created dir: <https://builds.apache.org/job/Nutch-trunk/ws/build/parse-zip/classes>
    [mkdir] Created dir: <https://builds.apache.org/job/Nutch-trunk/ws/build/parse-zip/test/lib>
    [mkdir] Created dir: <https://builds.apache.org/job/Nutch-trunk/ws/build/plugins/parse-zip>

init-plugin:

deps-jar:

clean-lib:

resolve-default:
[ivy:resolve] :: loading settings :: file = <https://builds.apache.org/job/Nutch-trunk/ws/ivy/ivysettings.xml>

compile:
     [echo] Compiling plugin: parse-zip
    [javac] Compiling 3 source files to <https://builds.apache.org/job/Nutch-trunk/ws/build/parse-zip/classes>
    [javac] Creating empty <https://builds.apache.org/job/Nutch-trunk/ws/build/parse-zip/classes/org/apache/nutch/parse/zip/package-info.class>

jar:
      [jar] Building jar: <https://builds.apache.org/job/Nutch-trunk/ws/build/parse-zip/parse-zip.jar>

deps-test:

init:

init-plugin:

clean-lib:

resolve-default:
[ivy:resolve] :: loading settings :: file = <https://builds.apache.org/job/Nutch-trunk/ws/ivy/ivysettings.xml>

compile:

jar:

deps-test:

deploy:

copy-generated-lib:

init:

init-plugin:

deps-jar:

clean-lib:

resolve-default:
[ivy:resolve] :: loading settings :: file = <https://builds.apache.org/job/Nutch-trunk/ws/ivy/ivysettings.xml>

compile:
     [echo] Compiling plugin: protocol-file

jar:

deps-test:

deploy:

copy-generated-lib:

deploy:
     [copy] Copying 1 file to <https://builds.apache.org/job/Nutch-trunk/ws/build/plugins/parse-zip>

copy-generated-lib:
     [copy] Copying 1 file to <https://builds.apache.org/job/Nutch-trunk/ws/build/plugins/parse-zip>

init:
    [mkdir] Created dir: <https://builds.apache.org/job/Nutch-trunk/ws/build/publish-rabbitmq>
    [mkdir] Created dir: <https://builds.apache.org/job/Nutch-trunk/ws/build/publish-rabbitmq/classes>
    [mkdir] Created dir: <https://builds.apache.org/job/Nutch-trunk/ws/build/publish-rabbitmq/test>
    [mkdir] Created dir: <https://builds.apache.org/job/Nutch-trunk/ws/build/publish-rabbitmq/test/lib>
    [mkdir] Created dir: <https://builds.apache.org/job/Nutch-trunk/ws/build/plugins/publish-rabbitmq>

init-plugin:

deps-jar:

clean-lib:

resolve-default:
[ivy:resolve] :: loading settings :: file = <https://builds.apache.org/job/Nutch-trunk/ws/ivy/ivysettings.xml>

compile:
     [echo] Compiling plugin: publish-rabbitmq
    [javac] Compiling 2 source files to <https://builds.apache.org/job/Nutch-trunk/ws/build/publish-rabbitmq/classes>
    [javac] <https://builds.apache.org/job/Nutch-trunk/ws/src/plugin/publish-rabbitmq/src/java/org/apache/nutch/publisher/rabbitmq/RabbitMQPublisherImpl.java>:39:
error: ';' expected
    [javac]   private static String HOST
    [javac]                             ^
    [javac] 1 error

BUILD FAILED
<https://builds.apache.org/job/Nutch-trunk/ws/build.xml>:116: The following error occurred
while executing this line:
<https://builds.apache.org/job/Nutch-trunk/ws/src/plugin/build.xml>:70: The following
error occurred while executing this line:
<https://builds.apache.org/job/Nutch-trunk/ws/src/plugin/build-plugin.xml>:133: Compile
failed; see the compiler error output for details.

Total time: 3 minutes 32 seconds
Build step 'Invoke Ant' marked build as failure
Publishing Javadoc
[xUnit] [INFO] - Starting to record.
[xUnit] [INFO] - Processing JUnit
[xUnit] [INFO] - [JUnit] - No test report file(s) were found with the pattern 'build/test/TEST-*.xml'
relative to '<https://builds.apache.org/job/Nutch-trunk/ws/'> for the testing framework
'JUnit'.  Did you enter a pattern relative to the correct directory?  Did you generate the
result report(s) for 'JUnit'?
[xUnit] [ERROR] - No test reports found for the metric 'JUnit' with the resolved pattern 'build/test/TEST-*.xml'.
Configuration error?.
[xUnit] [INFO] - Failing BUILD.
[xUnit] [INFO] - There are errors when processing test results.
[xUnit] [INFO] - Skipping tests recording.
[xUnit] [INFO] - Stop build.
[JIRA] Updating issue NUTCH-2333
[JIRA] Updating issue NUTCH-2132
[JIRA] Updating issue NUTCH-2372
ERROR: Unable to send to address: gitRoann3l;fhdez@apache.org
javax.mail.internet.AddressException: Illegal semicolon, not in group in string ``gitRoann3l;fhdez@apache.org''
at position 10
	at javax.mail.internet.InternetAddress.parse(InternetAddress.java:921)
	at javax.mail.internet.InternetAddress.parse(InternetAddress.java:633)
	at javax.mail.internet.InternetAddress.<init>(InternetAddress.java:111)
	at hudson.tasks.Mailer.stringToAddress(Mailer.java:206)
	at jenkins.plugins.mailer.tasks.MimeMessageBuilder.toNormalizedAddress(MimeMessageBuilder.java:309)
	at jenkins.plugins.mailer.tasks.MimeMessageBuilder.addRecipients(MimeMessageBuilder.java:168)
	at jenkins.plugins.mailer.tasks.MimeMessageBuilder.addRecipients(MimeMessageBuilder.java:160)
	at hudson.tasks.MailSender.createEmptyMail(MailSender.java:392)
	at hudson.tasks.MailSender.createFailureMail(MailSender.java:265)
	at hudson.tasks.MailSender.createMail(MailSender.java:179)
	at hudson.tasks.MailSender.run(MailSender.java:110)
	at hudson.tasks.Mailer.perform(Mailer.java:170)
	at hudson.tasks.BuildStepCompatibilityLayer.perform(BuildStepCompatibilityLayer.java:78)
	at hudson.tasks.BuildStepMonitor$1.perform(BuildStepMonitor.java:20)
	at hudson.model.AbstractBuild$AbstractBuildExecution.perform(AbstractBuild.java:779)
	at hudson.model.AbstractBuild$AbstractBuildExecution.performAllBuildSteps(AbstractBuild.java:720)
	at hudson.model.Build$BuildExecution.post2(Build.java:185)
	at hudson.model.AbstractBuild$AbstractBuildExecution.post(AbstractBuild.java:665)
	at hudson.model.Run.execute(Run.java:1753)
	at hudson.model.FreeStyleBuild.run(FreeStyleBuild.java:43)
	at hudson.model.ResourceController.execute(ResourceController.java:98)
	at hudson.model.Executor.run(Executor.java:404)

Mime
View raw message