nutch-dev mailing list archives

Site index · List index
Message view « Date » · « Thread »
Top « Date » · « Thread »
From Apache Jenkins Server <jenk...@builds.apache.org>
Subject Build failed in Jenkins: Nutch-trunk #3590
Date Mon, 19 Nov 2018 21:43:59 GMT
See <https://builds.apache.org/job/Nutch-trunk/3590/display/redirect?page=changes>

Changes:

[snagel] NUTCH-2606 MIME detection is wrong for plain-text documents send as

[snagel] NUTCH-2668 Integrate OWASP dependency checks as ant target - add ant

[snagel] NUTCH-1842: crawl.gen.delay value is read incorrectly from config - add

------------------------------------------
Started by an SCM change
[EnvInject] - Loading node environment variables.
Building remotely on ubuntu-4 (ubuntu trusty) in workspace <https://builds.apache.org/job/Nutch-trunk/ws/>
 > git rev-parse --is-inside-work-tree # timeout=10
Fetching changes from the remote Git repository
 > git config remote.origin.url https://github.com/apache/nutch.git # timeout=10
Fetching upstream changes from https://github.com/apache/nutch.git
 > git --version # timeout=10
 > git fetch --tags --progress https://github.com/apache/nutch.git +refs/heads/*:refs/remotes/origin/*
 > git rev-parse refs/remotes/origin/master^{commit} # timeout=10
 > git rev-parse refs/remotes/origin/origin/master^{commit} # timeout=10
Checking out Revision 785a52f897cab00711417be8fd002b32f8b2c93e (refs/remotes/origin/master)
 > git config core.sparsecheckout # timeout=10
 > git checkout -f 785a52f897cab00711417be8fd002b32f8b2c93e
Commit message: "Merge pull request #401 from sebastian-nagel/dependency-check"
 > git rev-list --no-walk f861c8203c8544b91e061964441485bd2f6de145 # timeout=10
[Nutch-trunk] $ /home/jenkins/tools/ant/latest/bin/ant -file build.xml -Dtest.junit.output.format=xml
clean nightly javadoc
Buildfile: <https://builds.apache.org/job/Nutch-trunk/ws/build.xml>
Trying to override old definition of task javac

BUILD FAILED
<https://builds.apache.org/job/Nutch-trunk/ws/build.xml>:627: <https://builds.apache.org/job/Nutch-trunk/ws/ivy/dependency-check-ant/lib>
does not exist.

Total time: 0 seconds
Build step 'Invoke Ant' marked build as failure
Publishing Javadoc
INFO: Starting to record.
INFO: Processing JUnit
INFO: [JUnit] - 36 test report file(s) were found with the pattern 'build/test/TEST-*.xml'
relative to '<https://builds.apache.org/job/Nutch-trunk/ws/'> for the testing framework
'JUnit'.
ERROR: Step ?Publish xUnit test result report? aborted due to exception: 
Also:   hudson.remoting.Channel$CallSiteStackTrace: Remote call to ubuntu-4
		at hudson.remoting.Channel.attachCallSiteStackTrace(Channel.java:1741)
		at hudson.remoting.UserRequest$ExceptionResponse.retrieve(UserRequest.java:357)
		at hudson.remoting.Channel.call(Channel.java:955)
		at hudson.FilePath.act(FilePath.java:1036)
		at hudson.FilePath.act(FilePath.java:1025)
		at org.jenkinsci.plugins.xunit.XUnitProcessor.processTestsReport(XUnitProcessor.java:174)
		at org.jenkinsci.plugins.xunit.XUnitProcessor.process(XUnitProcessor.java:144)
		at org.jenkinsci.plugins.xunit.XUnitPublisher.perform(XUnitPublisher.java:127)
		at hudson.tasks.BuildStepCompatibilityLayer.perform(BuildStepCompatibilityLayer.java:81)
		at hudson.tasks.BuildStepMonitor$1.perform(BuildStepMonitor.java:20)
		at hudson.model.AbstractBuild$AbstractBuildExecution.perform(AbstractBuild.java:744)
		at hudson.model.AbstractBuild$AbstractBuildExecution.performAllBuildSteps(AbstractBuild.java:690)
		at hudson.model.Build$BuildExecution.post2(Build.java:186)
		at hudson.model.AbstractBuild$AbstractBuildExecution.post(AbstractBuild.java:635)
		at hudson.model.Run.execute(Run.java:1819)
		at hudson.model.FreeStyleBuild.run(FreeStyleBuild.java:43)
		at hudson.model.ResourceController.execute(ResourceController.java:97)
		at hudson.model.Executor.run(Executor.java:429)
org.jenkinsci.plugins.xunit.service.NoNewTestReportException: Test reports were found but
not all of them are new. Did all the tests run?
  * <https://builds.apache.org/job/Nutch-trunk/ws/build/test/TEST-org.apache.nutch.crawl.TestAdaptiveFetchSchedule.xml>
is 5 days 11 hr old
  * <https://builds.apache.org/job/Nutch-trunk/ws/build/test/TEST-org.apache.nutch.crawl.TestCrawlDbFilter.xml>
is 5 days 11 hr old
  * <https://builds.apache.org/job/Nutch-trunk/ws/build/test/TEST-org.apache.nutch.crawl.TestCrawlDbMerger.xml>
is 5 days 11 hr old
  * <https://builds.apache.org/job/Nutch-trunk/ws/build/test/TEST-org.apache.nutch.crawl.TestCrawlDbStates.xml>
is 5 days 11 hr old
  * <https://builds.apache.org/job/Nutch-trunk/ws/build/test/TEST-org.apache.nutch.crawl.TestGenerator.xml>
is 5 days 11 hr old
  * <https://builds.apache.org/job/Nutch-trunk/ws/build/test/TEST-org.apache.nutch.crawl.TestInjector.xml>
is 5 days 11 hr old
  * <https://builds.apache.org/job/Nutch-trunk/ws/build/test/TEST-org.apache.nutch.crawl.TestLinkDbMerger.xml>
is 5 days 11 hr old
  * <https://builds.apache.org/job/Nutch-trunk/ws/build/test/TEST-org.apache.nutch.crawl.TestSignatureFactory.xml>
is 5 days 11 hr old
  * <https://builds.apache.org/job/Nutch-trunk/ws/build/test/TEST-org.apache.nutch.fetcher.TestFetcher.xml>
is 5 days 11 hr old
  * <https://builds.apache.org/job/Nutch-trunk/ws/build/test/TEST-org.apache.nutch.indexer.TestIndexerMapReduce.xml>
is 5 days 11 hr old
  * <https://builds.apache.org/job/Nutch-trunk/ws/build/test/TEST-org.apache.nutch.indexer.TestIndexingFilters.xml>
is 5 days 11 hr old
  * <https://builds.apache.org/job/Nutch-trunk/ws/build/test/TEST-org.apache.nutch.metadata.TestMetadata.xml>
is 5 days 11 hr old
  * <https://builds.apache.org/job/Nutch-trunk/ws/build/test/TEST-org.apache.nutch.metadata.TestSpellCheckedMetadata.xml>
is 5 days 11 hr old
  * <https://builds.apache.org/job/Nutch-trunk/ws/build/test/TEST-org.apache.nutch.net.TestURLFilters.xml>
is 5 days 11 hr old
  * <https://builds.apache.org/job/Nutch-trunk/ws/build/test/TEST-org.apache.nutch.net.TestURLNormalizers.xml>
is 5 days 11 hr old
  * <https://builds.apache.org/job/Nutch-trunk/ws/build/test/TEST-org.apache.nutch.parse.TestOutlinkExtractor.xml>
is 5 days 11 hr old
  * <https://builds.apache.org/job/Nutch-trunk/ws/build/test/TEST-org.apache.nutch.parse.TestOutlinks.xml>
is 5 days 11 hr old
  * <https://builds.apache.org/job/Nutch-trunk/ws/build/test/TEST-org.apache.nutch.parse.TestParseData.xml>
is 5 days 11 hr old
  * <https://builds.apache.org/job/Nutch-trunk/ws/build/test/TEST-org.apache.nutch.parse.TestParseText.xml>
is 5 days 11 hr old
  * <https://builds.apache.org/job/Nutch-trunk/ws/build/test/TEST-org.apache.nutch.parse.TestParserFactory.xml>
is 5 days 11 hr old
  * <https://builds.apache.org/job/Nutch-trunk/ws/build/test/TEST-org.apache.nutch.plugin.TestPluginSystem.xml>
is 5 days 11 hr old
  * <https://builds.apache.org/job/Nutch-trunk/ws/build/test/TEST-org.apache.nutch.protocol.TestContent.xml>
is 5 days 11 hr old
  * <https://builds.apache.org/job/Nutch-trunk/ws/build/test/TEST-org.apache.nutch.protocol.TestProtocolFactory.xml>
is 5 days 11 hr old
  * <https://builds.apache.org/job/Nutch-trunk/ws/build/test/TEST-org.apache.nutch.segment.TestSegmentMerger.xml>
is 5 days 11 hr old
  * <https://builds.apache.org/job/Nutch-trunk/ws/build/test/TEST-org.apache.nutch.segment.TestSegmentMergerCrawlDatums.xml>
is 5 days 11 hr old
  * <https://builds.apache.org/job/Nutch-trunk/ws/build/test/TEST-org.apache.nutch.service.TestNutchServer.xml>
is 5 days 11 hr old
  * <https://builds.apache.org/job/Nutch-trunk/ws/build/test/TEST-org.apache.nutch.tools.TestCommonCrawlDataDumper.xml>
is 5 days 11 hr old
  * <https://builds.apache.org/job/Nutch-trunk/ws/build/test/TEST-org.apache.nutch.util.TestEncodingDetector.xml>
is 5 days 11 hr old
  * <https://builds.apache.org/job/Nutch-trunk/ws/build/test/TEST-org.apache.nutch.util.TestGZIPUtils.xml>
is 5 days 11 hr old
  * <https://builds.apache.org/job/Nutch-trunk/ws/build/test/TEST-org.apache.nutch.util.TestMimeUtil.xml>
is 5 days 11 hr old
  * <https://builds.apache.org/job/Nutch-trunk/ws/build/test/TEST-org.apache.nutch.util.TestNodeWalker.xml>
is 5 days 11 hr old
  * <https://builds.apache.org/job/Nutch-trunk/ws/build/test/TEST-org.apache.nutch.util.TestPrefixStringMatcher.xml>
is 5 days 11 hr old
  * <https://builds.apache.org/job/Nutch-trunk/ws/build/test/TEST-org.apache.nutch.util.TestStringUtil.xml>
is 5 days 11 hr old
  * <https://builds.apache.org/job/Nutch-trunk/ws/build/test/TEST-org.apache.nutch.util.TestSuffixStringMatcher.xml>
is 5 days 11 hr old
  * <https://builds.apache.org/job/Nutch-trunk/ws/build/test/TEST-org.apache.nutch.util.TestTableUtil.xml>
is 5 days 11 hr old
  * <https://builds.apache.org/job/Nutch-trunk/ws/build/test/TEST-org.apache.nutch.util.TestURLUtil.xml>
is 5 days 11 hr old

	at org.jenkinsci.plugins.xunit.service.XUnitReportProcessorService.checkIfFindsFilesNewFiles(XUnitReportProcessorService.java:129)
	at org.jenkinsci.plugins.xunit.service.XUnitTransformerCallable.invoke(XUnitTransformerCallable.java:88)
	at org.jenkinsci.plugins.xunit.service.XUnitTransformerCallable.invoke(XUnitTransformerCallable.java:39)
	at hudson.FilePath$FileCallableWrapper.call(FilePath.java:2918)
	at hudson.remoting.UserRequest.perform(UserRequest.java:212)
	at hudson.remoting.UserRequest.perform(UserRequest.java:54)
	at hudson.remoting.Request$2.run(Request.java:369)
	at hudson.remoting.InterceptingExecutorService$1.call(InterceptingExecutorService.java:72)
	at java.util.concurrent.FutureTask.run(FutureTask.java:266)
	at java.util.concurrent.ThreadPoolExecutor.runWorker(ThreadPoolExecutor.java:1142)
	at java.util.concurrent.ThreadPoolExecutor$Worker.run(ThreadPoolExecutor.java:617)
	at java.lang.Thread.run(Thread.java:748)
Caused: java.io.IOException: remote file operation failed: <https://builds.apache.org/job/Nutch-trunk/ws/>
at hudson.remoting.Channel@87d083e:ubuntu-4
	at hudson.FilePath.act(FilePath.java:1043)
	at hudson.FilePath.act(FilePath.java:1025)
	at org.jenkinsci.plugins.xunit.XUnitProcessor.processTestsReport(XUnitProcessor.java:174)
	at org.jenkinsci.plugins.xunit.XUnitProcessor.process(XUnitProcessor.java:144)
	at org.jenkinsci.plugins.xunit.XUnitPublisher.perform(XUnitPublisher.java:127)
	at hudson.tasks.BuildStepCompatibilityLayer.perform(BuildStepCompatibilityLayer.java:81)
	at hudson.tasks.BuildStepMonitor$1.perform(BuildStepMonitor.java:20)
	at hudson.model.AbstractBuild$AbstractBuildExecution.perform(AbstractBuild.java:744)
	at hudson.model.AbstractBuild$AbstractBuildExecution.performAllBuildSteps(AbstractBuild.java:690)
	at hudson.model.Build$BuildExecution.post2(Build.java:186)
	at hudson.model.AbstractBuild$AbstractBuildExecution.post(AbstractBuild.java:635)
	at hudson.model.Run.execute(Run.java:1819)
	at hudson.model.FreeStyleBuild.run(FreeStyleBuild.java:43)
	at hudson.model.ResourceController.execute(ResourceController.java:97)
	at hudson.model.Executor.run(Executor.java:429)
[JIRA] Updating issue NUTCH-2606
[JIRA] Updating issue NUTCH-2668
[JIRA] Updating issue NUTCH-1842
Not sending mail to unregistered user noreply@github.com

Mime
View raw message