nutch-dev mailing list archives

Site index · List index
Message view « Date » · « Thread »
Top « Date » · « Thread »
From Apache Jenkins Server <jenk...@builds.apache.org>
Subject Build failed in Jenkins: Nutch-nutchgora #1625
Date Fri, 04 Jan 2019 10:05:22 GMT
See <https://builds.apache.org/job/Nutch-nutchgora/1625/display/redirect>

------------------------------------------
[...truncated 163.23 KB...]
job:
      [jar] Building jar: <https://builds.apache.org/job/Nutch-nutchgora/ws/build/apache-nutch-2.4-SNAPSHOT.job>

resolve-test:
[ivy:resolve] downloading http://repo1.maven.org/maven2/org/mockito/mockito-all/1.9.5/mockito-all-1.9.5.jar
...
[ivy:resolve] .....................................................................................
(1544kB)
[ivy:resolve] .. (0kB)
[ivy:resolve] 	[SUCCESSFUL ] org.mockito#mockito-all;1.9.5!mockito-all.jar (93ms)
[ivy:resolve] downloading http://repo1.maven.org/maven2/org/springframework/spring-test/4.0.4.RELEASE/spring-test-4.0.4.RELEASE.jar
...
[ivy:resolve] ..................... (438kB)
[ivy:resolve] .. (0kB)
[ivy:resolve] 	[SUCCESSFUL ] org.springframework#spring-test;4.0.4.RELEASE!spring-test.jar
(29ms)
[ivy:retrieve] 	conflict on <https://builds.apache.org/job/Nutch-nutchgora/ws/build/lib/org.restlet-2.2.3.jar>
in [test]: 2.2.3 won
  [taskdef] Could not load definitions from resource org/sonar/ant/antlib.xml. It could not
be found.

copy-libs:

compile-core-test:
    [javac] Compiling 47 source files to <https://builds.apache.org/job/Nutch-nutchgora/ws/build/test/classes>

test-core:
    [mkdir] Created dir: <https://builds.apache.org/job/Nutch-nutchgora/ws/build/test/data>
     [copy] Copying 94 files to <https://builds.apache.org/job/Nutch-nutchgora/ws/build/test/data>
     [copy] Copying 1 file to <https://builds.apache.org/job/Nutch-nutchgora/ws/build/test/classes>
     [copy] Copying 1 file to <https://builds.apache.org/job/Nutch-nutchgora/ws/build/test/classes>
     [copy] Copying 1 file to <https://builds.apache.org/job/Nutch-nutchgora/ws/build/test/classes>
     [copy] Copying 1 file to <https://builds.apache.org/job/Nutch-nutchgora/ws/build/test/classes>
     [copy] Copying 1 file to <https://builds.apache.org/job/Nutch-nutchgora/ws/build/test/classes>
     [copy] Copying 1 file to <https://builds.apache.org/job/Nutch-nutchgora/ws/build/test/classes>
    [junit] Running org.apache.nutch.api.TestNutchAPI
    [junit] Tests run: 4, Failures: 0, Errors: 0, Skipped: 0, Time elapsed: 1.452 sec
    [junit] Running org.apache.nutch.crawl.TestAdaptiveFetchSchedule
    [junit] Tests run: 1, Failures: 0, Errors: 0, Skipped: 0, Time elapsed: 0.525 sec
    [junit] Running org.apache.nutch.crawl.TestGenerator
    [junit] Tests run: 6, Failures: 0, Errors: 0, Skipped: 4, Time elapsed: 8.376 sec
    [junit] Running org.apache.nutch.crawl.TestInjector
    [junit] Tests run: 3, Failures: 0, Errors: 0, Skipped: 0, Time elapsed: 8.417 sec
    [junit] Running org.apache.nutch.crawl.TestSignatureFactory
    [junit] Tests run: 1, Failures: 0, Errors: 0, Skipped: 0, Time elapsed: 0.28 sec
    [junit] Running org.apache.nutch.crawl.TestURLPartitioner
    [junit] Tests run: 7, Failures: 0, Errors: 0, Skipped: 0, Time elapsed: 1.238 sec
    [junit] Running org.apache.nutch.crawl.TestUrlWithScore
    [junit] Tests run: 4, Failures: 0, Errors: 0, Skipped: 0, Time elapsed: 0.147 sec
    [junit] Running org.apache.nutch.fetcher.TestFetcher
    [junit] Tests run: 5, Failures: 0, Errors: 0, Skipped: 0, Time elapsed: 73.563 sec
    [junit] Running org.apache.nutch.indexer.TestIndexingFilters
    [junit] Tests run: 3, Failures: 0, Errors: 0, Skipped: 0, Time elapsed: 0.887 sec
    [junit] Running org.apache.nutch.metadata.TestMetadata
    [junit] Tests run: 10, Failures: 0, Errors: 0, Skipped: 0, Time elapsed: 0.125 sec
    [junit] Running org.apache.nutch.metadata.TestSpellCheckedMetadata
    [junit] Tests run: 11, Failures: 0, Errors: 0, Skipped: 0, Time elapsed: 2.7 sec
    [junit] Running org.apache.nutch.net.TestURLFilters
    [junit] Tests run: 1, Failures: 0, Errors: 0, Skipped: 0, Time elapsed: 0.605 sec
    [junit] Running org.apache.nutch.net.TestURLNormalizers
    [junit] Tests run: 1, Failures: 0, Errors: 0, Skipped: 0, Time elapsed: 0.446 sec
    [junit] Running org.apache.nutch.parse.TestOutlinkExtractor
    [junit] Tests run: 3, Failures: 0, Errors: 0, Skipped: 0, Time elapsed: 0.269 sec
    [junit] Running org.apache.nutch.parse.TestParseUtil
    [junit] Tests run: 1, Failures: 0, Errors: 0, Skipped: 0, Time elapsed: 2.097 sec
    [junit] Running org.apache.nutch.parse.TestParserFactory
    [junit] Tests run: 2, Failures: 0, Errors: 0, Skipped: 0, Time elapsed: 1.408 sec
    [junit] Running org.apache.nutch.parse.TestSitemapParser
    [junit] Tests run: 2, Failures: 0, Errors: 0, Skipped: 0, Time elapsed: 1.228 sec
    [junit] Running org.apache.nutch.plugin.TestPluginSystem
    [junit] Tests run: 7, Failures: 0, Errors: 0, Skipped: 0, Time elapsed: 1.079 sec
    [junit] Running org.apache.nutch.protocol.TestContent
    [junit] Tests run: 2, Failures: 0, Errors: 0, Skipped: 0, Time elapsed: 0.774 sec
    [junit] Running org.apache.nutch.protocol.TestProtocolFactory
    [junit] Tests run: 2, Failures: 0, Errors: 0, Skipped: 0, Time elapsed: 0.911 sec
    [junit] Running org.apache.nutch.storage.TestGoraStorage
    [junit] Tests run: 3, Failures: 0, Errors: 0, Skipped: 0, Time elapsed: 2.65 sec
    [junit] Running org.apache.nutch.util.TestEncodingDetector
    [junit] Tests run: 1, Failures: 0, Errors: 0, Skipped: 0, Time elapsed: 0.592 sec
    [junit] Running org.apache.nutch.util.TestGZIPUtils
    [junit] Tests run: 4, Failures: 0, Errors: 0, Skipped: 0, Time elapsed: 0.354 sec
    [junit] Running org.apache.nutch.util.TestMimeUtil
    [junit] Tests run: 4, Failures: 0, Errors: 0, Skipped: 0, Time elapsed: 0.933 sec
    [junit] Running org.apache.nutch.util.TestNodeWalker
    [junit] Tests run: 1, Failures: 0, Errors: 0, Skipped: 0, Time elapsed: 0.18 sec
    [junit] Running org.apache.nutch.util.TestPrefixStringMatcher
    [junit] Tests run: 1, Failures: 0, Errors: 0, Skipped: 0, Time elapsed: 0.041 sec
    [junit] Running org.apache.nutch.util.TestStringUtil
    [junit] Tests run: 2, Failures: 0, Errors: 0, Skipped: 0, Time elapsed: 0.022 sec
    [junit] Running org.apache.nutch.util.TestSuffixStringMatcher
    [junit] Tests run: 1, Failures: 0, Errors: 0, Skipped: 0, Time elapsed: 0.048 sec
    [junit] Running org.apache.nutch.util.TestTableUtil
    [junit] Tests run: 2, Failures: 0, Errors: 0, Skipped: 0, Time elapsed: 0.029 sec
    [junit] Running org.apache.nutch.util.TestURLUtil
    [junit] Tests run: 8, Failures: 0, Errors: 0, Skipped: 0, Time elapsed: 0.54 sec
    [junit] Running org.apache.nutch.webui.client.TestCrawlCycle
    [junit] Tests run: 3, Failures: 0, Errors: 0, Skipped: 0, Time elapsed: 0.317 sec
    [junit] Running org.apache.nutch.webui.client.TestNutchClientFactory
    [junit] Tests run: 3, Failures: 0, Errors: 0, Skipped: 0, Time elapsed: 0.833 sec
    [junit] Running org.apache.nutch.webui.client.TestRemoteCommandExecutor
    [junit] Tests run: 3, Failures: 0, Errors: 0, Skipped: 0, Time elapsed: 0.32 sec
    [junit] Running org.apache.nutch.webui.client.TestRemoteCommandsBatchFactory
    [junit] Tests run: 2, Failures: 0, Errors: 0, Skipped: 0, Time elapsed: 0.116 sec
    [junit] Running org.apache.nutch.webui.view.TestColorEnumLabel
    [junit] Tests run: 2, Failures: 0, Errors: 0, Skipped: 0, Time elapsed: 2.602 sec

test-plugins:

test:

init:

init-plugin:

deps-jar:

clean-lib:

resolve-default:
[ivy:resolve] :: loading settings :: file = <https://builds.apache.org/job/Nutch-nutchgora/ws/ivy/ivysettings.xml>

compile:
     [echo] Compiling plugin: creativecommons

compile-test:
    [javac] Compiling 1 source file to <https://builds.apache.org/job/Nutch-nutchgora/ws/build/creativecommons/test>

jar:

deps-test:

init:

init-plugin:

clean-lib:

resolve-default:
[ivy:resolve] :: loading settings :: file = <https://builds.apache.org/job/Nutch-nutchgora/ws/ivy/ivysettings.xml>

compile:

jar:

deps-test:

deploy:

copy-generated-lib:

deploy:

copy-generated-lib:

test:
     [echo] Testing plugin: creativecommons
    [junit] Running org.creativecommons.nutch.TestCCParseFilter
    [junit] Tests run: 1, Failures: 0, Errors: 0, Skipped: 0, Time elapsed: 2.101 sec

init:

init-plugin:

deps-jar:

clean-lib:

resolve-default:
[ivy:resolve] :: loading settings :: file = <https://builds.apache.org/job/Nutch-nutchgora/ws/ivy/ivysettings.xml>

compile:
     [echo] Compiling plugin: parse-tika
    [javac] Compiling 1 source file to <https://builds.apache.org/job/Nutch-nutchgora/ws/build/parse-tika/classes>

compile-test:
    [javac] Compiling 7 source files to <https://builds.apache.org/job/Nutch-nutchgora/ws/build/parse-tika/test>

jar:

deps-test:

init:

init-plugin:

clean-lib:

resolve-default:
[ivy:resolve] :: loading settings :: file = <https://builds.apache.org/job/Nutch-nutchgora/ws/ivy/ivysettings.xml>

compile:

jar:

deps-test:

deploy:

copy-generated-lib:

init:

init-plugin:

deps-jar:

clean-lib:

resolve-default:
[ivy:resolve] :: loading settings :: file = <https://builds.apache.org/job/Nutch-nutchgora/ws/ivy/ivysettings.xml>

compile:
     [echo] Compiling plugin: protocol-file

jar:

deps-test:

deploy:

copy-generated-lib:

deploy:

copy-generated-lib:

test:
     [echo] Testing plugin: parse-tika
    [junit] Running org.apache.nutch.parse.tika.TestImageMetadata
    [junit] Tests run: 1, Failures: 0, Errors: 1, Skipped: 0, Time elapsed: 1.583 sec
    [junit] Test org.apache.nutch.parse.tika.TestImageMetadata FAILED
    [junit] Running org.apache.nutch.parse.tika.TestMSWordParser
    [junit] Tests run: 2, Failures: 0, Errors: 2, Skipped: 0, Time elapsed: 1.685 sec
    [junit] Test org.apache.nutch.parse.tika.TestMSWordParser FAILED
    [junit] Running org.apache.nutch.parse.tika.TestOOParser
    [junit] Tests run: 1, Failures: 0, Errors: 1, Skipped: 0, Time elapsed: 1.479 sec
    [junit] Test org.apache.nutch.parse.tika.TestOOParser FAILED
    [junit] Running org.apache.nutch.parse.tika.TestPdfParser
    [junit] Tests run: 1, Failures: 0, Errors: 1, Skipped: 0, Time elapsed: 1.531 sec
    [junit] Test org.apache.nutch.parse.tika.TestPdfParser FAILED
    [junit] Running org.apache.nutch.parse.tika.TestRSSParser
    [junit] Tests run: 1, Failures: 0, Errors: 1, Skipped: 0, Time elapsed: 1.64 sec
    [junit] Test org.apache.nutch.parse.tika.TestRSSParser FAILED
    [junit] Running org.apache.nutch.parse.tika.TestRTFParser
    [junit] Tests run: 1, Failures: 0, Errors: 1, Skipped: 0, Time elapsed: 1.589 sec
    [junit] Test org.apache.nutch.parse.tika.TestRTFParser FAILED

BUILD FAILED
<https://builds.apache.org/job/Nutch-nutchgora/ws/build.xml>:514: The following error
occurred while executing this line:
<https://builds.apache.org/job/Nutch-nutchgora/ws/src/plugin/build.xml>:82: The following
error occurred while executing this line:
<https://builds.apache.org/job/Nutch-nutchgora/ws/src/plugin/build-plugin.xml>:207:
Tests failed!

Total time: 3 minutes 8 seconds
Build step 'Invoke Ant' marked build as failure
Publishing Javadoc

Mime
View raw message