nutch-dev mailing list archives

Site index · List index
Message view « Date » · « Thread »
Top « Date » · « Thread »
From Apache Jenkins Server <jenk...@builds.apache.org>
Subject Build failed in Jenkins: Nutch » Nutch-trunk #6
Date Mon, 14 Sep 2020 12:10:18 GMT
See <https://ci-builds.apache.org/job/Nutch/job/Nutch-trunk/6/display/redirect?page=changes>

Changes:

[Sebastian Nagel] NUTCH-2823 IllegalStateException in IndexWriters.describe() when validating
url param for SolrIndexer


------------------------------------------
[...truncated 21.88 KB...]
[ivy:resolve] ...... (79kB)
[ivy:resolve] .. (0kB)
[ivy:resolve] 	[SUCCESSFUL ] org.apache.kerby#kerb-admin;1.0.1!kerb-admin.jar (26ms)
[ivy:resolve] downloading https://repo1.maven.org/maven2/org/apache/kerby/kerby-config/1.0.1/kerby-config-1.0.1.jar
...
[ivy:resolve] ... (29kB)
[ivy:resolve] .. (0kB)
[ivy:resolve] 	[SUCCESSFUL ] org.apache.kerby#kerby-config;1.0.1!kerby-config.jar (31ms)
[ivy:resolve] downloading https://repo1.maven.org/maven2/org/apache/kerby/kerb-core/1.0.1/kerb-core-1.0.1.jar
...
[ivy:resolve] ............... (221kB)
[ivy:resolve] .. (0kB)
[ivy:resolve] 	[SUCCESSFUL ] org.apache.kerby#kerb-core;1.0.1!kerb-core.jar (33ms)
[ivy:resolve] downloading https://repo1.maven.org/maven2/org/apache/kerby/kerb-common/1.0.1/kerb-common-1.0.1.jar
...
[ivy:resolve] ..... (63kB)
[ivy:resolve] .. (0kB)
[ivy:resolve] 	[SUCCESSFUL ] org.apache.kerby#kerb-common;1.0.1!kerb-common.jar (28ms)
[ivy:resolve] downloading https://repo1.maven.org/maven2/org/apache/kerby/kerb-util/1.0.1/kerb-util-1.0.1.jar
...
[ivy:resolve] .... (35kB)
[ivy:resolve] .. (0kB)
[ivy:resolve] 	[SUCCESSFUL ] org.apache.kerby#kerb-util;1.0.1!kerb-util.jar (27ms)
[ivy:resolve] downloading https://repo1.maven.org/maven2/org/apache/kerby/token-provider/1.0.1/token-provider-1.0.1.jar
...
[ivy:resolve] ... (18kB)
[ivy:resolve] .. (0kB)
[ivy:resolve] 	[SUCCESSFUL ] org.apache.kerby#token-provider;1.0.1!token-provider.jar (29ms)
[ivy:resolve] downloading https://repo1.maven.org/maven2/org/apache/kerby/kerby-pkix/1.0.1/kerby-pkix-1.0.1.jar
...
[ivy:resolve] ............... (199kB)
[ivy:resolve] .. (0kB)
[ivy:resolve] 	[SUCCESSFUL ] org.apache.kerby#kerby-pkix;1.0.1!kerby-pkix.jar (32ms)
[ivy:resolve] downloading https://repo1.maven.org/maven2/org/apache/kerby/kerby-asn1/1.0.1/kerby-asn1-1.0.1.jar
...
[ivy:resolve] ........ (99kB)
[ivy:resolve] .. (0kB)
[ivy:resolve] 	[SUCCESSFUL ] org.apache.kerby#kerby-asn1;1.0.1!kerby-asn1.jar (32ms)
[ivy:resolve] downloading https://repo1.maven.org/maven2/org/apache/kerby/kerby-util/1.0.1/kerby-util-1.0.1.jar
...
[ivy:resolve] .... (39kB)
[ivy:resolve] .. (0kB)
[ivy:resolve] 	[SUCCESSFUL ] org.apache.kerby#kerby-util;1.0.1!kerby-util.jar (26ms)
[ivy:resolve] downloading https://repo1.maven.org/maven2/org/apache/kerby/kerb-crypto/1.0.1/kerb-crypto-1.0.1.jar
...
[ivy:resolve] ......... (113kB)
[ivy:resolve] .. (0kB)
[ivy:resolve] 	[SUCCESSFUL ] org.apache.kerby#kerb-crypto;1.0.1!kerb-crypto.jar (31ms)
[ivy:resolve] downloading https://repo1.maven.org/maven2/org/apache/kerby/kerb-server/1.0.1/kerb-server-1.0.1.jar
...
[ivy:resolve] ....... (80kB)
[ivy:resolve] .. (0kB)
[ivy:resolve] 	[SUCCESSFUL ] org.apache.kerby#kerb-server;1.0.1!kerb-server.jar (29ms)
[ivy:resolve] downloading https://repo1.maven.org/maven2/org/apache/kerby/kerby-xdr/1.0.1/kerby-xdr-1.0.1.jar
...
[ivy:resolve] ... (28kB)
[ivy:resolve] .. (0kB)
[ivy:resolve] 	[SUCCESSFUL ] org.apache.kerby#kerby-xdr;1.0.1!kerby-xdr.jar (41ms)
[ivy:resolve] downloading https://repo1.maven.org/maven2/org/apache/kerby/kerb-identity/1.0.1/kerb-identity-1.0.1.jar
...
[ivy:resolve] ... (19kB)
[ivy:resolve] .. (0kB)
[ivy:resolve] 	[SUCCESSFUL ] org.apache.kerby#kerb-identity;1.0.1!kerb-identity.jar (25ms)
[ivy:resolve] downloading https://repo1.maven.org/maven2/org/eclipse/jetty/jetty-util-ajax/9.3.24.v20180605/jetty-util-ajax-9.3.24.v20180605.jar
...
[ivy:resolve] .... (37kB)
[ivy:resolve] .. (0kB)
[ivy:resolve] 	[SUCCESSFUL ] org.eclipse.jetty#jetty-util-ajax;9.3.24.v20180605!jetty-util-ajax.jar
(24ms)
[ivy:resolve] downloading https://repo1.maven.org/maven2/io/netty/netty-all/4.0.52.Final/netty-all-4.0.52.Final.jar
...
[ivy:resolve] .................................................................................................................................................
(2221kB)
[ivy:resolve] .. (0kB)
[ivy:resolve] 	[SUCCESSFUL ] io.netty#netty-all;4.0.52.Final!netty-all.jar (89ms)
[ivy:resolve] downloading https://repo1.maven.org/maven2/org/apache/hadoop/hadoop-yarn-client/3.1.3/hadoop-yarn-client-3.1.3.jar
...
[ivy:resolve] ..................... (298kB)
[ivy:resolve] .. (0kB)
[ivy:resolve] 	[SUCCESSFUL ] org.apache.hadoop#hadoop-yarn-client;3.1.3!hadoop-yarn-client.jar
(38ms)
[ivy:resolve] downloading https://repo1.maven.org/maven2/org/apache/hadoop/hadoop-yarn-common/3.1.3/hadoop-yarn-common-3.1.3.jar
...
[ivy:resolve] ................................................................................................................................................................................
(2776kB)
[ivy:resolve] .. (0kB)
[ivy:resolve] 	[SUCCESSFUL ] org.apache.hadoop#hadoop-yarn-common;3.1.3!hadoop-yarn-common.jar
(102ms)
[ivy:resolve] downloading https://repo1.maven.org/maven2/org/apache/hadoop/hadoop-hdfs-client/3.1.3/hadoop-hdfs-client-3.1.3.jar
...
[ivy:resolve] ..............................................................................................................................................................................................................................................................................................................................
(4942kB)
[ivy:resolve] .. (0kB)
[ivy:resolve] 	[SUCCESSFUL ] org.apache.hadoop#hadoop-hdfs-client;3.1.3!hadoop-hdfs-client.jar
(193ms)
[ivy:resolve] downloading https://repo1.maven.org/maven2/com/google/inject/extensions/guice-servlet/4.0/guice-servlet-4.0.jar
...
[ivy:resolve] ...... (75kB)
[ivy:resolve] .. (0kB)
[ivy:resolve] 	[SUCCESSFUL ] com.google.inject.extensions#guice-servlet;4.0!guice-servlet.jar
(36ms)
[ivy:resolve] downloading https://repo1.maven.org/maven2/org/apache/hadoop/hadoop-yarn-api/3.1.3/hadoop-yarn-api-3.1.3.jar
...
[ivy:resolve] ........................................................................................................................................................................................................
(3031kB)
[ivy:resolve] .. (0kB)
[ivy:resolve] 	[SUCCESSFUL ] org.apache.hadoop#hadoop-yarn-api;3.1.3!hadoop-yarn-api.jar (108ms)
[ivy:resolve] downloading https://repo1.maven.org/maven2/com/google/inject/guice/4.0/guice-4.0.jar
...
[ivy:resolve] ........................................... (652kB)
[ivy:resolve] .. (0kB)
[ivy:resolve] 	[SUCCESSFUL ] com.google.inject#guice;4.0!guice.jar (45ms)
[ivy:resolve] downloading https://repo1.maven.org/maven2/com/sun/jersey/contribs/jersey-guice/1.19/jersey-guice-1.19.jar
...
[ivy:resolve] .. (15kB)
[ivy:resolve] .. (0kB)
[ivy:resolve] 	[SUCCESSFUL ] com.sun.jersey.contribs#jersey-guice;1.19!jersey-guice.jar (25ms)
[ivy:resolve] downloading https://repo1.maven.org/maven2/org/apache/hadoop/hadoop-mapreduce-client-common/3.1.3/hadoop-mapreduce-client-common-3.1.3.jar
...
[ivy:resolve] ................................................... (785kB)
[ivy:resolve] .. (0kB)
[ivy:resolve] 	[SUCCESSFUL ] org.apache.hadoop#hadoop-mapreduce-client-common;3.1.3!hadoop-mapreduce-client-common.jar
(56ms)
[ivy:resolve] downloading https://repo1.maven.org/maven2/org/apache/tika/tika-core/1.24.1/tika-core-1.24.1.jar
...
[ivy:resolve] .............................................. (691kB)
[ivy:resolve] .. (0kB)
[ivy:resolve] 	[SUCCESSFUL ] org.apache.tika#tika-core;1.24.1!tika-core.jar(bundle) (47ms)
[ivy:resolve] downloading https://repo1.maven.org/maven2/com/github/crawler-commons/crawler-commons/1.1/crawler-commons-1.1.jar
...
[ivy:resolve] ............. (181kB)
[ivy:resolve] .. (0kB)
[ivy:resolve] 	[SUCCESSFUL ] com.github.crawler-commons#crawler-commons;1.1!crawler-commons.jar
(44ms)
  [taskdef] Could not load definitions from resource org/apache/rat/anttasks/antlib.xml. It
could not be found.
  [taskdef] Could not load definitions from resource edu/umd/cs/findbugs/anttask/tasks.properties.
It could not be found.

copy-libs:

compile-core:
    [javac] Compiling 300 source files to <https://ci-builds.apache.org/job/Nutch/job/Nutch-trunk/ws/build/classes>
    [javac] <https://ci-builds.apache.org/job/Nutch/job/Nutch-trunk/ws/src/java/org/apache/nutch/fetcher/FetcherThread.java>:377:
warning: [deprecation] WOULDBLOCK in ProtocolStatus has been deprecated
    [javac]             case ProtocolStatus.WOULDBLOCK:
    [javac]                                ^
    [javac] <https://ci-builds.apache.org/job/Nutch/job/Nutch-trunk/ws/src/java/org/apache/nutch/fetcher/FetcherThread.java>:431:
warning: [deprecation] BLOCKED in ProtocolStatus has been deprecated
    [javac]             case ProtocolStatus.BLOCKED:
    [javac]                                ^
    [javac] <https://ci-builds.apache.org/job/Nutch/job/Nutch-trunk/ws/src/java/org/apache/nutch/indexer/IndexWriters.java>:214:
warning: [deprecation] open(Configuration,String) in IndexWriter has been deprecated
    [javac]       entry.getValue().getIndexWriter().open(conf, name);
    [javac]                                        ^
    [javac] Note: Some input files use unchecked or unsafe operations.
    [javac] Note: Recompile with -Xlint:unchecked for details.
    [javac] 3 warnings
    [javac] Creating empty <https://ci-builds.apache.org/job/Nutch/job/Nutch-trunk/ws/build/classes/org/apache/nutch/net/protocols/package-info.class>
    [javac] Creating empty <https://ci-builds.apache.org/job/Nutch/job/Nutch-trunk/ws/build/classes/org/apache/nutch/exchange/package-info.class>
    [javac] Creating empty <https://ci-builds.apache.org/job/Nutch/job/Nutch-trunk/ws/build/classes/org/apache/nutch/net/package-info.class>
    [javac] Creating empty <https://ci-builds.apache.org/job/Nutch/job/Nutch-trunk/ws/build/classes/org/apache/nutch/scoring/package-info.class>
    [javac] Creating empty <https://ci-builds.apache.org/job/Nutch/job/Nutch-trunk/ws/build/classes/org/apache/nutch/protocol/package-info.class>
    [javac] Creating empty <https://ci-builds.apache.org/job/Nutch/job/Nutch-trunk/ws/build/classes/org/apache/nutch/segment/package-info.class>
    [javac] Creating empty <https://ci-builds.apache.org/job/Nutch/job/Nutch-trunk/ws/build/classes/org/apache/nutch/tools/package-info.class>
    [javac] Creating empty <https://ci-builds.apache.org/job/Nutch/job/Nutch-trunk/ws/build/classes/org/apache/nutch/tools/arc/package-info.class>
    [javac] Creating empty <https://ci-builds.apache.org/job/Nutch/job/Nutch-trunk/ws/build/classes/org/apache/nutch/util/package-info.class>
    [javac] Creating empty <https://ci-builds.apache.org/job/Nutch/job/Nutch-trunk/ws/build/classes/org/apache/nutch/scoring/webgraph/package-info.class>
    [javac] Creating empty <https://ci-builds.apache.org/job/Nutch/job/Nutch-trunk/ws/build/classes/org/apache/nutch/parse/package-info.class>
    [javac] Creating empty <https://ci-builds.apache.org/job/Nutch/job/Nutch-trunk/ws/build/classes/org/apache/nutch/tools/warc/package-info.class>
     [copy] Copying 19 files to <https://ci-builds.apache.org/job/Nutch/job/Nutch-trunk/ws/build/classes>

clean-test-lib:
   [delete] Deleting directory <https://ci-builds.apache.org/job/Nutch/job/Nutch-trunk/ws/build/test/lib>

resolve-test:
[ivy:resolve] downloading https://repo1.maven.org/maven2/javax/servlet/servlet-api/2.4/servlet-api-2.4.jar
...
[ivy:resolve] ......................................................................... (95kB)
[ivy:resolve] .. (0kB)
[ivy:resolve] 	[SUCCESSFUL ] javax.servlet#servlet-api;2.4!servlet-api.jar (42ms)
[ivy:resolve] 
[ivy:resolve] :: problems summary ::
[ivy:resolve] :::: WARNINGS
[ivy:resolve] 	Error while parsing configuration resolve report /home/jenkins/.ivy2/cache/org.apache.nutch-nutch-test.xml
(java.text.ParseException: failed to parse report: /home/jenkins/.ivy2/cache/org.apache.nutch-nutch-test.xml:
String index out of range: -7)
[ivy:resolve] 
[ivy:resolve] :: USE VERBOSE OR DEBUG MESSAGE LEVEL FOR MORE DETAILS
  [taskdef] Could not load definitions from resource org/apache/rat/anttasks/antlib.xml. It
could not be found.
  [taskdef] Could not load definitions from resource edu/umd/cs/findbugs/anttask/tasks.properties.
It could not be found.

copy-libs:

compile-core-test:
    [javac] Compiling 57 source files to <https://ci-builds.apache.org/job/Nutch/job/Nutch-trunk/ws/build/test/classes>
    [javac] <https://ci-builds.apache.org/job/Nutch/job/Nutch-trunk/ws/src/test/org/apache/nutch/tools/proxy/SegmentHandler.java>:63:
warning: [deprecation] BLOCKED in ProtocolStatus has been deprecated
    [javac]     protoCodes.put(ProtocolStatus.BLOCKED,
    [javac]                                  ^
    [javac] <https://ci-builds.apache.org/job/Nutch/job/Nutch-trunk/ws/src/test/org/apache/nutch/tools/proxy/SegmentHandler.java>:86:
warning: [deprecation] WOULDBLOCK in ProtocolStatus has been deprecated
    [javac]     protoCodes.put(ProtocolStatus.WOULDBLOCK,
    [javac]                                  ^
    [javac] Note: <https://ci-builds.apache.org/job/Nutch/job/Nutch-trunk/ws/src/test/org/apache/nutch/crawl/TestCrawlDbStates.java>
uses unchecked or unsafe operations.
    [javac] Note: Recompile with -Xlint:unchecked for details.
    [javac] 2 warnings
    [javac] Creating empty <https://ci-builds.apache.org/job/Nutch/job/Nutch-trunk/ws/build/test/classes/org/apache/nutch/tools/proxy/package-info.class>

compile-plugins:

deploy:

init:
    [mkdir] Created dir: <https://ci-builds.apache.org/job/Nutch/job/Nutch-trunk/ws/build/lib-htmlunit>
    [mkdir] Created dir: <https://ci-builds.apache.org/job/Nutch/job/Nutch-trunk/ws/build/lib-htmlunit/classes>
    [mkdir] Created dir: <https://ci-builds.apache.org/job/Nutch/job/Nutch-trunk/ws/build/lib-htmlunit/test>
    [mkdir] Created dir: <https://ci-builds.apache.org/job/Nutch/job/Nutch-trunk/ws/build/lib-htmlunit/test/lib>
    [mkdir] Created dir: <https://ci-builds.apache.org/job/Nutch/job/Nutch-trunk/ws/build/plugins/lib-htmlunit>

init-plugin:

deps-jar:

clean-lib:

resolve-default:
[ivy:resolve] :: loading settings :: file = <https://ci-builds.apache.org/job/Nutch/job/Nutch-trunk/ws/ivy/ivysettings.xml>
[ivy:resolve] 
[ivy:resolve] :: problems summary ::
[ivy:resolve] :::: WARNINGS
[ivy:resolve] 	Error while parsing configuration resolve report /home/jenkins/.ivy2/cache/org.apache.nutch-lib-htmlunit-default.xml
(java.text.ParseException: failed to parse report: /home/jenkins/.ivy2/cache/org.apache.nutch-lib-htmlunit-default.xml:
String index out of range: -7)
[ivy:resolve] 
[ivy:resolve] :: USE VERBOSE OR DEBUG MESSAGE LEVEL FOR MORE DETAILS

BUILD FAILED
<https://ci-builds.apache.org/job/Nutch/job/Nutch-trunk/ws/build.xml>:129: The following
error occurred while executing this line:
<https://ci-builds.apache.org/job/Nutch/job/Nutch-trunk/ws/src/plugin/build.xml>:30:
The following error occurred while executing this line:
<https://ci-builds.apache.org/job/Nutch/job/Nutch-trunk/ws/src/plugin/build-plugin.xml>:230:
impossible to ivy retrieve: java.lang.RuntimeException: problem during retrieve of org.apache.nutch#lib-htmlunit:
java.lang.RuntimeException: Multiple artifacts of the module com.squareup.okio#okio;1.14.0
are retrieved to the same file! Update the retrieve pattern  to fix this error.
	at org.apache.ivy.core.retrieve.RetrieveEngine.retrieve(RetrieveEngine.java:238)
	at org.apache.ivy.Ivy.retrieve(Ivy.java:561)
	at org.apache.ivy.ant.IvyRetrieve.doExecute(IvyRetrieve.java:113)
	at org.apache.ivy.ant.IvyTask.execute(IvyTask.java:259)
	at org.apache.tools.ant.UnknownElement.execute(UnknownElement.java:292)
	at sun.reflect.GeneratedMethodAccessor4.invoke(Unknown Source)
	at sun.reflect.DelegatingMethodAccessorImpl.invoke(DelegatingMethodAccessorImpl.java:43)
	at java.lang.reflect.Method.invoke(Method.java:498)
	at org.apache.tools.ant.dispatch.DispatchUtils.execute(DispatchUtils.java:99)
	at org.apache.tools.ant.Task.perform(Task.java:350)
	at org.apache.tools.ant.Target.execute(Target.java:449)
	at org.apache.tools.ant.Target.performTasks(Target.java:470)
	at org.apache.tools.ant.Project.executeSortedTargets(Project.java:1391)
	at org.apache.tools.ant.helper.SingleCheckExecutor.executeTargets(SingleCheckExecutor.java:36)
	at org.apache.tools.ant.Project.executeTargets(Project.java:1254)
	at org.apache.tools.ant.taskdefs.Ant.execute(Ant.java:437)
	at org.apache.tools.ant.UnknownElement.execute(UnknownElement.java:292)
	at sun.reflect.GeneratedMethodAccessor4.invoke(Unknown Source)
	at sun.reflect.DelegatingMethodAccessorImpl.invoke(DelegatingMethodAccessorImpl.java:43)
	at java.lang.reflect.Method.invoke(Method.java:498)
	at org.apache.tools.ant.dispatch.DispatchUtils.execute(DispatchUtils.java:99)
	at org.apache.tools.ant.Task.perform(Task.java:350)
	at org.apache.tools.ant.Target.execute(Target.java:449)
	at org.apache.tools.ant.Target.performTasks(Target.java:470)
	at org.apache.tools.ant.Project.executeSortedTargets(Project.java:1391)
	at org.apache.tools.ant.helper.SingleCheckExecutor.executeTargets(SingleCheckExecutor.java:36)
	at org.apache.tools.ant.Project.executeTargets(Project.java:1254)
	at org.apache.tools.ant.taskdefs.Ant.execute(Ant.java:437)
	at org.apache.tools.ant.UnknownElement.execute(UnknownElement.java:292)
	at sun.reflect.GeneratedMethodAccessor4.invoke(Unknown Source)
	at sun.reflect.DelegatingMethodAccessorImpl.invoke(DelegatingMethodAccessorImpl.java:43)
	at java.lang.reflect.Method.invoke(Method.java:498)
	at org.apache.tools.ant.dispatch.DispatchUtils.execute(DispatchUtils.java:99)
	at org.apache.tools.ant.Task.perform(Task.java:350)
	at org.apache.tools.ant.Target.execute(Target.java:449)
	at org.apache.tools.ant.Target.performTasks(Target.java:470)
	at org.apache.tools.ant.Project.executeSortedTargets(Project.java:1391)
	at org.apache.tools.ant.Project.executeTarget(Project.java:1364)
	at org.apache.tools.ant.helper.DefaultExecutor.executeTargets(DefaultExecutor.java:41)
	at org.apache.tools.ant.Project.executeTargets(Project.java:1254)
	at org.apache.tools.ant.Main.runBuild(Main.java:830)
	at org.apache.tools.ant.Main.startAnt(Main.java:223)
	at org.apache.tools.ant.launch.Launcher.run(Launcher.java:284)
	at org.apache.tools.ant.launch.Launcher.main(Launcher.java:101)
Caused by: java.lang.RuntimeException: Multiple artifacts of the module com.squareup.okio#okio;1.14.0
are retrieved to the same file! Update the retrieve pattern  to fix this error.
	at org.apache.ivy.core.retrieve.RetrieveEngine.determineArtifactsToCopy(RetrieveEngine.java:413)
	at org.apache.ivy.core.retrieve.RetrieveEngine.retrieve(RetrieveEngine.java:122)
	... 43 more

Total time: 51 seconds
Build step 'Invoke Ant' marked build as failure
Publishing Javadoc
Recording test results
ERROR: Step ?Publish JUnit test result report? failed: No test report files were found. Configuration
error?
[Jira] Updating issue NUTCH-2823

Mime
View raw message