ode-dev mailing list archives

Site index · List index
Message view « Date » · « Thread »
Top « Date » · « Thread »
From "Guillaume Nodet" <gno...@gmail.com>
Subject Re: Error - mvn install
Date Wed, 10 Jan 2007 22:10:34 GMT
It should be fixed now.

On 1/10/07, victor panizza <victor.panizza@gmail.com> wrote:
> Hello All
>
> In the class DocLitMapper is a method called toFaultType, this method
> declares an field called elQname in the follow line of code:
>
> 136 -     QName elQname = new QName(el.getNamespaceURI(),el.getLocalName());
>
> but in the line:
>
> 143 -     if (pdef.getElementName().equals(elQName))
>
> the attribute is used with a wrong name elQname --> elQName
>
> the class is located in the ode-jbi project.
>
> I don't how to update that error in the svn so I Hope this help...
>
>
> On 1/10/07, victor panizza <victor.panizza@gmail.com> wrote:
> >
> > Hello All.
> > The follow error is throw when I try to create the ode distribution
> > files...
> >
> >
> >
> >
> >
> > [INFO]
> > -------------------------------------------------------------------------
> > ---
> > [INFO] Building ODE :: JBI Component for Process Engine
> > [INFO]    task-segment: [install]
> > [INFO]
> > -------------------------------------------------------------------------
> > ---
> > Downloading:
> > http://pxe.intalio.org/public/maven2/org/apache/activemq/activemq-c
> > ore/4.1-incubator-20070103/activemq-core-4.1-incubator-20070103.pom
> > [WARNING] Unable to get resource from repository intalio (http://pxe.intalio.org
> > /public/maven2)
> > Downloading:
> > http://repo1.maven.org/maven2/org/apache/activemq/activemq-core/4.1
> > -incubator-20070103/activemq- core-4.1-incubator-20070103.pom
> > [WARNING] Unable to get resource from repository central (
> > http://repo1.maven.org
> > /maven2)
> > Downloading:
> > http://www.ibiblio.org/maven2/org/apache/activemq/activemq-core/4.1
> > -incubator-20070103/activemq-core-4.1-incubator-20070103.pom
> > [WARNING] Unable to get resource from repository ibiblio (http://www.ibiblio.org
> > /maven2)
> > Downloading:
> > http://people.apache.org/repo/m2-snapshot-repository/org/apache/act
> > ivemq/activemq-core/4.1-incubator-20070103/activemq-
> > core-4.1-incubator-20070103.
> > pom
> > [WARNING] Unable to get resource from repository apache-snapshots (
> > http://people
> > .apache.org/repo/m2-snapshot-repository)
> > Downloading:
> > http://cvs.apache.org/repository/org.apache.activemq/poms/activemq-
> > core-4.1-incubator-20070103.pom
> > [WARNING] Unable to get resource from repository apache (http://cvs.apache.org/r
> >
> > epository)
> > Downloading:
> > http://incubator.apache.org/ode/m2/org.apache.activemq/poms/activem
> > q-core-4.1-incubator-20070103.pom
> > [WARNING] Unable to get resource from repository ode (
> > http://incubator.apache.or
> > g/ode/m2)
> > [WARNING]
> >         Artifact commons-logging:commons-logging:jar:1.0.3:providedretains loca
> > l scope 'provided' overriding broader scope 'compile'
> >         given by a dependency. If this is not intended, modify or remove
> > the loc
> > al scope.
> >
> > Downloading:
> > http://pxe.intalio.org/public/maven2/org/opensaml/opensaml/1.1/open
> > saml-1.1.pom
> > [WARNING] Unable to get resource from repository intalio (
> > http://pxe.intalio.org
> > /public/maven2)
> > Downloading:
> > http://repo1.maven.org/maven2/org/opensaml/opensaml/1.1/opensaml-1.
> > 1.pom
> > [WARNING] Unable to get resource from repository central (
> > http://repo1.maven.org
> > /maven2)
> > Downloading: http://www.ibiblio.org/maven2/org/opensaml/opensaml/1.1/opensaml-1
> > .
> > 1.pom
> > [WARNING] Unable to get resource from repository ibiblio (
> > http://www.ibiblio.org
> > /maven2)
> > Downloading:
> > http://people.apache.org/repo/m2-snapshot-repository/org/opensaml/o
> > pensaml/1.1/opensaml-1.1.pom
> > [WARNING] Unable to get resource from repository apache-snapshots (
> > http://people
> > .apache.org/repo/m2-snapshot-repository)
> > Downloading:
> > http://cvs.apache.org/repository/org.opensaml/poms/opensaml-1.1.pom
> >
> > [WARNING] Unable to get resource from repository apache (
> > http://cvs.apache.org/r
> > epository)
> > Downloading: http://incubator.apache.org/ode/m2/org.opensaml/poms/opensaml-1.1.p
> >
> > om
> > [WARNING] Unable to get resource from repository ode (
> > http://incubator.apache.or
> > g/ode/m2)
> > Downloading:
> > http://pxe.intalio.org/public/maven2/xml-security/xmlsec/1.3.0/xmls
> > ec-1.3.0.pom
> > [WARNING] Unable to get resource from repository intalio (
> > http://pxe.intalio.org
> > /public/maven2)
> > Downloading:
> > http://repo1.maven.org/maven2/xml-security/xmlsec/1.3.0/xmlsec-1.3.
> > 0.pom
> > [WARNING] Unable to get resource from repository central (
> > http://repo1.maven.org
> > /maven2)
> > Downloading: http://www.ibiblio.org/maven2/xml-security/xmlsec/1.3.0/xmlsec-1.3
> > .
> > 0.pom
> > [WARNING] Unable to get resource from repository ibiblio (
> > http://www.ibiblio.org
> > /maven2)
> > Downloading:
> > http://people.apache.org/repo/m2-snapshot-repository/xml-security/x
> > mlsec/1.3.0/xmlsec-1.3.0.pom
> > [WARNING] Unable to get resource from repository apache-snapshots (
> > http://people
> > .apache.org/repo/m2-snapshot-repository)
> > Downloading:
> > http://cvs.apache.org/repository/xml-security/poms/xmlsec-1.3.0.pom
> >
> > [WARNING] Unable to get resource from repository apache (
> > http://cvs.apache.org/r
> > epository)
> > Downloading: http://incubator.apache.org/ode/m2/xml-security/poms/xmlsec-1.3.0.p
> >
> > om
> > [WARNING] Unable to get resource from repository ode (
> > http://incubator.apache.or
> > g/ode/m2)
> > Downloading:
> > http://pxe.intalio.org/public/maven2/wss4j/wss4j/1.5.0/wss4j-1.5.0.
> > pom
> > [WARNING] Unable to get resource from repository intalio (
> > http://pxe.intalio.org
> > /public/maven2)
> > Downloading:
> > http://repo1.maven.org/maven2/wss4j/wss4j/1.5.0/wss4j-1.5.0.pom
> > [WARNING] Unable to get resource from repository central (http://repo1.maven.org
> > /maven2)
> > Downloading:
> > http://www.ibiblio.org/maven2/wss4j/wss4j/1.5.0/wss4j-1.5.0.pom
> > [WARNING] Unable to get resource from repository ibiblio (
> > http://www.ibiblio.org
> > /maven2)
> > Downloading: http://people.apache.org/repo/m2-snapshot-repository/wss4j/wss4j/1
> > .
> > 5.0/wss4j-1.5.0.pom
> > [WARNING] Unable to get resource from repository apache-snapshots (
> > http://people
> > .apache.org/repo/m2-snapshot-repository)
> > Downloading: http://cvs.apache.org/repository/wss4j/poms/wss4j-1.5.0.pom
> > [WARNING] Unable to get resource from repository apache (
> > http://cvs.apache.org/r
> > epository)
> > Downloading: http://incubator.apache.org/ode/m2/wss4j/poms/wss4j-1.5.0.pom
> > [WARNING] Unable to get resource from repository ode (
> > http://incubator.apache.or
> > g/ode/m2)
> > [WARNING]
> >         Artifact xerces:xercesImpl:jar: 2.2.1:provided retains local scope
> > 'provi
> > ded' overriding broader scope 'compile'
> >         given by a dependency. If this is not intended, modify or remove
> > the loc
> > al scope.
> >
> > [WARNING]
> >         Artifact xerces:xmlParserAPIs:jar: 2.6.2:provided retains local
> > scope 'pr
> > ovided' overriding broader scope 'compile'
> >         given by a dependency. If this is not intended, modify or remove
> > the loc
> > al scope.
> >
> > [WARNING] While downloading xml-apis:xml-apis: 2.0.2
> >   This artifact has been relocated to xml-apis:xml-apis:1.0.b2.
> >
> >
> > [WARNING]
> >         Artifact
> > org.apache.geronimo.specs:geronimo-jta_1.0.1B_spec:jar:1.0:prov
> > ided retains local scope 'provided' overriding broader scope 'compile'
> >         given by a dependency. If this is not intended, modify or remove
> > the loc
> > al scope.
> >
> > [WARNING]
> >         Artifact xml-apis:xml-apis:jar:1.0.b2:provided retains local scope
> > 'prov
> > ided' overriding broader scope 'compile'
> >         given by a dependency. If this is not intended, modify or remove
> > the loc
> > al scope.
> >
> > [INFO] [jbi:generate-jbi-component-descriptor]
> > [INFO] Generating jbi.xml
> > [WARNING] Attempting to build MavenProject instance for Artifact of type:
> > jar; c
> > onstructing POM artifact instead.
> > [WARNING] Resolved artifact wsdl4j:wsdl4j:jar:1.6.1:compile has a
> > different vers
> > ion from that in dependency management wsdl4j:wsdl4j:jar:1.5.2:compile,
> > overridi
> > ng dependency management
> > [WARNING] Resolved artifact
> > org.apache.geronimo.specs:geronimo-j2ee-connector_1.
> > 5_spec:jar:1.0.1:compile has a different version from that in dependency
> > managem
> > ent
> > org.apache.geronimo.specs:geronimo-j2ee-connector_1.5_spec:jar:1.0:compile,
> > overriding dependency management
> > [WARNING] Attempting to build MavenProject instance for Artifact of type:
> > jar; c
> > onstructing POM artifact instead.
> > [INFO] [dependency:unpack {execution: unpack-samples}]
> > [INFO] Configured Artifact:
> > org.apache.ode:ode-jpa-ojpa-derby:null:2.0-SNAPSHOT:
> > tar
> > [INFO] ode-jpa-ojpa-derby-2.0-SNAPSHOT.tar already unpacked.
> > [INFO] [resources:resources]
> > [INFO] Using default encoding to copy filtered resources.
> > [INFO] [compiler:compile]
> > Compiling 6 source files to
> > C:\vpanizza\ode_working_copy\jbi\target\classes
> > [INFO]
> > ------------------------------------------------------------------------
> > [ERROR] BUILD FAILURE
> > [INFO]
> > ------------------------------------------------------------------------
> > [INFO] Compilation failure
> >
> >
> > C:\vpanizza\ode_working_copy\jbi\src\main\java\org\apache\ode\jbi\msgmap\DocLitM
> > apper.java:[143,43] cannot find symbol
> > symbol  : variable elQName
> > location: class org.apache.ode.jbi.msgmap.DocLitMapper
> >
> >
> > [INFO]
> > ------------------------------------------------------------------------
> > [INFO] Trace
> > org.apache.maven.BuildFailureException: Compilation failure
> >         at
> > org.apache.maven.lifecycle.DefaultLifecycleExecutor.executeGoals (Defa
> > ultLifecycleExecutor.java:555)
> >         at
> > org.apache.maven.lifecycle.DefaultLifecycleExecutor.executeGoalWithLi
> > fecycle(DefaultLifecycleExecutor.java:475)
> >         at org.apache.maven.lifecycle.DefaultLifecycleExecutor.executeGoal(Defau
> > ltLifecycleExecutor.java:454)
> >         at
> > org.apache.maven.lifecycle.DefaultLifecycleExecutor.executeGoalAndHan
> > dleFailures(DefaultLifecycleExecutor.java:306)
> >         at
> > org.apache.maven.lifecycle.DefaultLifecycleExecutor.executeTaskSegmen
> > ts(DefaultLifecycleExecutor.java:273)
> >         at org.apache.maven.lifecycle.DefaultLifecycleExecutor.execute
> > (DefaultLi
> > fecycleExecutor.java:140)
> >         at org.apache.maven.DefaultMaven.doExecute(DefaultMaven.java :322)
> >         at org.apache.maven.DefaultMaven.execute(DefaultMaven.java:115)
> >         at org.apache.maven.cli.MavenCli.main(MavenCli.java:256)
> >         at sun.reflect.NativeMethodAccessorImpl.invoke0(Native Method)
> >         at sun.reflect.NativeMethodAccessorImpl.invoke
> > (NativeMethodAccessorImpl.
> > java:39)
> >         at sun.reflect.DelegatingMethodAccessorImpl.invoke
> > (DelegatingMethodAcces
> > sorImpl.java:25)
> >         at java.lang.reflect.Method.invoke (Method.java:585)
> >         at org.codehaus.classworlds.Launcher.launchEnhanced(Launcher.java
> > :315)
> >         at org.codehaus.classworlds.Launcher.launch(Launcher.java:255)
> >         at org.codehaus.classworlds.Launcher.mainWithExitCode (
> > Launcher.java:430)
> >
> >         at org.codehaus.classworlds.Launcher.main(Launcher.java:375)
> > Caused by: org.apache.maven.plugin.CompilationFailureException:
> > Compilation fail
> > ure
> >         at org.apache.maven.plugin.AbstractCompilerMojo.execute(AbstractCompiler
> > Mojo.java:505)
> >         at org.apache.maven.plugin.CompilerMojo.execute(CompilerMojo.java
> > :111)
> >         at org.apache.maven.plugin.DefaultPluginManager.executeMojo
> > (DefaultPlugi
> > nManager.java:412)
> >         at
> > org.apache.maven.lifecycle.DefaultLifecycleExecutor.executeGoals(Defa
> > ultLifecycleExecutor.java:534)
> >         ... 16 more
> > [INFO]
> > ------------------------------------------------------------------------
> > [INFO] Total time: 1 minute 51 seconds
> > [INFO] Finished at: Wed Jan 10 10:06:31 EST 2007
> > [INFO] Final Memory: 25M/63M
> > [INFO]
> > ------------------------------------------------------------------------
> >
> > C:\vpanizza\ode_working_copy>
>
>


-- 
Cheers,
Guillaume Nodet
------------------------
Architect, LogicBlaze (http://www.logicblaze.com/)
Blog: http://gnodet.blogspot.com/

Mime
View raw message