ode-dev mailing list archives

Site index · List index
Message view « Date » · « Thread »
Top « Date » · « Thread »
From Apache Hudson Server <hud...@hudson.zones.apache.org>
Subject Build failed in Hudson: ODE-1.3.4.X-maven2 #56
Date Mon, 07 Jun 2010 11:42:12 GMT
See <http://hudson.zones.apache.org/hudson/job/ODE-1.3.4.X-maven2/56/>

------------------------------------------
[...truncated 2706 lines...]
Running org.apache.ode.test.CompensationHandling20Test
Tests run: 2, Failures: 0, Errors: 0, Skipped: 1, Time elapsed: 4.162 sec
Running org.apache.ode.test.FaultHandling20Test
Tests run: 4, Failures: 0, Errors: 0, Skipped: 0, Time elapsed: 18.454 sec
Running org.apache.ode.test.StructuredActivities20Test
Tests run: 5, Failures: 0, Errors: 0, Skipped: 0, Time elapsed: 34.609 sec
Running org.apache.ode.test.ExternalVariableTest
Tests run: 4, Failures: 0, Errors: 0, Skipped: 0, Time elapsed: 10.921 sec
Running org.apache.ode.test.MessageRouting20Test
Tests run: 21, Failures: 0, Errors: 0, Skipped: 3, Time elapsed: 104.108 sec

Results :

Tests run: 70, Failures: 0, Errors: 0, Skipped: 6

[HUDSON] Recording test results
[INFO] [jar:jar {execution: default-jar}]
[INFO] Building jar: <http://hudson.zones.apache.org/hudson/job/ODE-1.3.4.X-maven2/ws/APACHE_ODE_1.3.4.X/bpel-test/target/ode-bpel-test-1.3.4.jar>
[INFO] [install:install {execution: default-install}]
[INFO] Installing <http://hudson.zones.apache.org/hudson/job/ODE-1.3.4.X-maven2/ws/APACHE_ODE_1.3.4.X/bpel-test/target/ode-bpel-test-1.3.4.jar>
to /home/hudson/.m2/repository/org/apache/ode/ode-bpel-test/1.3.4/ode-bpel-test-1.3.4.jar
[HUDSON] Archiving <http://hudson.zones.apache.org/hudson/job/ODE-1.3.4.X-maven2/ws/APACHE_ODE_1.3.4.X/bpel-test/pom.xml>
to /export/home/hudson/hudson/jobs/ODE-1.3.4.X-maven2/modules/org.apache.ode$ode-bpel-test/builds/2010-06-07_11-17-12/archive/org.apache.ode/ode-bpel-test/1.3.4/pom.xml
[HUDSON] Archiving <http://hudson.zones.apache.org/hudson/job/ODE-1.3.4.X-maven2/ws/APACHE_ODE_1.3.4.X/bpel-test/target/ode-bpel-test-1.3.4.jar>
to /export/home/hudson/hudson/jobs/ODE-1.3.4.X-maven2/modules/org.apache.ode$ode-bpel-test/builds/2010-06-07_11-17-12/archive/org.apache.ode/ode-bpel-test/1.3.4/ode-bpel-test-1.3.4.jar
[INFO] ------------------------------------------------------------------------
[INFO] Building ODE :: AXIS2
[INFO]    task-segment: [clean, install]
[INFO] ------------------------------------------------------------------------
[INFO] [clean:clean {execution: default-clean}]
[INFO] Deleting directory <http://hudson.zones.apache.org/hudson/job/ODE-1.3.4.X-maven2/ws/APACHE_ODE_1.3.4.X/axis2/target>
[INFO] [resources:resources {execution: default-resources}]
[WARNING] Using platform encoding (UTF-8 actually) to copy filtered resources, i.e. build
is platform dependent!
[INFO] skip non existing resourceDirectory <http://hudson.zones.apache.org/hudson/job/ODE-1.3.4.X-maven2/ws/APACHE_ODE_1.3.4.X/axis2/src/main/resources>
Downloading: https://repository.apache.org/content/groups/public/org/apache/ws/security/wss4j/1.5.3/wss4j-1.5.3.pom
[INFO] Unable to find resource 'org.apache.ws.security:wss4j:pom:1.5.3' in repository servicemix-repo
(https://repository.apache.org/content/groups/public)
Downloading: http://people.apache.org/~rr/saxon-repo/org/apache/ws/security/wss4j/1.5.3/wss4j-1.5.3.pom
[INFO] Unable to find resource 'org.apache.ws.security:wss4j:pom:1.5.3' in repository saxon-repo
(http://people.apache.org/~rr/saxon-repo)
Downloading: http://people.apache.org/repo/m2-snapshot-repository/org/apache/ws/security/wss4j/1.5.3/wss4j-1.5.3.pom
[INFO] Unable to find resource 'org.apache.ws.security:wss4j:pom:1.5.3' in repository apache-snapshots
(http://people.apache.org/repo/m2-snapshot-repository)
Downloading: http://ws.zones.apache.org/repository2/org/apache/ws/security/wss4j/1.5.3/wss4j-1.5.3.pom
[INFO] Unable to find resource 'org.apache.ws.security:wss4j:pom:1.5.3' in repository apache-ws-snapshots2
(http://ws.zones.apache.org/repository2)
Downloading: http://repo1.maven.org/maven2/org/apache/ws/security/wss4j/1.5.3/wss4j-1.5.3.pom
[INFO] Unable to find resource 'org.apache.ws.security:wss4j:pom:1.5.3' in repository central
(http://repo1.maven.org/maven2)
Downloading: https://repository.apache.org/content/groups/public/org/apache/santuario/xmlsec/1.4.0/xmlsec-1.4.0.pom
[INFO] Unable to find resource 'org.apache.santuario:xmlsec:pom:1.4.0' in repository servicemix-repo
(https://repository.apache.org/content/groups/public)
Downloading: http://people.apache.org/~rr/saxon-repo/org/apache/santuario/xmlsec/1.4.0/xmlsec-1.4.0.pom
[INFO] Unable to find resource 'org.apache.santuario:xmlsec:pom:1.4.0' in repository saxon-repo
(http://people.apache.org/~rr/saxon-repo)
Downloading: http://people.apache.org/repo/m2-snapshot-repository/org/apache/santuario/xmlsec/1.4.0/xmlsec-1.4.0.pom
[INFO] Unable to find resource 'org.apache.santuario:xmlsec:pom:1.4.0' in repository apache-snapshots
(http://people.apache.org/repo/m2-snapshot-repository)
Downloading: http://ws.zones.apache.org/repository2/org/apache/santuario/xmlsec/1.4.0/xmlsec-1.4.0.pom
[INFO] Unable to find resource 'org.apache.santuario:xmlsec:pom:1.4.0' in repository apache-ws-snapshots2
(http://ws.zones.apache.org/repository2)
Downloading: http://repo1.maven.org/maven2/org/apache/santuario/xmlsec/1.4.0/xmlsec-1.4.0.pom
[INFO] Unable to find resource 'org.apache.santuario:xmlsec:pom:1.4.0' in repository central
(http://repo1.maven.org/maven2)
[INFO] [compiler:compile {execution: default-compile}]
[INFO] Compiling 40 source files to <http://hudson.zones.apache.org/hudson/job/ODE-1.3.4.X-maven2/ws/APACHE_ODE_1.3.4.X/axis2/target/classes>
[INFO] [resources:testResources {execution: default-testResources}]
[WARNING] Using platform encoding (UTF-8 actually) to copy filtered resources, i.e. build
is platform dependent!
[INFO] Copying 9 resources
[INFO] [compiler:testCompile {execution: default-testCompile}]
[INFO] Compiling 9 source files to <http://hudson.zones.apache.org/hudson/job/ODE-1.3.4.X-maven2/ws/APACHE_ODE_1.3.4.X/axis2/target/test-classes>
[INFO] [surefire:test {execution: default-test}]
[INFO] Surefire report directory: <http://hudson.zones.apache.org/hudson/job/ODE-1.3.4.X-maven2/ws/APACHE_ODE_1.3.4.X/axis2/target/surefire-reports>
Retrieving document at '<http://hudson.zones.apache.org/hudson/job/ODE-1.3.4.X-maven2/ws/APACHE_ODE_1.3.4.X/axis2/target/test-classes/test1.wsdl'.>
Retrieving document at '<http://hudson.zones.apache.org/hudson/job/ODE-1.3.4.X-maven2/ws/APACHE_ODE_1.3.4.X/axis2/target/test-classes/HelloWorld.wsdl'.>
Retrieving document at '<http://hudson.zones.apache.org/hudson/job/ODE-1.3.4.X-maven2/ws/APACHE_ODE_1.3.4.X/axis2/target/test-classes/test1.wsdl'.>
Retrieving document at '<http://hudson.zones.apache.org/hudson/job/ODE-1.3.4.X-maven2/ws/APACHE_ODE_1.3.4.X/axis2/target/test-classes/HelloWorld.wsdl'.>
Retrieving document at '<http://hudson.zones.apache.org/hudson/job/ODE-1.3.4.X-maven2/ws/APACHE_ODE_1.3.4.X/axis2/target/test-classes/test1.wsdl'.>
Retrieving document at '<http://hudson.zones.apache.org/hudson/job/ODE-1.3.4.X-maven2/ws/APACHE_ODE_1.3.4.X/axis2/target/test-classes/HelloWorld.wsdl'.>
Retrieving document at '<http://hudson.zones.apache.org/hudson/job/ODE-1.3.4.X-maven2/ws/APACHE_ODE_1.3.4.X/axis2/target/test-classes/test1.wsdl'.>
Retrieving document at '<http://hudson.zones.apache.org/hudson/job/ODE-1.3.4.X-maven2/ws/APACHE_ODE_1.3.4.X/axis2/target/test-classes/HelloWorld.wsdl'.>
Retrieving document at '<http://hudson.zones.apache.org/hudson/job/ODE-1.3.4.X-maven2/ws/APACHE_ODE_1.3.4.X/axis2/target/test-classes/test1.wsdl'.>
Retrieving document at '<http://hudson.zones.apache.org/hudson/job/ODE-1.3.4.X-maven2/ws/APACHE_ODE_1.3.4.X/axis2/target/test-classes/HelloWorld.wsdl'.>
Retrieving document at '<http://hudson.zones.apache.org/hudson/job/ODE-1.3.4.X-maven2/ws/APACHE_ODE_1.3.4.X/axis2/target/test-classes/test1.wsdl'.>
Retrieving document at '<http://hudson.zones.apache.org/hudson/job/ODE-1.3.4.X-maven2/ws/APACHE_ODE_1.3.4.X/axis2/target/test-classes/HelloWorld.wsdl'.>
Retrieving document at '<http://hudson.zones.apache.org/hudson/job/ODE-1.3.4.X-maven2/ws/APACHE_ODE_1.3.4.X/axis2/target/test-classes/test1.wsdl'.>
Retrieving document at '<http://hudson.zones.apache.org/hudson/job/ODE-1.3.4.X-maven2/ws/APACHE_ODE_1.3.4.X/axis2/target/test-classes/HelloWorld.wsdl'.>

-------------------------------------------------------
 T E S T S
-------------------------------------------------------
Running org.apache.ode.axis2.util.UrlReplacementTransformerTest
Tests run: 4, Failures: 0, Errors: 0, Skipped: 0, Time elapsed: 0.054 sec
Running org.apache.ode.axis2.SoapMessageConverterTest
testCreateSOAPRequest: <?xml version='1.0' encoding='utf-8'?><soapenv:Envelope xmlns:soapenv="http://schemas.xmlsoap.org/soap/envelope/"><soapenv:Body>
      <getObjectId xmlns="http://documentum.com/ws/2005/services" foo="bar">
          <someFooBar />
          <barbaz xmlns="" />
      </getObjectId>
   </soapenv:Body></soapenv:Envelope>
testParseRequest: <?xml version='1.0' encoding='utf-8'?><soapenv:Envelope xmlns:soapenv="http://schemas.xmlsoap.org/soap/envelope/"><soapenv:Header><DocumentumSecurityToken
xmlns="http://documentum.com/ws/2005/services">SEKREET</DocumentumSecurityToken></soapenv:Header><soapenv:Body>
      <getObjectId xmlns="http://documentum.com/ws/2005/services" foo="bar">
          <someFooBar />
          <barbaz xmlns="" />
      </getObjectId>
   </soapenv:Body></soapenv:Envelope>
<?xml version="1.0" encoding="UTF-8"?>
<message><parameters><getObjectId foo="bar" xmlns="http://documentum.com/ws/2005/services"
xmlns:soapenv="http://schemas.xmlsoap.org/soap/envelope/">
          <someFooBar xmlns="http://documentum.com/ws/2005/services"/>
          <barbaz xmlns=""/>
      </getObjectId></parameters></message>
<?xml version="1.0" encoding="UTF-8"?>
<message><TestPart xmlns="" xmlns:SOAP-ENV="http://schemas.xmlsoap.org/soap/envelope/"
xmlns:foo="urn:/bar" xmlns:ns1="http://ode/bpel/unit-test.wsdl">ns1:Hello</TestPart></message>
Tests run: 7, Failures: 0, Errors: 0, Skipped: 0, Time elapsed: 0.251 sec
Running org.apache.ode.axis2.httpbinding.HttpMethodConverterTest
Tests run: 3, Failures: 0, Errors: 0, Skipped: 0, Time elapsed: 0.07 sec
Running org.apache.ode.axis2.util.UrlEncodedTransformerTest
Tests run: 2, Failures: 0, Errors: 0, Skipped: 0, Time elapsed: 0.006 sec
Running org.apache.ode.axis2.ODEServerTest
Tests run: 2, Failures: 0, Errors: 0, Skipped: 0, Time elapsed: 0.02 sec
Running org.apache.ode.axis2.httpbinding.HttpBindingValidatorTest
Tests run: 1, Failures: 0, Errors: 0, Skipped: 0, Time elapsed: 0.033 sec
Running org.apache.ode.axis2.httpbinding.HttpHelperTest
Tests run: 2, Failures: 0, Errors: 0, Skipped: 0, Time elapsed: 0.006 sec

Results :

Tests run: 21, Failures: 0, Errors: 0, Skipped: 0

[HUDSON] Recording test results
[INFO] [jar:jar {execution: default-jar}]
[INFO] Building jar: <http://hudson.zones.apache.org/hudson/job/ODE-1.3.4.X-maven2/ws/APACHE_ODE_1.3.4.X/axis2/target/ode-axis2-1.3.4.jar>
[INFO] [install:install {execution: default-install}]
[INFO] Installing <http://hudson.zones.apache.org/hudson/job/ODE-1.3.4.X-maven2/ws/APACHE_ODE_1.3.4.X/axis2/target/ode-axis2-1.3.4.jar>
to /home/hudson/.m2/repository/org/apache/ode/ode-axis2/1.3.4/ode-axis2-1.3.4.jar
[HUDSON] Archiving <http://hudson.zones.apache.org/hudson/job/ODE-1.3.4.X-maven2/ws/APACHE_ODE_1.3.4.X/axis2/pom.xml>
to /export/home/hudson/hudson/jobs/ODE-1.3.4.X-maven2/modules/org.apache.ode$ode-axis2/builds/2010-06-07_11-17-12/archive/org.apache.ode/ode-axis2/1.3.4/pom.xml
[HUDSON] Archiving <http://hudson.zones.apache.org/hudson/job/ODE-1.3.4.X-maven2/ws/APACHE_ODE_1.3.4.X/axis2/target/ode-axis2-1.3.4.jar>
to /export/home/hudson/hudson/jobs/ODE-1.3.4.X-maven2/modules/org.apache.ode$ode-axis2/builds/2010-06-07_11-17-12/archive/org.apache.ode/ode-axis2/1.3.4/ode-axis2-1.3.4.jar
[INFO] ------------------------------------------------------------------------
[INFO] Building ODE :: JBI Distribution
[INFO]    task-segment: [clean, install]
[INFO] ------------------------------------------------------------------------
[INFO] [clean:clean {execution: default-clean}]
[INFO] Deleting directory <http://hudson.zones.apache.org/hudson/job/ODE-1.3.4.X-maven2/ws/APACHE_ODE_1.3.4.X/jbi/target>
[INFO] [resources:resources {execution: default-resources}]
[WARNING] Using platform encoding (UTF-8 actually) to copy filtered resources, i.e. build
is platform dependent!
[INFO] Copying 1 resource
Downloading: https://repository.apache.org/content/groups/public/org/apache/ws/security/wss4j/1.5.2/wss4j-1.5.2.pom
[INFO] Unable to find resource 'org.apache.ws.security:wss4j:pom:1.5.2' in repository servicemix-repo
(https://repository.apache.org/content/groups/public)
Downloading: http://people.apache.org/~rr/saxon-repo/org/apache/ws/security/wss4j/1.5.2/wss4j-1.5.2.pom
[INFO] Unable to find resource 'org.apache.ws.security:wss4j:pom:1.5.2' in repository saxon-repo
(http://people.apache.org/~rr/saxon-repo)
Downloading: http://svn.apache.org/repos/asf/servicemix/m2-repo//org/apache/ws/security/wss4j/1.5.2/wss4j-1.5.2.pom
[INFO] Unable to find resource 'org.apache.ws.security:wss4j:pom:1.5.2' in repository servicemix-m2-repo
(http://svn.apache.org/repos/asf/servicemix/m2-repo/)
Downloading: http://repo1.maven.org/maven2/org/apache/ws/security/wss4j/1.5.2/wss4j-1.5.2.pom
[INFO] Unable to find resource 'org.apache.ws.security:wss4j:pom:1.5.2' in repository central
(http://repo1.maven.org/maven2)
[INFO] [jbi:generate-jbi-component-descriptor {execution: jbi-generation}]
[INFO] Generating jbi.xml
[WARNING] POM for 'tranql:tranql-connector-derby-common:pom:1.1:test' is invalid.

Its dependencies (if any) will NOT be available to the current build.
[INFO] [compiler:compile {execution: default-compile}]
[INFO] Compiling 33 source files to <http://hudson.zones.apache.org/hudson/job/ODE-1.3.4.X-maven2/ws/APACHE_ODE_1.3.4.X/jbi/target/classes>
[INFO] [resources:testResources {execution: default-testResources}]
[WARNING] Using platform encoding (UTF-8 actually) to copy filtered resources, i.e. build
is platform dependent!
[INFO] Copying 107 resources
[INFO] Copying 1 resource to ../test/smx/ode
[INFO] Copying 1 resource to ../test/smx/ode
[INFO] [resources:copy-resources {execution: copy-resources}]
[WARNING] Using platform encoding (UTF-8 actually) to copy filtered resources, i.e. build
is platform dependent!
[INFO] Copying 145 resources
[INFO] Copying 128 resources
[INFO] [resources:copy-resources {execution: copy-resources2}]
[WARNING] Using platform encoding (UTF-8 actually) to copy filtered resources, i.e. build
is platform dependent!
[INFO] Copying 107 resources
[INFO] [compiler:testCompile {execution: default-testCompile}]
[INFO] Compiling 14 source files to <http://hudson.zones.apache.org/hudson/job/ODE-1.3.4.X-maven2/ws/APACHE_ODE_1.3.4.X/jbi/target/test-classes>
[INFO] [surefire:test {execution: default-test}]
[INFO] Surefire report directory: <http://hudson.zones.apache.org/hudson/job/ODE-1.3.4.X-maven2/ws/APACHE_ODE_1.3.4.X/jbi/target/surefire-reports>

-------------------------------------------------------
 T E S T S
-------------------------------------------------------
Running org.apache.ode.jbi.msgmap.JbiWsdl11WrapperMapperTest
Retrieving document at '<http://hudson.zones.apache.org/hudson/job/ODE-1.3.4.X-maven2/ws/APACHE_ODE_1.3.4.X/jbi/target/test-classes/test.wsdl'.>
Tests run: 1, Failures: 0, Errors: 0, Skipped: 0, Time elapsed: 0.322 sec
Running org.apache.ode.jbi.OdeJbiComponentLifeCycleTest
Tests run: 1, Failures: 0, Errors: 0, Skipped: 1, Time elapsed: 0.005 sec
Running org.apache.ode.jbi.OnEventAlarmJbiTest
Tests run: 1, Failures: 0, Errors: 0, Skipped: 0, Time elapsed: 8.857 sec
Running org.apache.ode.jbi.MagicSessionJbiTest
Tests run: 1, Failures: 0, Errors: 0, Skipped: 0, Time elapsed: 2.77 sec
Running org.apache.ode.jbi.DigestJbiTest
Tests run: 1, Failures: 0, Errors: 0, Skipped: 0, Time elapsed: 2.024 sec
Running org.apache.ode.jbi.EmptyRespJbiTest
Tests run: 1, Failures: 0, Errors: 0, Skipped: 0, Time elapsed: 2.316 sec
Running org.apache.ode.jbi.RetireJbiTest
Tests run: 1, Failures: 0, Errors: 0, Skipped: 0, Time elapsed: 2.176 sec
Running org.apache.ode.jbi.CommunicationJbiTest
Tests run: 1, Failures: 0, Errors: 0, Skipped: 0, Time elapsed: 9.505 sec
Running org.apache.ode.jbi.MagicSessionExternalJbiTest
Tests run: 1, Failures: 0, Errors: 0, Skipped: 0, Time elapsed: 2.085 sec
Running org.apache.ode.jbi.ExtVarJbiTest
Tests run: 1, Failures: 0, Errors: 0, Skipped: 0, Time elapsed: 2.256 sec
Running org.apache.ode.jbi.SpringPropertiesJbiTest
Tests run: 1, Failures: 0, Errors: 0, Skipped: 0, Time elapsed: 1.568 sec
Running org.apache.ode.jbi.ReplayerJbiTest
Tests run: 1, Failures: 0, Errors: 0, Skipped: 0, Time elapsed: 6.94 sec
Running org.apache.ode.jbi.HelloWorldJbiTest
Tests run: 1, Failures: 0, Errors: 0, Skipped: 0, Time elapsed: 1.609 sec

Results :

Tests run: 13, Failures: 0, Errors: 0, Skipped: 1

[HUDSON] Recording test results
[INFO] [jar:jar {execution: default-jar}]
[INFO] Building jar: <http://hudson.zones.apache.org/hudson/job/ODE-1.3.4.X-maven2/ws/APACHE_ODE_1.3.4.X/jbi/target/ode-jbi-1.3.4.jar>
[INFO] [assembly:single {execution: jbi-package}]
[INFO] Reading assembly descriptor: src/main/assembly/bin.xml
[INFO]  already added, skipping
[INFO] Building zip: <http://hudson.zones.apache.org/hudson/job/ODE-1.3.4.X-maven2/ws/APACHE_ODE_1.3.4.X/jbi/target/ode-jbi-1.3.4.zip>
[INFO]  already added, skipping
[INFO] [install:install {execution: default-install}]
[INFO] Installing <http://hudson.zones.apache.org/hudson/job/ODE-1.3.4.X-maven2/ws/APACHE_ODE_1.3.4.X/jbi/target/ode-jbi-1.3.4.jar>
to /home/hudson/.m2/repository/org/apache/ode/ode-jbi/1.3.4/ode-jbi-1.3.4.jar
[INFO] Installing <http://hudson.zones.apache.org/hudson/job/ODE-1.3.4.X-maven2/ws/APACHE_ODE_1.3.4.X/jbi/target/ode-jbi-1.3.4.zip>
to /home/hudson/.m2/repository/org/apache/ode/ode-jbi/1.3.4/ode-jbi-1.3.4.zip
[HUDSON] Archiving <http://hudson.zones.apache.org/hudson/job/ODE-1.3.4.X-maven2/ws/APACHE_ODE_1.3.4.X/jbi/pom.xml>
to /export/home/hudson/hudson/jobs/ODE-1.3.4.X-maven2/modules/org.apache.ode$ode-jbi/builds/2010-06-07_11-17-12/archive/org.apache.ode/ode-jbi/1.3.4/pom.xml
[HUDSON] Archiving <http://hudson.zones.apache.org/hudson/job/ODE-1.3.4.X-maven2/ws/APACHE_ODE_1.3.4.X/jbi/target/ode-jbi-1.3.4.jar>
to /export/home/hudson/hudson/jobs/ODE-1.3.4.X-maven2/modules/org.apache.ode$ode-jbi/builds/2010-06-07_11-17-12/archive/org.apache.ode/ode-jbi/1.3.4/ode-jbi-1.3.4.jar
[HUDSON] Archiving <http://hudson.zones.apache.org/hudson/job/ODE-1.3.4.X-maven2/ws/APACHE_ODE_1.3.4.X/jbi/target/ode-jbi-1.3.4.zip>
to /export/home/hudson/hudson/jobs/ODE-1.3.4.X-maven2/modules/org.apache.ode$ode-jbi/builds/2010-06-07_11-17-12/archive/org.apache.ode/ode-jbi/1.3.4/ode-jbi-1.3.4.zip
ERROR: Failed to parse POMs
hudson.util.IOException2: Failed to join the process
	at hudson.Proc$RemoteProc.join(Proc.java:312)
	at hudson.maven.ProcessCache$MavenProcess.call(ProcessCache.java:164)
	at hudson.maven.MavenModuleSetBuild$RunnerImpl.doRun(MavenModuleSetBuild.java:480)
	at hudson.model.AbstractBuild$AbstractRunner.run(AbstractBuild.java:416)
	at hudson.model.Run.run(Run.java:1243)
	at hudson.maven.MavenModuleSetBuild.run(MavenModuleSetBuild.java:304)
	at hudson.model.ResourceController.execute(ResourceController.java:88)
	at hudson.model.Executor.run(Executor.java:122)
Caused by: java.util.concurrent.ExecutionException: hudson.remoting.RequestAbortedException:
java.io.EOFException
	at hudson.remoting.Request$1.get(Request.java:218)
	at hudson.remoting.Request$1.get(Request.java:172)
	at hudson.remoting.FutureAdapter.get(FutureAdapter.java:55)
	at hudson.Proc$RemoteProc.join(Proc.java:304)
	... 7 more
Caused by: hudson.remoting.RequestAbortedException: java.io.EOFException
	at hudson.remoting.Request.abort(Request.java:257)
	at hudson.remoting.Channel.terminate(Channel.java:598)
	at hudson.remoting.Channel$ReaderThread.run(Channel.java:876)
Caused by: java.io.EOFException
	at java.io.ObjectInputStream$BlockDataInputStream.peekByte(ObjectInputStream.java:2554)
	at java.io.ObjectInputStream.readObject0(ObjectInputStream.java:1297)
	at java.io.ObjectInputStream.readObject(ObjectInputStream.java:351)
	at hudson.remoting.Channel$ReaderThread.run(Channel.java:856)
FATAL: channel is already closed
hudson.remoting.ChannelClosedException: channel is already closed
	at hudson.remoting.Channel.send(Channel.java:412)
	at hudson.remoting.Request.call(Request.java:105)
	at hudson.remoting.Channel.call(Channel.java:551)
	at hudson.Launcher$RemoteLauncher.kill(Launcher.java:735)
	at hudson.model.AbstractBuild$AbstractRunner.run(AbstractBuild.java:421)
	at hudson.model.Run.run(Run.java:1243)
	at hudson.maven.MavenModuleSetBuild.run(MavenModuleSetBuild.java:304)
	at hudson.model.ResourceController.execute(ResourceController.java:88)
	at hudson.model.Executor.run(Executor.java:122)


Mime
View raw message