ode-dev mailing list archives

Site index · List index
Message view « Date » · « Thread »
Top « Date » · « Thread »
From Apache Hudson Server <hud...@hudson.zones.apache.org>
Subject Build failed in Hudson: ODE-trunk-maven2-jdk5 #110
Date Mon, 02 Aug 2010 15:19:09 GMT
See <http://hudson.zones.apache.org/hudson/job/ODE-trunk-maven2-jdk5/110/changes>

Changes:

[jeffyu] * update maven-surefire-plugin version, also updated some properties into environment
for execution.
* enabled the axis2-war testing module, now only security part test and two other tests were
exclude.

------------------------------------------
[...truncated 4151 lines...]
Profiling config: <http://hudson.zones.apache.org/hudson/job/ODE-trunk-maven2-jdk5/ws/trunk/axis2-war/target/webapp/WEB-INF/conf.jpa-derby.>
[SimpleHTTPServer] Stop called
Test config: <http://hudson.zones.apache.org/hudson/job/ODE-trunk-maven2-jdk5/ws/trunk/axis2-war/target/webapp/WEB-INF/conf.jpa-derby.>
Profiling config: <http://hudson.zones.apache.org/hudson/job/ODE-trunk-maven2-jdk5/ws/trunk/axis2-war/target/webapp/WEB-INF/conf.jpa-derby.>
Profiling config: <http://hudson.zones.apache.org/hudson/job/ODE-trunk-maven2-jdk5/ws/trunk/axis2-war/target/webapp/WEB-INF/conf.jpa-derby.>
[SimpleHTTPServer] Stop called
Test config: <http://hudson.zones.apache.org/hudson/job/ODE-trunk-maven2-jdk5/ws/trunk/axis2-war/target/webapp/WEB-INF/conf.jpa-derby.>
Profiling config: <http://hudson.zones.apache.org/hudson/job/ODE-trunk-maven2-jdk5/ws/trunk/axis2-war/target/webapp/WEB-INF/conf.jpa-derby.>
Profiling config: <http://hudson.zones.apache.org/hudson/job/ODE-trunk-maven2-jdk5/ws/trunk/axis2-war/target/webapp/WEB-INF/conf.jpa-derby.>
[SimpleHTTPServer] Stop called
Test config: <http://hudson.zones.apache.org/hudson/job/ODE-trunk-maven2-jdk5/ws/trunk/axis2-war/target/webapp/WEB-INF/conf.jpa-derby.>
Profiling config: <http://hudson.zones.apache.org/hudson/job/ODE-trunk-maven2-jdk5/ws/trunk/axis2-war/target/webapp/WEB-INF/conf.jpa-derby.>
Profiling config: <http://hudson.zones.apache.org/hudson/job/ODE-trunk-maven2-jdk5/ws/trunk/axis2-war/target/webapp/WEB-INF/conf.jpa-derby.>
[SimpleHTTPServer] Stop called
Tests run: 8, Failures: 0, Errors: 0, Skipped: 0, Time elapsed: 56.85 sec
Running TestSuite
Test config: default.
Tests run: 3, Failures: 1, Errors: 0, Skipped: 2, Time elapsed: 5.495 sec <<< FAILURE!
[SimpleHTTPServer] Stop called
Running TestSuite
Test config: default.
Tests run: 3, Failures: 1, Errors: 0, Skipped: 2, Time elapsed: 5.584 sec <<< FAILURE!
[SimpleHTTPServer] Stop called
Running TestSuite
Test config: default.
Tests run: 3, Failures: 1, Errors: 0, Skipped: 2, Time elapsed: 5.529 sec <<< FAILURE!
[SimpleHTTPServer] Stop called
Running TestSuite
Test config: <http://hudson.zones.apache.org/hudson/job/ODE-trunk-maven2-jdk5/ws/trunk/axis2-war/target/webapp/WEB-INF/conf.jpa-derby.>
=>
<?xml version='1.0' encoding='UTF-8'?><soapenv:Envelope xmlns:soapenv="http://schemas.xmlsoap.org/soap/envelope/"><soapenv:Body><odens:hello1Response
xmlns:odens="http://ode/bpel/unit-test.wsdl"><TestPart>1;2;3;</TestPart></odens:hello1Response></soapenv:Body></soapenv:Envelope>

[SimpleHTTPServer] Stop called
Tests run: 1, Failures: 0, Errors: 0, Skipped: 0, Time elapsed: 13.043 sec
Running TestSuite
Test config: <http://hudson.zones.apache.org/hudson/job/ODE-trunk-maven2-jdk5/ws/trunk/axis2-war/target/webapp/WEB-INF/conf.hib-derby.>
Tests run: 3, Failures: 1, Errors: 0, Skipped: 2, Time elapsed: 5.511 sec <<< FAILURE!
[SimpleHTTPServer] Stop called
Running TestSuite
Test config: default.
Tests run: 3, Failures: 1, Errors: 0, Skipped: 2, Time elapsed: 5.577 sec <<< FAILURE!
[SimpleHTTPServer] Stop called
Running TestSuite
Test config: default.
Tests run: 6, Failures: 1, Errors: 0, Skipped: 5, Time elapsed: 5.466 sec <<< FAILURE!
[SimpleHTTPServer] Stop called
Running TestSuite
Tests run: 0, Failures: 0, Errors: 0, Skipped: 0, Time elapsed: 0.292 sec
Running TestSuite
Test config: <http://hudson.zones.apache.org/hudson/job/ODE-trunk-maven2-jdk5/ws/trunk/axis2-war/target/webapp/WEB-INF/conf.jpa-derby.>
[SimpleHTTPServer] Stop called
Tests run: 1, Failures: 0, Errors: 0, Skipped: 0, Time elapsed: 10.007 sec
Running TestSuite
Test config: default.
Tests run: 3, Failures: 1, Errors: 0, Skipped: 2, Time elapsed: 5.689 sec <<< FAILURE!
[SimpleHTTPServer] Stop called
Running TestSuite
Tests run: 0, Failures: 0, Errors: 0, Skipped: 0, Time elapsed: 0.167 sec
Running TestSuite
Test config: <http://hudson.zones.apache.org/hudson/job/ODE-trunk-maven2-jdk5/ws/trunk/axis2-war/target/webapp/WEB-INF/conf.hib-derby.>
Tests run: 3, Failures: 1, Errors: 0, Skipped: 2, Time elapsed: 5.499 sec <<< FAILURE!
[SimpleHTTPServer] Stop called
Running TestSuite
Test config: <http://hudson.zones.apache.org/hudson/job/ODE-trunk-maven2-jdk5/ws/trunk/axis2-war/target/webapp/WEB-INF/conf.hib-derby.>
Tests run: 3, Failures: 1, Errors: 0, Skipped: 2, Time elapsed: 5.548 sec <<< FAILURE!
[SimpleHTTPServer] Stop called
Running TestSuite
Test config: <http://hudson.zones.apache.org/hudson/job/ODE-trunk-maven2-jdk5/ws/trunk/axis2-war/target/webapp/WEB-INF/conf.jpa-derby.>
<?xml version='1.0' encoding='UTF-8'?><soapenv:Envelope xmlns:soapenv="http://schemas.xmlsoap.org/soap/envelope/"><soapenv:Body><soapenv:Fault><faultcode>soapenv:Server</faultcode><faultstring
xmlns:axis2ns3="http://axis2.ode.apache.org">axis2ns3:DummyException</faultstring><detail><DummyException
xmlns="http://axis2.ode.apache.org" xmlns:axis2ns1="http://axis2.ode.apache.org" xmlns:axis2ns2="http://schemas.xmlsoap.org/soap/envelope/"><reason
xmlns="">Something went wrong. Fortunately, it was meant to be.</reason></DummyException></detail></soapenv:Fault></soapenv:Body></soapenv:Envelope>

Profiling config: <http://hudson.zones.apache.org/hudson/job/ODE-trunk-maven2-jdk5/ws/trunk/axis2-war/target/webapp/WEB-INF/conf.jpa-derby.>
Profiling config: <http://hudson.zones.apache.org/hudson/job/ODE-trunk-maven2-jdk5/ws/trunk/axis2-war/target/webapp/WEB-INF/conf.jpa-derby.>
Profiling config: <http://hudson.zones.apache.org/hudson/job/ODE-trunk-maven2-jdk5/ws/trunk/axis2-war/target/webapp/WEB-INF/conf.jpa-derby.>
[SimpleHTTPServer] Stop called
Test config: <http://hudson.zones.apache.org/hudson/job/ODE-trunk-maven2-jdk5/ws/trunk/axis2-war/target/webapp/WEB-INF/conf.jpa-derby.>
[SimpleHTTPServer] Stop called
Test config: <http://hudson.zones.apache.org/hudson/job/ODE-trunk-maven2-jdk5/ws/trunk/axis2-war/target/webapp/WEB-INF/conf.jpa-derby.>
<?xml version='1.0' encoding='UTF-8'?><soapenv:Envelope xmlns:soapenv="http://schemas.xmlsoap.org/soap/envelope/"><soapenv:Body><soapenv:Fault><faultcode>soapenv:Server</faultcode><faultstring
xmlns:axis2ns6="http://axis2.ode.apache.org">axis2ns6:DummyException</faultstring><detail><DummyException
xmlns="http://axis2.ode.apache.org" xmlns:axis2ns5="http://schemas.xmlsoap.org/soap/envelope/"
xmlns:axis2ns4="http://axis2.ode.apache.org"><reason xmlns="">Something went wrong.
Fortunately, it was meant to be.</reason></DummyException></detail></soapenv:Fault></soapenv:Body></soapenv:Envelope>

Profiling config: <http://hudson.zones.apache.org/hudson/job/ODE-trunk-maven2-jdk5/ws/trunk/axis2-war/target/webapp/WEB-INF/conf.jpa-derby.>
Profiling config: <http://hudson.zones.apache.org/hudson/job/ODE-trunk-maven2-jdk5/ws/trunk/axis2-war/target/webapp/WEB-INF/conf.jpa-derby.>
Profiling config: <http://hudson.zones.apache.org/hudson/job/ODE-trunk-maven2-jdk5/ws/trunk/axis2-war/target/webapp/WEB-INF/conf.jpa-derby.>
[SimpleHTTPServer] Stop called
Test config: <http://hudson.zones.apache.org/hudson/job/ODE-trunk-maven2-jdk5/ws/trunk/axis2-war/target/webapp/WEB-INF/conf.jpa-derby.>
<?xml version='1.0' encoding='UTF-8'?><soapenv:Envelope xmlns:soapenv="http://schemas.xmlsoap.org/soap/envelope/"><soapenv:Body><soapenv:Fault><faultcode>soapenv:Server</faultcode><faultstring
xmlns:axis2ns9="http://axis2.ode.apache.org">axis2ns9:DummyException</faultstring><detail><DummyException
xmlns="http://axis2.ode.apache.org" xmlns:axis2ns7="http://axis2.ode.apache.org" xmlns:axis2ns8="http://schemas.xmlsoap.org/soap/envelope/"><reason
xmlns="">Something went wrong. Fortunately, it was meant to be.</reason></DummyException></detail></soapenv:Fault></soapenv:Body></soapenv:Envelope>

Profiling config: <http://hudson.zones.apache.org/hudson/job/ODE-trunk-maven2-jdk5/ws/trunk/axis2-war/target/webapp/WEB-INF/conf.jpa-derby.>
Profiling config: <http://hudson.zones.apache.org/hudson/job/ODE-trunk-maven2-jdk5/ws/trunk/axis2-war/target/webapp/WEB-INF/conf.jpa-derby.>
Profiling config: <http://hudson.zones.apache.org/hudson/job/ODE-trunk-maven2-jdk5/ws/trunk/axis2-war/target/webapp/WEB-INF/conf.jpa-derby.>
[SimpleHTTPServer] Stop called
Test config: <http://hudson.zones.apache.org/hudson/job/ODE-trunk-maven2-jdk5/ws/trunk/axis2-war/target/webapp/WEB-INF/conf.jpa-derby.>
<?xml version='1.0' encoding='UTF-8'?><soapenv:Envelope xmlns:soapenv="http://schemas.xmlsoap.org/soap/envelope/"><soapenv:Body><soapenv:Fault><faultcode>soapenv:Server</faultcode><faultstring
xmlns:axis2ns12="http://axis2.ode.apache.org">axis2ns12:DummyException</faultstring><detail><DummyException
xmlns="http://axis2.ode.apache.org" xmlns:axis2ns10="http://axis2.ode.apache.org" xmlns:axis2ns11="http://schemas.xmlsoap.org/soap/envelope/"><reason
xmlns="">Something went wrong. Fortunately, it was meant to be.</reason></DummyException></detail></soapenv:Fault></soapenv:Body></soapenv:Envelope>

Profiling config: <http://hudson.zones.apache.org/hudson/job/ODE-trunk-maven2-jdk5/ws/trunk/axis2-war/target/webapp/WEB-INF/conf.jpa-derby.>
Profiling config: <http://hudson.zones.apache.org/hudson/job/ODE-trunk-maven2-jdk5/ws/trunk/axis2-war/target/webapp/WEB-INF/conf.jpa-derby.>
Profiling config: <http://hudson.zones.apache.org/hudson/job/ODE-trunk-maven2-jdk5/ws/trunk/axis2-war/target/webapp/WEB-INF/conf.jpa-derby.>
[SimpleHTTPServer] Stop called
Test config: <http://hudson.zones.apache.org/hudson/job/ODE-trunk-maven2-jdk5/ws/trunk/axis2-war/target/webapp/WEB-INF/conf.jpa-derby.>
<?xml version='1.0' encoding='UTF-8'?><soapenv:Envelope xmlns:soapenv="http://schemas.xmlsoap.org/soap/envelope/"><soapenv:Body><soapenv:Fault><faultcode>soapenv:Server</faultcode><faultstring
xmlns:axis2ns15="http://axis2.ode.apache.org">axis2ns15:DummyException</faultstring><detail><DummyException
xmlns="http://axis2.ode.apache.org" xmlns:axis2ns14="http://schemas.xmlsoap.org/soap/envelope/"
xmlns:axis2ns13="http://axis2.ode.apache.org"><reason xmlns="">Something went wrong.
Fortunately, it was meant to be.</reason></DummyException></detail></soapenv:Fault></soapenv:Body></soapenv:Envelope>

Profiling config: <http://hudson.zones.apache.org/hudson/job/ODE-trunk-maven2-jdk5/ws/trunk/axis2-war/target/webapp/WEB-INF/conf.jpa-derby.>
Profiling config: <http://hudson.zones.apache.org/hudson/job/ODE-trunk-maven2-jdk5/ws/trunk/axis2-war/target/webapp/WEB-INF/conf.jpa-derby.>
Profiling config: <http://hudson.zones.apache.org/hudson/job/ODE-trunk-maven2-jdk5/ws/trunk/axis2-war/target/webapp/WEB-INF/conf.jpa-derby.>
[SimpleHTTPServer] Stop called
Test config: <http://hudson.zones.apache.org/hudson/job/ODE-trunk-maven2-jdk5/ws/trunk/axis2-war/target/webapp/WEB-INF/conf.jpa-derby.>
<?xml version='1.0' encoding='UTF-8'?><soapenv:Envelope xmlns:soapenv="http://schemas.xmlsoap.org/soap/envelope/"><soapenv:Body><soapenv:Fault><faultcode>soapenv:Server</faultcode><faultstring
xmlns:axis2ns18="http://axis2.ode.apache.org">axis2ns18:DummyException</faultstring><detail><DummyException
xmlns="http://axis2.ode.apache.org" xmlns:axis2ns17="http://schemas.xmlsoap.org/soap/envelope/"
xmlns:axis2ns16="http://axis2.ode.apache.org"><reason xmlns="">Something went wrong.
Fortunately, it was meant to be.</reason></DummyException></detail></soapenv:Fault></soapenv:Body></soapenv:Envelope>

Profiling config: <http://hudson.zones.apache.org/hudson/job/ODE-trunk-maven2-jdk5/ws/trunk/axis2-war/target/webapp/WEB-INF/conf.jpa-derby.>
Profiling config: <http://hudson.zones.apache.org/hudson/job/ODE-trunk-maven2-jdk5/ws/trunk/axis2-war/target/webapp/WEB-INF/conf.jpa-derby.>
Profiling config: <http://hudson.zones.apache.org/hudson/job/ODE-trunk-maven2-jdk5/ws/trunk/axis2-war/target/webapp/WEB-INF/conf.jpa-derby.>
[SimpleHTTPServer] Stop called
Test config: <http://hudson.zones.apache.org/hudson/job/ODE-trunk-maven2-jdk5/ws/trunk/axis2-war/target/webapp/WEB-INF/conf.jpa-derby.>
<?xml version='1.0' encoding='UTF-8'?><soapenv:Envelope xmlns:soapenv="http://schemas.xmlsoap.org/soap/envelope/"><soapenv:Body><soapenv:Fault><faultcode>soapenv:Server</faultcode><faultstring
xmlns:axis2ns21="http://axis2.ode.apache.org">axis2ns21:DummyException</faultstring><detail><DummyException
xmlns="http://axis2.ode.apache.org" xmlns:axis2ns20="http://schemas.xmlsoap.org/soap/envelope/"
xmlns:axis2ns19="http://axis2.ode.apache.org"><reason xmlns="">Something went wrong.
Fortunately, it was meant to be.</reason></DummyException></detail></soapenv:Fault></soapenv:Body></soapenv:Envelope>

Profiling config: <http://hudson.zones.apache.org/hudson/job/ODE-trunk-maven2-jdk5/ws/trunk/axis2-war/target/webapp/WEB-INF/conf.jpa-derby.>
Profiling config: <http://hudson.zones.apache.org/hudson/job/ODE-trunk-maven2-jdk5/ws/trunk/axis2-war/target/webapp/WEB-INF/conf.jpa-derby.>
Profiling config: <http://hudson.zones.apache.org/hudson/job/ODE-trunk-maven2-jdk5/ws/trunk/axis2-war/target/webapp/WEB-INF/conf.jpa-derby.>
[SimpleHTTPServer] Stop called
Tests run: 8, Failures: 0, Errors: 0, Skipped: 0, Time elapsed: 25.521 sec
Running TestSuite
Test config: default.
Tests run: 3, Failures: 1, Errors: 0, Skipped: 2, Time elapsed: 5.535 sec <<< FAILURE!
[SimpleHTTPServer] Stop called
Running TestSuite
Test config: <http://hudson.zones.apache.org/hudson/job/ODE-trunk-maven2-jdk5/ws/trunk/axis2-war/target/webapp/WEB-INF/conf.hib-derby.>
Tests run: 24, Failures: 1, Errors: 0, Skipped: 23, Time elapsed: 5.49 sec <<< FAILURE!
[SimpleHTTPServer] Stop called
Running TestSuite
Test config: default.
Tests run: 3, Failures: 1, Errors: 0, Skipped: 2, Time elapsed: 5.43 sec <<< FAILURE!
[SimpleHTTPServer] Stop called
Running TestSuite
Test config: <http://hudson.zones.apache.org/hudson/job/ODE-trunk-maven2-jdk5/ws/trunk/axis2-war/target/webapp/WEB-INF/conf.hib-derby.>
Tests run: 3, Failures: 1, Errors: 0, Skipped: 2, Time elapsed: 5.528 sec <<< FAILURE!
[SimpleHTTPServer] Stop called
Running TestSuite
Tests run: 0, Failures: 0, Errors: 0, Skipped: 0, Time elapsed: 0.306 sec
Running TestSuite
Test config: default.
Tests run: 15, Failures: 1, Errors: 0, Skipped: 14, Time elapsed: 5.556 sec <<< FAILURE!
[SimpleHTTPServer] Stop called
Running TestSuite
Test config: default.
Tests run: 3, Failures: 1, Errors: 0, Skipped: 2, Time elapsed: 5.503 sec <<< FAILURE!
[SimpleHTTPServer] Stop called
Running TestSuite
Test config: default.
Tests run: 3, Failures: 1, Errors: 0, Skipped: 2, Time elapsed: 5.551 sec <<< FAILURE!
[SimpleHTTPServer] Stop called
Running TestSuite
Test config: <http://hudson.zones.apache.org/hudson/job/ODE-trunk-maven2-jdk5/ws/trunk/axis2-war/target/webapp/WEB-INF/conf.jpa-derby.>
Profiling config: <http://hudson.zones.apache.org/hudson/job/ODE-trunk-maven2-jdk5/ws/trunk/axis2-war/target/webapp/WEB-INF/conf.jpa-derby.>
[SimpleHTTPServer] Stop called
Tests run: 1, Failures: 0, Errors: 0, Skipped: 0, Time elapsed: 6.996 sec
Running TestSuite
Test config: <http://hudson.zones.apache.org/hudson/job/ODE-trunk-maven2-jdk5/ws/trunk/axis2-war/target/webapp/WEB-INF/conf.hib-derby.>
Tests run: 3, Failures: 1, Errors: 0, Skipped: 2, Time elapsed: 5.067 sec <<< FAILURE!
[SimpleHTTPServer] Stop called
Running TestSuite
Test config: <http://hudson.zones.apache.org/hudson/job/ODE-trunk-maven2-jdk5/ws/trunk/axis2-war/target/webapp/WEB-INF/conf.hib-derby.>
Tests run: 24, Failures: 1, Errors: 0, Skipped: 23, Time elapsed: 5.538 sec <<< FAILURE!
[SimpleHTTPServer] Stop called
Running TestSuite
Test config: <http://hudson.zones.apache.org/hudson/job/ODE-trunk-maven2-jdk5/ws/trunk/axis2-war/target/webapp/WEB-INF/conf.jpa-derby.>
=>
<?xml version='1.0' encoding='UTF-8'?><soapenv:Envelope xmlns:soapenv="http://schemas.xmlsoap.org/soap/envelope/"><soapenv:Body><odens:hello1Response
xmlns:odens="http://ode/bpel/unit-test.wsdl"><TestPart>1;3;2;</TestPart></odens:hello1Response></soapenv:Body></soapenv:Envelope>

[SimpleHTTPServer] Stop called
Tests run: 1, Failures: 0, Errors: 0, Skipped: 0, Time elapsed: 13.077 sec
Running TestSuite
Test config: default.
Tests run: 3, Failures: 1, Errors: 0, Skipped: 2, Time elapsed: 5.506 sec <<< FAILURE!
[SimpleHTTPServer] Stop called
Running TestSuite
Test config: default.
Tests run: 3, Failures: 1, Errors: 0, Skipped: 2, Time elapsed: 5.519 sec <<< FAILURE!

Results :

Failed tests: 
  setUp(org.apache.ode.axis2.EndpointTimeoutsTest)

Tests run: 149, Failures: 24, Errors: 0, Skipped: 105

[SimpleHTTPServer] Stop called
[ERROR] There are test failures.

Please refer to <http://hudson.zones.apache.org/hudson/job/ODE-trunk-maven2-jdk5/ws/trunk/axis2-war/target/surefire-reports>
for the individual test results.
[HUDSON] Recording test results
[HUDSON] Archiving <http://hudson.zones.apache.org/hudson/job/ODE-trunk-maven2-jdk5/ws/trunk/axis2-war/pom.xml>
to /export/home/hudson/hudson/jobs/ODE-trunk-maven2-jdk5/modules/org.apache.ode$ode-axis2-war/builds/2010-08-02_14-40-12/archive/org.apache.ode/ode-axis2-war/1.3.5-SNAPSHOT/pom.xml
[HUDSON] Archiving <http://hudson.zones.apache.org/hudson/job/ODE-trunk-maven2-jdk5/ws/trunk/axis2-war/target/ode-axis2-war-1.3.5-SNAPSHOT.war>
to /export/home/hudson/hudson/jobs/ODE-trunk-maven2-jdk5/modules/org.apache.ode$ode-axis2-war/builds/2010-08-02_14-40-12/archive/org.apache.ode/ode-axis2-war/1.3.5-SNAPSHOT/ode-axis2-war-1.3.5-SNAPSHOT.war
[INFO] ------------------------------------------------------------------------
[INFO] Building ODE :: BPELUnit Integration Tests
[INFO]    task-segment: [clean, test, integration-test]
[INFO] ------------------------------------------------------------------------
[INFO] snapshot net.bpelunit:bpelunit:1.4.1-SNAPSHOT: checking for updates from oss.sonatype.snapshots
[INFO] snapshot net.bpelunit:bpelunit:1.4.1-SNAPSHOT: checking for updates from central
[INFO] snapshot net.bpelunit:bpelunit:1.4.1-SNAPSHOT: checking for updates from apache.snapshots
[INFO] [clean:clean {execution: default-clean}]
[INFO] Deleting file set: <http://hudson.zones.apache.org/hudson/job/ODE-trunk-maven2-jdk5/ws/trunk/bpel-itest/target>
(included: [**], excluded: [])
[INFO] snapshot net.bpelunit:maven-bpelunit-plugin:1.4.1-SNAPSHOT: checking for updates from
oss.sonatype.snapshots
[INFO] [remote-resources:process {execution: default}]
[INFO] [remote-resources:process {execution: default}]
[INFO] [site:attach-descriptor {execution: default-attach-descriptor}]
[INFO] Preparing jetty:run-war
[WARNING] Removing: run-war from forked lifecycle, to prevent recursive invocation.
[HUDSON] Archiving <http://hudson.zones.apache.org/hudson/job/ODE-trunk-maven2-jdk5/ws/trunk/bpel-itest/pom.xml>
to /export/home/hudson/hudson/jobs/ODE-trunk-maven2-jdk5/modules/org.apache.ode$ode-bpelunit-itests/builds/2010-08-02_14-40-12/archive/org.apache.ode/ode-bpelunit-itests/1.3.5-SNAPSHOT/pom.xml
[INFO] [remote-resources:process {execution: default}]
[INFO] [site:attach-descriptor {execution: default-attach-descriptor}]
[INFO] [jetty:run-war {execution: start-jetty}]
[INFO] Configuring Jetty for project: ODE :: BPELUnit Integration Tests
[INFO] Context path = /ode
[INFO] Tmp directory = <http://hudson.zones.apache.org/hudson/job/ODE-trunk-maven2-jdk5/ws/trunk/bpel-itest/target/tmp>
[INFO] Web defaults = org/eclipse/jetty/webapp/webdefault.xml
[INFO] Web overrides =  none
[INFO] Starting jetty 7.1.5.v20100705 ...
2010-08-02 15:18:00.895:INFO::jetty-7.1.5.v20100705
2010-08-02 15:18:00.948:INFO::Extract jar:<http://hudson.zones.apache.org/hudson/job/ODE-trunk-maven2-jdk5/ws/trunk/axis2-war/target/ode-axis2-war-1.3.5-SNAPSHOT.war!/>
to <http://hudson.zones.apache.org/hudson/job/ODE-trunk-maven2-jdk5/ws/trunk/bpel-itest/target/tmp/webapp>
2010-08-02 15:18:04.539:INFO::No Transaction manager found - if your webapp requires one,
please configure one.
15:18:05,767 INFO  [ODEServer] Using DAO Connection Factory class org.apache.ode.dao.jpa.BPELDAOConnectionFactoryImpl.
15:18:09,769 INFO  [BpelServerImpl] BPEL Server Started.
15:18:09,773 INFO  [SystemSchedulesConfig] SYSTEM CRON configuration: <http://hudson.zones.apache.org/hudson/job/ODE-trunk-maven2-jdk5/ws/trunk/bpel-itest/target/tmp/webapp/WEB-INF/conf/schedules.xml>
15:18:11,323 INFO  [DeploymentPoller] Poller started.
15:18:11,323 INFO  [ODEServer] Process deployment polling started on path <http://hudson.zones.apache.org/hudson/job/ODE-trunk-maven2-jdk5/ws/trunk/bpel-itest/target/tmp/webapp/WEB-INF/processes.>
15:18:11,323 INFO  [ODEServer] ODE Service Engine has been started.
2010-08-02 15:18:11.334:WARN::FAILED SelectChannelConnector@0.0.0.0:8080: java.net.BindException:
Address already in use
2010-08-02 15:18:11.334:WARN::FAILED org.mortbay.jetty.plugin.JettyServer@6c72e9: java.net.BindException:
Address already in use
[INFO] ------------------------------------------------------------------------
[ERROR] BUILD ERROR
[INFO] ------------------------------------------------------------------------
[INFO] Failure

Embedded error: Address already in use
[INFO] ------------------------------------------------------------------------
[INFO] For more information, run Maven with the -e switch
[INFO] ------------------------------------------------------------------------
[INFO] Total time: 35 minutes 28 seconds
[INFO] Finished at: Mon Aug 02 15:18:12 UTC 2010
[INFO] Final Memory: 117M/297M
[INFO] ------------------------------------------------------------------------
Waiting for Hudson to finish collecting data
Sending e-mails to: dev@ode.apache.org jeffyu@apache.org
Sending e-mails to: dev@ode.apache.org jeffyu@apache.org
Sending e-mails to: dev@ode.apache.org
Sending e-mails to: dev@ode.apache.org jeffyu@apache.org
channel stopped
15:20:02,296 INFO  [DeploymentPoller] Poller stopped.
15:20:02,296 INFO  [BpelServerImpl] BPEL Server Stopped.
15:20:02,345 INFO  [ODEServer] Shutdown completed. 


Mime
View raw message