ode-dev mailing list archives

Site index · List index
Message view « Date » · « Thread »
Top « Date » · « Thread »
From Apache Hudson Server <hud...@hudson.apache.org>
Subject Build failed in Hudson: ODE-trunk-maven2-jdk5 #121
Date Wed, 18 Aug 2010 12:43:01 GMT
See <https://hudson.apache.org/hudson/job/ODE-trunk-maven2-jdk5/121/changes>

Changes:

[jeffyu] * revert back to the original ode-trunk. (without adding jpa refactoring work)

[jeffyu] * ODE-805, cleanup jpa module. will commit this first, and then make a branch for
this.

------------------------------------------
[...truncated 41147 lines...]
11:38:14,739 WARN  [BpelObjectFactory$BOMSAXErrorHandler] null:file:///zonestorage/hudson_solaris/home/hudson/hudson-slave/workspace/ODE-trunk-maven2-jdk5/trunk/bpel-itest/target/tmp/webapp/WEB-INF/processes/TestFlowActivity1-6/TestActivityFlow.bpel:237:97:cvc-complex-type.3.2.2:
Attribute 'query' is not allowed to appear in element 'to'.
11:38:14,740 WARN  [BpelObjectFactory$BOMSAXErrorHandler] null:file:///zonestorage/hudson_solaris/home/hudson/hudson-slave/workspace/ODE-trunk-maven2-jdk5/trunk/bpel-itest/target/tmp/webapp/WEB-INF/processes/TestFlowActivity1-6/TestActivityFlow.bpel:247:95:cvc-complex-type.3.2.2:
Attribute 'query' is not allowed to appear in element 'to'.
11:38:14,740 WARN  [BpelObjectFactory$BOMSAXErrorHandler] null:file:///zonestorage/hudson_solaris/home/hudson/hudson-slave/workspace/ODE-trunk-maven2-jdk5/trunk/bpel-itest/target/tmp/webapp/WEB-INF/processes/TestFlowActivity1-6/TestActivityFlow.bpel:260:95:cvc-complex-type.3.2.2:
Attribute 'query' is not allowed to appear in element 'to'.
11:38:14,740 WARN  [BpelObjectFactory$BOMSAXErrorHandler] null:file:///zonestorage/hudson_solaris/home/hudson/hudson-slave/workspace/ODE-trunk-maven2-jdk5/trunk/bpel-itest/target/tmp/webapp/WEB-INF/processes/TestFlowActivity1-6/TestActivityFlow.bpel:271:95:cvc-complex-type.3.2.2:
Attribute 'query' is not allowed to appear in element 'to'.
11:38:14,741 WARN  [BpelObjectFactory$BOMSAXErrorHandler] null:file:///zonestorage/hudson_solaris/home/hudson/hudson-slave/workspace/ODE-trunk-maven2-jdk5/trunk/bpel-itest/target/tmp/webapp/WEB-INF/processes/TestFlowActivity1-6/TestActivityFlow.bpel:284:95:cvc-complex-type.3.2.2:
Attribute 'query' is not allowed to appear in element 'to'.
11:38:14,742 WARN  [BpelObjectFactory$BOMSAXErrorHandler] null:file:///zonestorage/hudson_solaris/home/hudson/hudson-slave/workspace/ODE-trunk-maven2-jdk5/trunk/bpel-itest/target/tmp/webapp/WEB-INF/processes/TestFlowActivity1-6/TestActivityFlow.bpel:295:48:cvc-complex-type.3.2.2:
Attribute 'query' is not allowed to appear in element 'to'.
11:38:14,742 WARN  [BpelObjectFactory$BOMSAXErrorHandler] null:file:///zonestorage/hudson_solaris/home/hudson/hudson-slave/workspace/ODE-trunk-maven2-jdk5/trunk/bpel-itest/target/tmp/webapp/WEB-INF/processes/TestFlowActivity1-6/TestActivityFlow.bpel:301:97:cvc-complex-type.3.2.2:
Attribute 'query' is not allowed to appear in element 'to'.
11:38:14,743 WARN  [BpelObjectFactory$BOMSAXErrorHandler] null:file:///zonestorage/hudson_solaris/home/hudson/hudson-slave/workspace/ODE-trunk-maven2-jdk5/trunk/bpel-itest/target/tmp/webapp/WEB-INF/processes/TestFlowActivity1-6/TestActivityFlow.bpel:314:97:cvc-complex-type.3.2.2:
Attribute 'query' is not allowed to appear in element 'to'.
11:38:14,743 WARN  [BpelObjectFactory$BOMSAXErrorHandler] null:file:///zonestorage/hudson_solaris/home/hudson/hudson-slave/workspace/ODE-trunk-maven2-jdk5/trunk/bpel-itest/target/tmp/webapp/WEB-INF/processes/TestFlowActivity1-6/TestActivityFlow.bpel:326:49:cvc-complex-type.3.2.2:
Attribute 'query' is not allowed to appear in element 'to'.
11:38:14,744 WARN  [BpelObjectFactory$BOMSAXErrorHandler] null:file:///zonestorage/hudson_solaris/home/hudson/hudson-slave/workspace/ODE-trunk-maven2-jdk5/trunk/bpel-itest/target/tmp/webapp/WEB-INF/processes/TestFlowActivity1-6/TestActivityFlow.bpel:332:98:cvc-complex-type.3.2.2:
Attribute 'query' is not allowed to appear in element 'to'.
11:38:14,744 WARN  [BpelObjectFactory$BOMSAXErrorHandler] null:file:///zonestorage/hudson_solaris/home/hudson/hudson-slave/workspace/ODE-trunk-maven2-jdk5/trunk/bpel-itest/target/tmp/webapp/WEB-INF/processes/TestFlowActivity1-6/TestActivityFlow.bpel:345:98:cvc-complex-type.3.2.2:
Attribute 'query' is not allowed to appear in element 'to'.
11:38:14,745 WARN  [BpelObjectFactory$BOMSAXErrorHandler] null:file:///zonestorage/hudson_solaris/home/hudson/hudson-slave/workspace/ODE-trunk-maven2-jdk5/trunk/bpel-itest/target/tmp/webapp/WEB-INF/processes/TestFlowActivity1-6/TestActivityFlow.bpel:356:49:cvc-complex-type.3.2.2:
Attribute 'query' is not allowed to appear in element 'to'.
11:38:14,745 WARN  [BpelObjectFactory$BOMSAXErrorHandler] null:file:///zonestorage/hudson_solaris/home/hudson/hudson-slave/workspace/ODE-trunk-maven2-jdk5/trunk/bpel-itest/target/tmp/webapp/WEB-INF/processes/TestFlowActivity1-6/TestActivityFlow.bpel:362:98:cvc-complex-type.3.2.2:
Attribute 'query' is not allowed to appear in element 'to'.
11:38:14,746 WARN  [BpelObjectFactory$BOMSAXErrorHandler] null:file:///zonestorage/hudson_solaris/home/hudson/hudson-slave/workspace/ODE-trunk-maven2-jdk5/trunk/bpel-itest/target/tmp/webapp/WEB-INF/processes/TestFlowActivity1-6/TestActivityFlow.bpel:375:98:cvc-complex-type.3.2.2:
Attribute 'query' is not allowed to appear in element 'to'.
11:38:14,746 WARN  [BpelObjectFactory$BOMSAXErrorHandler] null:file:///zonestorage/hudson_solaris/home/hudson/hudson-slave/workspace/ODE-trunk-maven2-jdk5/trunk/bpel-itest/target/tmp/webapp/WEB-INF/processes/TestFlowActivity1-6/TestActivityFlow.bpel:386:53:cvc-complex-type.3.2.2:
Attribute 'query' is not allowed to appear in element 'to'.
11:38:14,747 WARN  [BpelObjectFactory$BOMSAXErrorHandler] null:file:///zonestorage/hudson_solaris/home/hudson/hudson-slave/workspace/ODE-trunk-maven2-jdk5/trunk/bpel-itest/target/tmp/webapp/WEB-INF/processes/TestFlowActivity1-6/TestActivityFlow.bpel:392:95:cvc-complex-type.3.2.2:
Attribute 'query' is not allowed to appear in element 'to'.
11:38:14,747 WARN  [BpelObjectFactory$BOMSAXErrorHandler] null:file:///zonestorage/hudson_solaris/home/hudson/hudson-slave/workspace/ODE-trunk-maven2-jdk5/trunk/bpel-itest/target/tmp/webapp/WEB-INF/processes/TestFlowActivity1-6/TestActivityFlow.bpel:400:95:cvc-complex-type.3.2.2:
Attribute 'query' is not allowed to appear in element 'to'.
11:38:14,748 WARN  [BpelObjectFactory$BOMSAXErrorHandler] null:file:///zonestorage/hudson_solaris/home/hudson/hudson-slave/workspace/ODE-trunk-maven2-jdk5/trunk/bpel-itest/target/tmp/webapp/WEB-INF/processes/TestFlowActivity1-6/TestActivityFlow.bpel:414:127:cvc-complex-type.3.2.2:
Attribute 'query' is not allowed to appear in element 'to'.
11:38:14,748 WARN  [BpelObjectFactory$BOMSAXErrorHandler] null:file:///zonestorage/hudson_solaris/home/hudson/hudson-slave/workspace/ODE-trunk-maven2-jdk5/trunk/bpel-itest/target/tmp/webapp/WEB-INF/processes/TestFlowActivity1-6/TestActivityFlow.bpel:418:114:cvc-complex-type.3.2.2:
Attribute 'query' is not allowed to appear in element 'to'.
11:38:14,749 WARN  [BpelObjectFactory$BOMSAXErrorHandler] null:file:///zonestorage/hudson_solaris/home/hudson/hudson-slave/workspace/ODE-trunk-maven2-jdk5/trunk/bpel-itest/target/tmp/webapp/WEB-INF/processes/TestFlowActivity1-6/TestActivityFlow.bpel:424:114:cvc-complex-type.3.2.2:
Attribute 'query' is not allowed to appear in element 'to'.
11:38:14,749 WARN  [BpelObjectFactory$BOMSAXErrorHandler] null:file:///zonestorage/hudson_solaris/home/hudson/hudson-slave/workspace/ODE-trunk-maven2-jdk5/trunk/bpel-itest/target/tmp/webapp/WEB-INF/processes/TestFlowActivity1-6/TestActivityFlow.bpel:440:106:cvc-complex-type.3.2.2:
Attribute 'query' is not allowed to appear in element 'to'.
11:38:14,750 WARN  [BpelObjectFactory$BOMSAXErrorHandler] null:file:///zonestorage/hudson_solaris/home/hudson/hudson-slave/workspace/ODE-trunk-maven2-jdk5/trunk/bpel-itest/target/tmp/webapp/WEB-INF/processes/TestFlowActivity1-6/TestActivityFlow.bpel:446:106:cvc-complex-type.3.2.2:
Attribute 'query' is not allowed to appear in element 'to'.
11:38:14,750 WARN  [BpelObjectFactory$BOMSAXErrorHandler] null:file:///zonestorage/hudson_solaris/home/hudson/hudson-slave/workspace/ODE-trunk-maven2-jdk5/trunk/bpel-itest/target/tmp/webapp/WEB-INF/processes/TestFlowActivity1-6/TestActivityFlow.bpel:453:108:cvc-complex-type.3.2.2:
Attribute 'query' is not allowed to appear in element 'from'.
11:38:14,750 WARN  [BpelObjectFactory$BOMSAXErrorHandler] null:file:///zonestorage/hudson_solaris/home/hudson/hudson-slave/workspace/ODE-trunk-maven2-jdk5/trunk/bpel-itest/target/tmp/webapp/WEB-INF/processes/TestFlowActivity1-6/TestActivityFlow.bpel:454:100:cvc-complex-type.3.2.2:
Attribute 'query' is not allowed to appear in element 'to'.
11:38:14,751 WARN  [BpelObjectFactory$BOMSAXErrorHandler] null:file:///zonestorage/hudson_solaris/home/hudson/hudson-slave/workspace/ODE-trunk-maven2-jdk5/trunk/bpel-itest/target/tmp/webapp/WEB-INF/processes/TestFlowActivity1-6/TestActivityFlow.bpel:457:108:cvc-complex-type.3.2.2:
Attribute 'query' is not allowed to appear in element 'from'.
11:38:14,751 WARN  [BpelObjectFactory$BOMSAXErrorHandler] null:file:///zonestorage/hudson_solaris/home/hudson/hudson-slave/workspace/ODE-trunk-maven2-jdk5/trunk/bpel-itest/target/tmp/webapp/WEB-INF/processes/TestFlowActivity1-6/TestActivityFlow.bpel:458:102:cvc-complex-type.3.2.2:
Attribute 'query' is not allowed to appear in element 'to'.
11:38:14,751 WARN  [BpelObjectFactory] Validation errors during parsing, continuing due to
-Dorg.apache.ode.compiler.failOnValidationErrors=false switch
11:38:14,889 INFO  [CronScheduler] Cancelling PROCESS CRON jobs for: {http://ode/bpel/unit-test/testFlowActivity1}TestActivityFlow-6
11:38:14,889 INFO  [CronScheduler] Scheduling PROCESS CRON jobs for: {http://ode/bpel/unit-test/testFlowActivity1}TestActivityFlow-6
11:38:14,958 INFO  [BpelProcess] Created new process DAO for {http://ode/bpel/unit-test/testFlowActivity1}TestActivityFlow-6
(guid=2v2g4pifsewuds0tfo3gswf8g9q5n58f)
11:38:14,958 INFO  [BpelProcess] Created new process DAO for {http://ode/bpel/unit-test/testFlowActivity1}TestActivityFlow-6
(guid=2v2g4pifsewuds0tfo3gswf8g9q5n58f).
11:38:14,963 INFO  [BpelServerImpl] Registered process {http://ode/bpel/unit-test/testFlowActivity1}TestActivityFlow-6.
11:38:14,963 INFO  [CronScheduler] Cancelling PROCESS CRON jobs for: {http://ode/bpel/unit-test/testFlowActivity1}TestActivityFlow-6
11:38:14,963 INFO  [CronScheduler] Scheduling PROCESS CRON jobs for: {http://ode/bpel/unit-test/testFlowActivity1}TestActivityFlow-6
11:38:14,963 ERROR [DeploymentPoller] Error while creating  file TestFlowActivity1-6.deployed
,deployment could be inconsistent
11:38:14,963 INFO  [DeploymentWebService] Deployment of artifact TestFlowActivity1-6 successful.
[INFO] Running BPELUnit: TestFlowActivity1.bpts
11:38:15,003 WARN  [BpelRuntimeContextImpl] Couldn't extract property '{OProperty {http://ode/bpel/unit-test/testFlowActivity1.wsdl}testFlow1}'
and variable {Variable __PROCESS_SCOPE:TestActivityFlow.request:OMessageVarType#9({http://ode/bpel/unit-test/testFlowActivity1.wsdl}requestMessage)}
at TestActivityFlow:51 in property pre-extraction: org.apache.ode.bpel.common.FaultException:
No results for expression: 'typens:flowIndicators/typens:indicatorOne' against '<?xml version="1.0"
encoding="UTF-8"?>
<request xmlns="http://ode/bpel/unit-test/testFlowActivity1.wsdl.types">
  <typens:requestID xmlns:typens="http://ode/bpel/unit-test/testFlowActivity1.wsdl.types">null</typens:requestID>
  <typens:requestText xmlns:typens="http://ode/bpel/unit-test/testFlowActivity1.wsdl.types">null</typens:requestText>
  <typens:flowIndicator xmlns:typens="http://ode/bpel/unit-test/testFlowActivity1.wsdl.types">
  	<typens:indicatorOne>yes</typens:indicatorOne><typens:indicatorTwo>yes</typens:indicatorTwo>
  </typens:flowIndicator>
  <loopIndicator xmlns="http://docs.oasis-open.org/wsbpel/2.0/process/executable">null</loopIndicator>
</request>'
11:38:15,003 WARN  [BpelRuntimeContextImpl] Couldn't extract property '{OProperty {http://ode/bpel/unit-test/testFlowActivity1.wsdl}loopInd}'
and variable {Variable __PROCESS_SCOPE:TestActivityFlow.request:OMessageVarType#9({http://ode/bpel/unit-test/testFlowActivity1.wsdl}requestMessage)}
at TestActivityFlow:51 in property pre-extraction: org.apache.ode.bpel.common.FaultException:
No results for expression: 'typens:loopIndicator' against '<?xml version="1.0" encoding="UTF-8"?>
<request xmlns="http://ode/bpel/unit-test/testFlowActivity1.wsdl.types">
  <typens:requestID xmlns:typens="http://ode/bpel/unit-test/testFlowActivity1.wsdl.types">null</typens:requestID>
  <typens:requestText xmlns:typens="http://ode/bpel/unit-test/testFlowActivity1.wsdl.types">null</typens:requestText>
  <typens:flowIndicator xmlns:typens="http://ode/bpel/unit-test/testFlowActivity1.wsdl.types">
  	<typens:indicatorOne>yes</typens:indicatorOne><typens:indicatorTwo>yes</typens:indicatorTwo>
  </typens:flowIndicator>
  <loopIndicator xmlns="http://docs.oasis-open.org/wsbpel/2.0/process/executable">null</loopIndicator>
</request>'
[INFO] Tests run: 1, Failures: 1, Errors: 0, Time elapsed: 0.328 sec
11:38:16,448 INFO  [CronScheduler] Cancelling PROCESS CRON jobs for: {http://ode/bpel/unit-test/testFlowActivity1}TestActivityFlow-6
11:38:16,448 INFO  [CronScheduler] Scheduling PROCESS CRON jobs for: {http://ode/bpel/unit-test/testFlowActivity1}TestActivityFlow-6
11:38:16,459 INFO  [BpelServerImpl] Unregistered process {http://ode/bpel/unit-test/testFlowActivity1}TestActivityFlow-6.
11:38:16,581 INFO  [BpelServerImpl] Deleted only the process {http://ode/bpel/unit-test/testFlowActivity1}TestActivityFlow-6.
11:38:16,587 INFO  [CronScheduler] Cancelling PROCESS CRON jobs for: {http://ode/bpel/unit-test/testFlowActivity1}TestActivityFlow-6
11:38:16,589 ERROR [DeploymentPoller] Error while deleting file TestFlowActivity1-6.deployed
, please check if file is locked or if it really exist
11:38:16,792 INFO  [CronScheduler] Cancelling PROCESS CRON jobs for: {http://ode/bpel/unit-test}TestIf-7
11:38:16,792 INFO  [CronScheduler] Scheduling PROCESS CRON jobs for: {http://ode/bpel/unit-test}TestIf-7
11:38:16,831 INFO  [BpelProcess] Created new process DAO for {http://ode/bpel/unit-test}TestIf-7
(guid=1gk04ui1g2fnq5qid3oe4nkbkai8ic7g)
11:38:16,831 INFO  [BpelProcess] Created new process DAO for {http://ode/bpel/unit-test}TestIf-7
(guid=1gk04ui1g2fnq5qid3oe4nkbkai8ic7g).
11:38:16,837 INFO  [BpelServerImpl] Registered process {http://ode/bpel/unit-test}TestIf-7.
11:38:16,838 INFO  [CronScheduler] Cancelling PROCESS CRON jobs for: {http://ode/bpel/unit-test}TestIf-7
11:38:16,838 INFO  [CronScheduler] Scheduling PROCESS CRON jobs for: {http://ode/bpel/unit-test}TestIf-7
11:38:16,839 ERROR [DeploymentPoller] Error while creating  file TestIf-7.deployed ,deployment
could be inconsistent
11:38:16,839 INFO  [DeploymentWebService] Deployment of artifact TestIf-7 successful.
[INFO] Running BPELUnit: TestIf.bpts
[INFO] Tests run: 1, Failures: 0, Errors: 0, Time elapsed: 0.373 sec
11:38:18,320 INFO  [BpelServerImpl] Unregistered process {http://ode/bpel/unit-test}TestIf-7.
11:38:18,360 INFO  [BpelServerImpl] Deleted only the process {http://ode/bpel/unit-test}TestIf-7.
11:38:18,362 INFO  [CronScheduler] Cancelling PROCESS CRON jobs for: {http://ode/bpel/unit-test}TestIf-7
11:38:18,394 ERROR [DeploymentPoller] Error while deleting file TestIf-7.deployed , please
check if file is locked or if it really exist
11:38:18,494 WARN  [BpelObjectFactory$BOMSAXErrorHandler] null:file:///zonestorage/hudson_solaris/home/hudson/hudson-slave/workspace/ODE-trunk-maven2-jdk5/trunk/bpel-itest/target/tmp/webapp/WEB-INF/processes/TestCorrelationJoinOnMessage-8/CorrelationJoinOnMessageTest.bpel:39:18:cvc-complex-type.2.4.a:
Invalid content was found starting with element 'bpel:variables'. One of '{"http://docs.oasis-open.org/wsbpel/2.0/process/executable":faultHandlers,
"http://docs.oasis-open.org/wsbpel/2.0/process/executable":eventHandlers, "http://docs.oasis-open.org/wsbpel/2.0/process/executable":assign,
"http://docs.oasis-open.org/wsbpel/2.0/process/executable":compensate, "http://docs.oasis-open.org/wsbpel/2.0/process/executable":compensateScope,
"http://docs.oasis-open.org/wsbpel/2.0/process/executable":empty, "http://docs.oasis-open.org/wsbpel/2.0/process/executable":exit,
"http://docs.oasis-open.org/wsbpel/2.0/process/executable":extensionActivity, "http://docs.oasis-open.org/wsbpel/2.0/process/executable":flow,
"http://docs.oasis-open.org/wsbpel/2.0/process/executable":forEach, "http://docs.oasis-open.org/wsbpel/2.0/process/executable":if,
"http://docs.oasis-open.org/wsbpel/2.0/process/executable":invoke, "http://docs.oasis-open.org/wsbpel/2.0/process/executable":pick,
"http://docs.oasis-open.org/wsbpel/2.0/process/executable":receive, "http://docs.oasis-open.org/wsbpel/2.0/process/executable":repeatUntil,
"http://docs.oasis-open.org/wsbpel/2.0/process/executable":reply, "http://docs.oasis-open.org/wsbpel/2.0/process/executable":rethrow,
"http://docs.oasis-open.org/wsbpel/2.0/process/executable":scope, "http://docs.oasis-open.org/wsbpel/2.0/process/executable":sequence,
"http://docs.oasis-open.org/wsbpel/2.0/process/executable":throw, "http://docs.oasis-open.org/wsbpel/2.0/process/executable":validate,
"http://docs.oasis-open.org/wsbpel/2.0/process/executable":wait, "http://docs.oasis-open.org/wsbpel/2.0/process/executable":while}'
is expected.
11:38:18,499 WARN  [BpelObjectFactory] Validation errors during parsing, continuing due to
-Dorg.apache.ode.compiler.failOnValidationErrors=false switch
11:38:18,556 INFO  [CronScheduler] Cancelling PROCESS CRON jobs for: {http://ode.apache.org/test4/process}Process-8
11:38:18,556 INFO  [CronScheduler] Scheduling PROCESS CRON jobs for: {http://ode.apache.org/test4/process}Process-8
11:38:18,615 INFO  [BpelProcess] Created new process DAO for {http://ode.apache.org/test4/process}Process-8
(guid=2xct5qg0tl92fhrf95f58rbo09xcpl4f)
11:38:18,615 INFO  [BpelProcess] Created new process DAO for {http://ode.apache.org/test4/process}Process-8
(guid=2xct5qg0tl92fhrf95f58rbo09xcpl4f).
11:38:18,620 INFO  [BpelServerImpl] Registered process {http://ode.apache.org/test4/process}Process-8.
11:38:18,620 INFO  [CronScheduler] Cancelling PROCESS CRON jobs for: {http://ode.apache.org/test4/process}Process-8
11:38:18,620 INFO  [CronScheduler] Scheduling PROCESS CRON jobs for: {http://ode.apache.org/test4/process}Process-8
11:38:18,620 ERROR [DeploymentPoller] Error while creating  file TestCorrelationJoinOnMessage-8.deployed
,deployment could be inconsistent
11:38:18,620 INFO  [DeploymentWebService] Deployment of artifact TestCorrelationJoinOnMessage-8
successful.
[INFO] Running BPELUnit: TestCorrelationJoinOnMessage.bpts
[INFO] Tests run: 2, Failures: 0, Errors: 1, Time elapsed: 0.016 sec
11:38:19,731 INFO  [CronScheduler] Cancelling PROCESS CRON jobs for: {http://ode.apache.org/test4/process}Process-8
11:38:19,731 INFO  [CronScheduler] Scheduling PROCESS CRON jobs for: {http://ode.apache.org/test4/process}Process-8
11:38:19,746 INFO  [BpelServerImpl] Unregistered process {http://ode.apache.org/test4/process}Process-8.
11:38:19,757 WARN  [Runtime] Detected possible orphaned reference to deleted object "org.apache.ode.dao.jpa.CorrelatorDAOImpl-111"
in "org.apache.ode.dao.jpa.MessageExchangeDAOImpl._correlator".
11:38:19,764 INFO  [BpelServerImpl] Deleted only the process {http://ode.apache.org/test4/process}Process-8.
11:38:19,766 INFO  [CronScheduler] Cancelling PROCESS CRON jobs for: {http://ode.apache.org/test4/process}Process-8
11:38:19,769 ERROR [DeploymentPoller] Error while deleting file TestCorrelationJoinOnMessage-8.deployed
, please check if file is locked or if it really exist
11:38:19,896 WARN  [BpelObjectFactory$BOMSAXErrorHandler] null:file:///zonestorage/hudson_solaris/home/hudson/hudson-slave/workspace/ODE-trunk-maven2-jdk5/trunk/bpel-itest/target/tmp/webapp/WEB-INF/processes/TestComposeUrl-9/ComposeUrl.bpel:57:76:cvc-complex-type.3.2.2:
Attribute 'query' is not allowed to appear in element 'to'.
11:38:19,896 WARN  [BpelObjectFactory$BOMSAXErrorHandler] null:file:///zonestorage/hudson_solaris/home/hudson/hudson-slave/workspace/ODE-trunk-maven2-jdk5/trunk/bpel-itest/target/tmp/webapp/WEB-INF/processes/TestComposeUrl-9/ComposeUrl.bpel:64:80:cvc-complex-type.3.2.2:
Attribute 'query' is not allowed to appear in element 'to'.
11:38:19,897 WARN  [BpelObjectFactory] Validation errors during parsing, continuing due to
-Dorg.apache.ode.compiler.failOnValidationErrors=false switch
11:38:19,937 INFO  [CronScheduler] Cancelling PROCESS CRON jobs for: {http://ode/bpel/unit-test}ComposeUrl-9
11:38:19,937 INFO  [CronScheduler] Scheduling PROCESS CRON jobs for: {http://ode/bpel/unit-test}ComposeUrl-9
11:38:19,973 INFO  [BpelProcess] Created new process DAO for {http://ode/bpel/unit-test}ComposeUrl-9
(guid=3pe4hcmw6uwo7nh1n59ccwrklewx1iwd)
11:38:19,973 INFO  [BpelProcess] Created new process DAO for {http://ode/bpel/unit-test}ComposeUrl-9
(guid=3pe4hcmw6uwo7nh1n59ccwrklewx1iwd).
11:38:19,977 INFO  [BpelServerImpl] Registered process {http://ode/bpel/unit-test}ComposeUrl-9.
11:38:19,977 INFO  [CronScheduler] Cancelling PROCESS CRON jobs for: {http://ode/bpel/unit-test}ComposeUrl-9
11:38:19,977 INFO  [CronScheduler] Scheduling PROCESS CRON jobs for: {http://ode/bpel/unit-test}ComposeUrl-9
11:38:19,977 ERROR [DeploymentPoller] Error while creating  file TestComposeUrl-9.deployed
,deployment could be inconsistent
11:38:19,977 INFO  [DeploymentWebService] Deployment of artifact TestComposeUrl-9 successful.
[INFO] Running BPELUnit: TestComposeUrl.bpts
[INFO] Tests run: 2, Failures: 0, Errors: 0, Time elapsed: 0.175 sec
11:38:21,251 INFO  [BpelServerImpl] Unregistered process {http://ode/bpel/unit-test}ComposeUrl-9.
11:38:21,333 INFO  [BpelServerImpl] Deleted only the process {http://ode/bpel/unit-test}ComposeUrl-9.
11:38:21,337 INFO  [CronScheduler] Cancelling PROCESS CRON jobs for: {http://ode/bpel/unit-test}ComposeUrl-9
11:38:21,339 ERROR [DeploymentPoller] Error while deleting file TestComposeUrl-9.deployed
, please check if file is locked or if it really exist
Error on line 11 
  FOAR0001: Integer division by zero
11:38:21,678 INFO  [CronScheduler] Cancelling PROCESS CRON jobs for: {http://ode/bpel/unit-test}HelloXQueryWorld-10
11:38:21,678 INFO  [CronScheduler] Scheduling PROCESS CRON jobs for: {http://ode/bpel/unit-test}HelloXQueryWorld-10
11:38:21,760 INFO  [BpelProcess] Created new process DAO for {http://ode/bpel/unit-test}HelloXQueryWorld-10
(guid=3csobwtvc5f9ui70pm84koikghg73805)
11:38:21,760 INFO  [BpelProcess] Created new process DAO for {http://ode/bpel/unit-test}HelloXQueryWorld-10
(guid=3csobwtvc5f9ui70pm84koikghg73805).
11:38:21,763 INFO  [BpelServerImpl] Registered process {http://ode/bpel/unit-test}HelloXQueryWorld-10.
11:38:21,763 INFO  [CronScheduler] Cancelling PROCESS CRON jobs for: {http://ode/bpel/unit-test}HelloXQueryWorld-10
11:38:21,763 INFO  [CronScheduler] Scheduling PROCESS CRON jobs for: {http://ode/bpel/unit-test}HelloXQueryWorld-10
11:38:21,763 ERROR [DeploymentPoller] Error while creating  file TestXQueryExpression-10.deployed
,deployment could be inconsistent
11:38:21,763 INFO  [DeploymentWebService] Deployment of artifact TestXQueryExpression-10 successful.
[INFO] Running BPELUnit: TestXQueryExpression.bpts
11:38:21,820 WARN  [BpelRuntimeContextImpl] Couldn't extract property '{OProperty {http://ode/bpel/unit-test.wsdl}content}'
and variable {Variable __PROCESS_SCOPE:HelloXQueryWorld.myVar:OMessageVarType#7({http://ode/bpel/unit-test.wsdl}HelloXQueryMessage)}
at HelloXQueryWorld:43 in property pre-extraction: org.apache.ode.bpel.common.FaultException:
No results for expression: 'content' against '<?xml version="1.0" encoding="UTF-8"?>
<TestPart xmlns:SOAP-ENV="http://schemas.xmlsoap.org/soap/envelope/" xmlns:rpcwrappernsprefix="http://ode/bpel/unit-test.wsdl"
xmlns:tes="http://www.bpelunit.org/schema/testSuite">HelloXQuery World</TestPart>'
Error on line 11 
  FOAR0001: Integer division by zero
11:38:21,874 WARN  [SCOPE] ({OScope 'scope-implicit-scope-line-197' id=100},TerminationChannel#61,ParentScopeChannel#63):
has a fault handler for {http://docs.oasis-open.org/wsbpel/2.0/process/executable}subLanguageExecutionFault:
{OCatch faultName={http://docs.oasis-open.org/wsbpel/2.0/process/executable}subLanguageExecutionFault,
faultVariable=null} ,  FaultData: [faultName={http://docs.oasis-open.org/wsbpel/2.0/process/executable}subLanguageExecutionFault,
faulType=null (An exception occured while evaluating "{OXPath10Expression null}": Error while
executing an XQuery expression: net.sf.saxon.trans.XPathException: Integer division by zero)]
@204
[INFO] Tests run: 1, Failures: 1, Errors: 0, Time elapsed: 0.217 sec
11:38:23,267 INFO  [CronScheduler] Cancelling PROCESS CRON jobs for: {http://ode/bpel/unit-test}HelloXQueryWorld-10
11:38:23,267 INFO  [CronScheduler] Scheduling PROCESS CRON jobs for: {http://ode/bpel/unit-test}HelloXQueryWorld-10
11:38:23,287 INFO  [BpelServerImpl] Unregistered process {http://ode/bpel/unit-test}HelloXQueryWorld-10.
11:38:23,372 INFO  [BpelServerImpl] Deleted only the process {http://ode/bpel/unit-test}HelloXQueryWorld-10.
11:38:23,388 INFO  [CronScheduler] Cancelling PROCESS CRON jobs for: {http://ode/bpel/unit-test}HelloXQueryWorld-10
11:38:23,391 ERROR [DeploymentPoller] Error while deleting file TestXQueryExpression-10.deployed
, please check if file is locked or if it really exist
11:38:23,736 INFO  [CronScheduler] Cancelling PROCESS CRON jobs for: {http://example.com/NewDiagram/Pool}Pool-11
11:38:23,736 INFO  [CronScheduler] Scheduling PROCESS CRON jobs for: {http://example.com/NewDiagram/Pool}Pool-11
11:38:23,774 INFO  [BpelProcess] Created new process DAO for {http://example.com/NewDiagram/Pool}Pool-11
(guid=6hqjv7pq21kasqw5tnftj9m543xqblfs)
11:38:23,774 INFO  [BpelProcess] Created new process DAO for {http://example.com/NewDiagram/Pool}Pool-11
(guid=6hqjv7pq21kasqw5tnftj9m543xqblfs).
11:38:23,788 INFO  [BpelServerImpl] Registered process {http://example.com/NewDiagram/Pool}Pool-11.
11:38:23,788 INFO  [CronScheduler] Cancelling PROCESS CRON jobs for: {http://example.com/NewDiagram/Pool}Pool-11
11:38:23,788 INFO  [CronScheduler] Scheduling PROCESS CRON jobs for: {http://example.com/NewDiagram/Pool}Pool-11
11:38:23,789 ERROR [DeploymentPoller] Error while creating  file TestAssignDate-11.deployed
,deployment could be inconsistent
11:38:23,789 INFO  [DeploymentWebService] Deployment of artifact TestAssignDate-11 successful.
[INFO] Running BPELUnit: TestAssignDate.bpts
[INFO] Tests run: 1, Failures: 0, Errors: 0, Time elapsed: 0.109 sec
11:38:25,034 INFO  [BpelServerImpl] Unregistered process {http://example.com/NewDiagram/Pool}Pool-11.
11:38:25,079 INFO  [BpelServerImpl] Deleted only the process {http://example.com/NewDiagram/Pool}Pool-11.
11:38:25,081 INFO  [CronScheduler] Cancelling PROCESS CRON jobs for: {http://example.com/NewDiagram/Pool}Pool-11
11:38:25,084 ERROR [DeploymentPoller] Error while deleting file TestAssignDate-11.deployed
, please check if file is locked or if it really exist
[INFO] ------------------------------------------------------------------------
[INFO] Building ODE :: Distribution
[INFO]    task-segment: [clean, test, integration-test]
[INFO] ------------------------------------------------------------------------
[INFO] [clean:clean {execution: default-clean}]
[INFO] [remote-resources:process {execution: default}]
[INFO] [remote-resources:process {execution: default}]
[INFO] [site:attach-descriptor {execution: default-attach-descriptor}]
[INFO] [assembly:single {execution: war-distro}]
[INFO] Reading assembly descriptor: src/main/assembly/war.xml
[WARNING] Cannot include project artifact: org.apache.ode:ode-distro:pom:1.3.5-SNAPSHOT; it
doesn't have an associated file or directory.
[WARNING] Cannot include project artifact: org.apache.ode:ode-distro:pom:1.3.5-SNAPSHOT; it
doesn't have an associated file or directory.
[WARNING] Cannot include project artifact: org.apache.ode:ode-distro:pom:1.3.5-SNAPSHOT; it
doesn't have an associated file or directory.
[INFO] Building zip: <https://hudson.apache.org/hudson/job/ODE-trunk-maven2-jdk5/ws/trunk/distro/target/apache-ode-war-1.3.5-SNAPSHOT.zip>
[INFO] [assembly:single {execution: jbi-distro}]
[INFO] Reading assembly descriptor: src/main/assembly/jbi.xml
[WARNING] Cannot include project artifact: org.apache.ode:ode-distro:pom:1.3.5-SNAPSHOT; it
doesn't have an associated file or directory.
[WARNING] Cannot include project artifact: org.apache.ode:ode-distro:pom:1.3.5-SNAPSHOT; it
doesn't have an associated file or directory.
[WARNING] Cannot include project artifact: org.apache.ode:ode-distro:pom:1.3.5-SNAPSHOT; it
doesn't have an associated file or directory.
[INFO] Building zip: <https://hudson.apache.org/hudson/job/ODE-trunk-maven2-jdk5/ws/trunk/distro/target/apache-ode-jbi-1.3.5-SNAPSHOT.zip>
[HUDSON] Archiving <https://hudson.apache.org/hudson/job/ODE-trunk-maven2-jdk5/ws/trunk/distro/pom.xml>
to /home/hudson/hudson/jobs/ODE-trunk-maven2-jdk5/modules/org.apache.ode$ode-distro/builds/2010-08-18_09-44-17/archive/org.apache.ode/ode-distro/1.3.5-SNAPSHOT/pom.xml
[HUDSON] Archiving <https://hudson.apache.org/hudson/job/ODE-trunk-maven2-jdk5/ws/trunk/distro/target/apache-ode-war-1.3.5-SNAPSHOT.zip>
to /home/hudson/hudson/jobs/ODE-trunk-maven2-jdk5/modules/org.apache.ode$ode-distro/builds/2010-08-18_09-44-17/archive/org.apache.ode/ode-distro/1.3.5-SNAPSHOT/apache-ode-war-1.3.5-SNAPSHOT.zip
[HUDSON] Archiving <https://hudson.apache.org/hudson/job/ODE-trunk-maven2-jdk5/ws/trunk/distro/target/apache-ode-jbi-1.3.5-SNAPSHOT.zip>
to /home/hudson/hudson/jobs/ODE-trunk-maven2-jdk5/modules/org.apache.ode$ode-distro/builds/2010-08-18_09-44-17/archive/org.apache.ode/ode-distro/1.3.5-SNAPSHOT/apache-ode-jbi-1.3.5-SNAPSHOT.zip
Build timed out. Aborting
Sending e-mails to: dev@ode.apache.org jeff.yuchang@gmail.com
Sending e-mails to: dev@ode.apache.org jeff.yuchang@gmail.com
channel stopped
12:43:52,353 INFO  [DeploymentPoller] Poller stopped.
12:43:52,353 INFO  [BpelServerImpl] BPEL Server Stopped.
[INFO] ------------------------------------------------------------------------
[ERROR] FATAL ERROR
[INFO] ------------------------------------------------------------------------
[INFO] null
[INFO] ------------------------------------------------------------------------
[INFO] Trace
java.lang.reflect.UndeclaredThrowableException
	at $Proxy2.isArchivingDisabled(Unknown Source)
	at hudson.maven.MavenBuildProxy$Filter.isArchivingDisabled(MavenBuildProxy.java:222)
	at hudson.maven.reporters.MavenArtifact.archive(MavenArtifact.java:192)
	at hudson.maven.reporters.MavenArtifactArchiver.postBuild(MavenArtifactArchiver.java:109)
	at hudson.maven.MavenModuleSetBuild$Builder.postModule(MavenModuleSetBuild.java:741)
	at hudson.maven.MavenBuilder$Adapter.fireLeaveModule(MavenBuilder.java:317)
	at hudson.maven.MavenBuilder$Adapter.postBuild(MavenBuilder.java:275)
	at org.apache.maven.lifecycle.LifecycleExecutorInterceptor.execute(LifecycleExecutorInterceptor.java:68)
	at org.apache.maven.DefaultMaven.doExecute(DefaultMaven.java:328)
	at org.apache.maven.DefaultMaven.execute(DefaultMaven.java:138)
	at org.apache.maven.cli.MavenCli.main(MavenCli.java:362)
	at sun.reflect.NativeMethodAccessorImpl.invoke0(Native Method)
	at sun.reflect.NativeMethodAccessorImpl.invoke(NativeMethodAccessorImpl.java:39)
	at sun.reflect.DelegatingMethodAccessorImpl.invoke(DelegatingMethodAccessorImpl.java:25)
	at java.lang.reflect.Method.invoke(Method.java:585)
	at org.codehaus.classworlds.Launcher.launchEnhanced(Launcher.java:315)
	at org.codehaus.classworlds.Launcher.launch(Launcher.java:255)
	at hudson.maven.agent.Main.launch(Main.java:165)
	at hudson.maven.MavenBuilder.call(MavenBuilder.java:165)
	at hudson.maven.MavenModuleSetBuild$Builder.call(MavenModuleSetBuild.java:708)
	at hudson.maven.MavenModuleSetBuild$Builder.call(MavenModuleSetBuild.java:652)
	at hudson.remoting.UserRequest.perform(UserRequest.java:114)
	at hudson.remoting.UserRequest.perform(UserRequest.java:48)
	at hudson.remoting.Request$2.run(Request.java:270)
	at java.util.concurrent.Executors$RunnableAdapter.call(Executors.java:417)
	at java.util.concurrent.FutureTask$Sync.innerRun(FutureTask.java:269)
	at java.util.concurrent.FutureTask.run(FutureTask.java:123)
	at java.util.concurrent.ThreadPoolExecutor$Worker.runTask(ThreadPoolExecutor.java:650)
	at java.util.concurrent.ThreadPoolExecutor$Worker.run(ThreadPoolExecutor.java:675)
	at java.lang.Thread.run(Thread.java:595)
Caused by: hudson.remoting.ChannelClosedException: channel is already closed
	at hudson.remoting.Channel.send(Channel.java:414)
	at hudson.remoting.Request.call(Request.java:105)
	at hudson.remoting.Channel.call(Channel.java:557)
	at hudson.remoting.RemoteInvocationHandler.invoke(RemoteInvocationHandler.java:158)
	... 30 more
Caused by: hudson.remoting.Channel$OrderlyShutdown
	at hudson.remoting.Channel$CloseCommand.execute(Channel.java:691)
	at hudson.remoting.Channel$ReaderThread.run(Channel.java:890)
Caused by: Command close created at
	at hudson.remoting.Command.<init>(Command.java:58)
	at hudson.remoting.Command.<init>(Command.java:47)
	at hudson.remoting.Channel$CloseCommand.<init>(Channel.java:687)
	at hudson.remoting.Channel$CloseCommand.<init>(Channel.java:687)
	at hudson.remoting.Channel.close(Channel.java:732)
	at hudson.slaves.Channels$1.close(Channels.java:91)
	at hudson.maven.ProcessCache$MavenProcess.discard(ProcessCache.java:145)
	at hudson.maven.MavenModuleSetBuild$RunnerImpl.doRun(MavenModuleSetBuild.java:499)
	at hudson.model.AbstractBuild$AbstractRunner.run(AbstractBuild.java:416)
	at hudson.model.Run.run(Run.java:1248)
	at hudson.maven.MavenModuleSetBuild.run(MavenModuleSetBuild.java:318)
	at hudson.model.ResourceController.execute(ResourceController.java:88)
	at hudson.model.Executor.run(Executor.java:129)
[INFO] ------------------------------------------------------------------------
[INFO] Total time: 177 minutes 46 seconds
[INFO] Finished at: Wed Aug 18 12:43:52 GMT+00:00 2010
[INFO] Final Memory: 108M/377M
[INFO] ------------------------------------------------------------------------
12:43:53,887 INFO  [ODEServer] Shutdown completed. 


Mime
View raw message