ode-dev mailing list archives

Site index · List index
Message view « Date » · « Thread »
Top « Date » · « Thread »
From Apache Hudson Server <hud...@hudson.zones.apache.org>
Subject Build failed in Hudson: ODE-trunk-maven2-jdk5 #118
Date Thu, 05 Aug 2010 15:07:43 GMT
See <http://hudson.zones.apache.org/hudson/job/ODE-trunk-maven2-jdk5/118/changes>

Changes:

[vanto] Logging schema violations as warnings if strict validation is turned off.

------------------------------------------
[...truncated 38255 lines...]
14:07:46,822 INFO  [BpelServerImpl] Registered process {workflowns}TestCase-3.
14:07:46,822 INFO  [CronScheduler] Cancelling PROCESS CRON jobs for: {workflowns}TestCase-3
14:07:46,823 INFO  [CronScheduler] Scheduling PROCESS CRON jobs for: {workflowns}TestCase-3
14:07:46,823 ERROR [DeploymentPoller] Error while creating  file TestFlowLinks-3.deployed
,deployment could be inconsistent
14:07:46,823 INFO  [DeploymentWebService] Deployment of artifact TestFlowLinks-3 successful.
[INFO] Running BPELUnit: TestFlowLinks.bpts
[INFO] Tests run: 1, Failures: 0, Errors: 0, Time elapsed: 0.099 sec
14:07:48,057 INFO  [BpelServerImpl] Unregistered process {workflowns}TestCase-3.
14:07:48,111 INFO  [BpelServerImpl] Deleted only the process {workflowns}TestCase-3.
14:07:48,154 INFO  [CronScheduler] Cancelling PROCESS CRON jobs for: {workflowns}TestCase-3
14:07:48,157 ERROR [DeploymentPoller] Error while deleting file TestFlowLinks-3.deployed ,
please check if file is locked or if it really exist
14:07:48,336 WARN  [BpelObjectFactory$BOMSAXErrorHandler] null:file:///zonestorage/hudson_solaris/home/hudson/hudson-slave/workspace/ODE-trunk-maven2-jdk5/trunk/bpel-itest/target/tmp/webapp/WEB-INF/processes/TestComposeUrl-4/ComposeUrl.bpel:57:76:cvc-complex-type.3.2.2:
Attribute 'query' is not allowed to appear in element 'to'.
14:07:48,337 WARN  [BpelObjectFactory$BOMSAXErrorHandler] null:file:///zonestorage/hudson_solaris/home/hudson/hudson-slave/workspace/ODE-trunk-maven2-jdk5/trunk/bpel-itest/target/tmp/webapp/WEB-INF/processes/TestComposeUrl-4/ComposeUrl.bpel:64:80:cvc-complex-type.3.2.2:
Attribute 'query' is not allowed to appear in element 'to'.
14:07:48,337 WARN  [BpelObjectFactory] Validation errors during parsing, continuing due to
-Dorg.apache.ode.compiler.failOnValidationErrors=false switch
14:07:48,375 INFO  [CronScheduler] Cancelling PROCESS CRON jobs for: {http://ode/bpel/unit-test}ComposeUrl-4
14:07:48,376 INFO  [CronScheduler] Scheduling PROCESS CRON jobs for: {http://ode/bpel/unit-test}ComposeUrl-4
14:07:48,411 INFO  [BpelProcess] Created new process DAO for {http://ode/bpel/unit-test}ComposeUrl-4
(guid=3pe4hcmw6jx2983i4ftdqurtlcg5kitq)
14:07:48,411 INFO  [BpelProcess] Created new process DAO for {http://ode/bpel/unit-test}ComposeUrl-4
(guid=3pe4hcmw6jx2983i4ftdqurtlcg5kitq).
14:07:48,415 INFO  [BpelServerImpl] Registered process {http://ode/bpel/unit-test}ComposeUrl-4.
14:07:48,415 INFO  [CronScheduler] Cancelling PROCESS CRON jobs for: {http://ode/bpel/unit-test}ComposeUrl-4
14:07:48,415 INFO  [CronScheduler] Scheduling PROCESS CRON jobs for: {http://ode/bpel/unit-test}ComposeUrl-4
14:07:48,415 ERROR [DeploymentPoller] Error while creating  file TestComposeUrl-4.deployed
,deployment could be inconsistent
14:07:48,415 INFO  [DeploymentWebService] Deployment of artifact TestComposeUrl-4 successful.
[INFO] Running BPELUnit: TestComposeUrl.bpts
[INFO] Tests run: 2, Failures: 0, Errors: 0, Time elapsed: 0.194 sec
14:07:49,711 INFO  [CronScheduler] Cancelling PROCESS CRON jobs for: {http://ode/bpel/unit-test}ComposeUrl-4
14:07:49,711 INFO  [CronScheduler] Scheduling PROCESS CRON jobs for: {http://ode/bpel/unit-test}ComposeUrl-4
14:07:49,762 INFO  [BpelServerImpl] Unregistered process {http://ode/bpel/unit-test}ComposeUrl-4.
14:07:49,861 INFO  [BpelServerImpl] Deleted only the process {http://ode/bpel/unit-test}ComposeUrl-4.
14:07:49,896 INFO  [CronScheduler] Cancelling PROCESS CRON jobs for: {http://ode/bpel/unit-test}ComposeUrl-4
14:07:49,899 ERROR [DeploymentPoller] Error while deleting file TestComposeUrl-4.deployed
, please check if file is locked or if it really exist
14:07:50,409 INFO  [CronScheduler] Cancelling PROCESS CRON jobs for: {http://example.com/NewDiagram/Pool}Pool-5
14:07:50,409 INFO  [CronScheduler] Scheduling PROCESS CRON jobs for: {http://example.com/NewDiagram/Pool}Pool-5
14:07:50,450 INFO  [BpelProcess] Created new process DAO for {http://example.com/NewDiagram/Pool}Pool-5
(guid=758attbrh1bjlemr1hevcogi0wa2mt69)
14:07:50,450 INFO  [BpelProcess] Created new process DAO for {http://example.com/NewDiagram/Pool}Pool-5
(guid=758attbrh1bjlemr1hevcogi0wa2mt69).
14:07:50,472 INFO  [BpelServerImpl] Registered process {http://example.com/NewDiagram/Pool}Pool-5.
14:07:50,472 INFO  [CronScheduler] Cancelling PROCESS CRON jobs for: {http://example.com/NewDiagram/Pool}Pool-5
14:07:50,472 INFO  [CronScheduler] Scheduling PROCESS CRON jobs for: {http://example.com/NewDiagram/Pool}Pool-5
14:07:50,472 ERROR [DeploymentPoller] Error while creating  file TestAssignDate-5.deployed
,deployment could be inconsistent
14:07:50,472 INFO  [DeploymentWebService] Deployment of artifact TestAssignDate-5 successful.
[INFO] Running BPELUnit: TestAssignDate.bpts
[INFO] Tests run: 1, Failures: 0, Errors: 0, Time elapsed: 0.324 sec
14:07:51,993 INFO  [BpelServerImpl] Unregistered process {http://example.com/NewDiagram/Pool}Pool-5.
14:07:52,046 INFO  [BpelServerImpl] Deleted only the process {http://example.com/NewDiagram/Pool}Pool-5.
14:07:52,049 INFO  [CronScheduler] Cancelling PROCESS CRON jobs for: {http://example.com/NewDiagram/Pool}Pool-5
14:07:52,052 ERROR [DeploymentPoller] Error while deleting file TestAssignDate-5.deployed
, please check if file is locked or if it really exist
14:07:52,158 WARN  [BpelObjectFactory$BOMSAXErrorHandler] null:file:///zonestorage/hudson_solaris/home/hudson/hudson-slave/workspace/ODE-trunk-maven2-jdk5/trunk/bpel-itest/target/tmp/webapp/WEB-INF/processes/TestAssignComplex-6/AssignComplex.bpel:71:33:cvc-complex-type.2.4.a:
Invalid content was found starting with element 'bpel:query'. One of '{"http://schemas.xmlsoap.org/ws/2004/03/business-process/":documentation,
WC[##other:"http://schemas.xmlsoap.org/ws/2004/03/business-process/"], "http://schemas.xmlsoap.org/ws/2004/03/business-process/":literal}'
is expected.
14:07:52,159 WARN  [BpelObjectFactory] Validation errors during parsing, continuing due to
-Dorg.apache.ode.compiler.failOnValidationErrors=false switch
14:07:52,209 INFO  [CronScheduler] Cancelling PROCESS CRON jobs for: {http://example.com/ComplexVariables/Variable}AssignComplex-6
14:07:52,209 INFO  [CronScheduler] Scheduling PROCESS CRON jobs for: {http://example.com/ComplexVariables/Variable}AssignComplex-6
14:07:52,260 INFO  [BpelProcess] Created new process DAO for {http://example.com/ComplexVariables/Variable}AssignComplex-6
(guid=qgwu0n3f9w2n9nlvi3e0o29v7j5swf45)
14:07:52,260 INFO  [BpelProcess] Created new process DAO for {http://example.com/ComplexVariables/Variable}AssignComplex-6
(guid=qgwu0n3f9w2n9nlvi3e0o29v7j5swf45).
14:07:52,264 INFO  [BpelServerImpl] Registered process {http://example.com/ComplexVariables/Variable}AssignComplex-6.
14:07:52,264 INFO  [CronScheduler] Cancelling PROCESS CRON jobs for: {http://example.com/ComplexVariables/Variable}AssignComplex-6
14:07:52,264 INFO  [CronScheduler] Scheduling PROCESS CRON jobs for: {http://example.com/ComplexVariables/Variable}AssignComplex-6
14:07:52,264 ERROR [DeploymentPoller] Error while creating  file TestAssignComplex-6.deployed
,deployment could be inconsistent
14:07:52,264 INFO  [DeploymentWebService] Deployment of artifact TestAssignComplex-6 successful.
[INFO] Running BPELUnit: TestAssignComplex.bpts
[INFO] Tests run: 1, Failures: 0, Errors: 0, Time elapsed: 0.108 sec
14:07:53,568 INFO  [CronScheduler] Cancelling PROCESS CRON jobs for: {http://example.com/ComplexVariables/Variable}AssignComplex-6
14:07:53,568 INFO  [CronScheduler] Scheduling PROCESS CRON jobs for: {http://example.com/ComplexVariables/Variable}AssignComplex-6
14:07:53,642 INFO  [BpelServerImpl] Unregistered process {http://example.com/ComplexVariables/Variable}AssignComplex-6.
14:07:53,681 INFO  [BpelServerImpl] Deleted only the process {http://example.com/ComplexVariables/Variable}AssignComplex-6.
14:07:53,684 INFO  [CronScheduler] Cancelling PROCESS CRON jobs for: {http://example.com/ComplexVariables/Variable}AssignComplex-6
14:07:53,687 ERROR [DeploymentPoller] Error while deleting file TestAssignComplex-6.deployed
, please check if file is locked or if it really exist
14:07:53,748 WARN  [BpelObjectFactory$BOMSAXErrorHandler] null:file:///zonestorage/hudson_solaris/home/hudson/hudson-slave/workspace/ODE-trunk-maven2-jdk5/trunk/bpel-itest/target/tmp/webapp/WEB-INF/processes/TestToQuery-7/QueryTest.bpel:52:133:schema_reference.4:
Failed to read schema document 'QueryTest1.wsdl', because 1) could not find the document;
2) the document could not be read; 3) the root element of the document is not <xsd:schema>.
14:07:53,748 WARN  [BpelObjectFactory$BOMSAXErrorHandler] null:file:///zonestorage/hudson_solaris/home/hudson/hudson-slave/workspace/ODE-trunk-maven2-jdk5/trunk/bpel-itest/target/tmp/webapp/WEB-INF/processes/TestToQuery-7/QueryTest.bpel:53:41:schema_reference.4:
Failed to read schema document 'QueryTest1.wsdl', because 1) could not find the document;
2) the document could not be read; 3) the root element of the document is not <xsd:schema>.
14:07:53,748 WARN  [BpelObjectFactory$BOMSAXErrorHandler] null:file:///zonestorage/hudson_solaris/home/hudson/hudson-slave/workspace/ODE-trunk-maven2-jdk5/trunk/bpel-itest/target/tmp/webapp/WEB-INF/processes/TestToQuery-7/QueryTest.bpel:54:48:schema_reference.4:
Failed to read schema document 'QueryTest1.wsdl', because 1) could not find the document;
2) the document could not be read; 3) the root element of the document is not <xsd:schema>.
14:07:53,748 WARN  [BpelObjectFactory$BOMSAXErrorHandler] null:file:///zonestorage/hudson_solaris/home/hudson/hudson-slave/workspace/ODE-trunk-maven2-jdk5/trunk/bpel-itest/target/tmp/webapp/WEB-INF/processes/TestToQuery-7/QueryTest.bpel:55:51:schema_reference.4:
Failed to read schema document 'QueryTest1.wsdl', because 1) could not find the document;
2) the document could not be read; 3) the root element of the document is not <xsd:schema>.
14:07:53,749 WARN  [BpelObjectFactory$BOMSAXErrorHandler] null:file:///zonestorage/hudson_solaris/home/hudson/hudson-slave/workspace/ODE-trunk-maven2-jdk5/trunk/bpel-itest/target/tmp/webapp/WEB-INF/processes/TestToQuery-7/QueryTest.bpel:57:41:schema_reference.4:
Failed to read schema document 'QueryTest1.wsdl', because 1) could not find the document;
2) the document could not be read; 3) the root element of the document is not <xsd:schema>.
14:07:53,749 WARN  [BpelObjectFactory$BOMSAXErrorHandler] null:file:///zonestorage/hudson_solaris/home/hudson/hudson-slave/workspace/ODE-trunk-maven2-jdk5/trunk/bpel-itest/target/tmp/webapp/WEB-INF/processes/TestToQuery-7/QueryTest.bpel:58:48:schema_reference.4:
Failed to read schema document 'QueryTest1.wsdl', because 1) could not find the document;
2) the document could not be read; 3) the root element of the document is not <xsd:schema>.
14:07:53,749 WARN  [BpelObjectFactory$BOMSAXErrorHandler] null:file:///zonestorage/hudson_solaris/home/hudson/hudson-slave/workspace/ODE-trunk-maven2-jdk5/trunk/bpel-itest/target/tmp/webapp/WEB-INF/processes/TestToQuery-7/QueryTest.bpel:59:51:schema_reference.4:
Failed to read schema document 'QueryTest1.wsdl', because 1) could not find the document;
2) the document could not be read; 3) the root element of the document is not <xsd:schema>.
14:07:53,749 WARN  [BpelObjectFactory$BOMSAXErrorHandler] null:file:///zonestorage/hudson_solaris/home/hudson/hudson-slave/workspace/ODE-trunk-maven2-jdk5/trunk/bpel-itest/target/tmp/webapp/WEB-INF/processes/TestToQuery-7/QueryTest.bpel:61:41:schema_reference.4:
Failed to read schema document 'QueryTest1.wsdl', because 1) could not find the document;
2) the document could not be read; 3) the root element of the document is not <xsd:schema>.
14:07:53,749 WARN  [BpelObjectFactory$BOMSAXErrorHandler] null:file:///zonestorage/hudson_solaris/home/hudson/hudson-slave/workspace/ODE-trunk-maven2-jdk5/trunk/bpel-itest/target/tmp/webapp/WEB-INF/processes/TestToQuery-7/QueryTest.bpel:62:48:schema_reference.4:
Failed to read schema document 'QueryTest1.wsdl', because 1) could not find the document;
2) the document could not be read; 3) the root element of the document is not <xsd:schema>.
14:07:53,749 WARN  [BpelObjectFactory$BOMSAXErrorHandler] null:file:///zonestorage/hudson_solaris/home/hudson/hudson-slave/workspace/ODE-trunk-maven2-jdk5/trunk/bpel-itest/target/tmp/webapp/WEB-INF/processes/TestToQuery-7/QueryTest.bpel:63:51:schema_reference.4:
Failed to read schema document 'QueryTest1.wsdl', because 1) could not find the document;
2) the document could not be read; 3) the root element of the document is not <xsd:schema>.
14:07:53,750 WARN  [BpelObjectFactory$BOMSAXErrorHandler] null:file:///zonestorage/hudson_solaris/home/hudson/hudson-slave/workspace/ODE-trunk-maven2-jdk5/trunk/bpel-itest/target/tmp/webapp/WEB-INF/processes/TestToQuery-7/QueryTest.bpel:76:133:schema_reference.4:
Failed to read schema document 'QueryTest1.wsdl', because 1) could not find the document;
2) the document could not be read; 3) the root element of the document is not <xsd:schema>.
14:07:53,750 WARN  [BpelObjectFactory$BOMSAXErrorHandler] null:file:///zonestorage/hudson_solaris/home/hudson/hudson-slave/workspace/ODE-trunk-maven2-jdk5/trunk/bpel-itest/target/tmp/webapp/WEB-INF/processes/TestToQuery-7/QueryTest.bpel:77:45:schema_reference.4:
Failed to read schema document 'QueryTest1.wsdl', because 1) could not find the document;
2) the document could not be read; 3) the root element of the document is not <xsd:schema>.
14:07:53,750 WARN  [BpelObjectFactory$BOMSAXErrorHandler] null:file:///zonestorage/hudson_solaris/home/hudson/hudson-slave/workspace/ODE-trunk-maven2-jdk5/trunk/bpel-itest/target/tmp/webapp/WEB-INF/processes/TestToQuery-7/QueryTest.bpel:78:48:schema_reference.4:
Failed to read schema document 'QueryTest1.wsdl', because 1) could not find the document;
2) the document could not be read; 3) the root element of the document is not <xsd:schema>.
14:07:53,785 INFO  [CronScheduler] Cancelling PROCESS CRON jobs for: {mynamespace}QueryTest-7
14:07:53,786 INFO  [CronScheduler] Scheduling PROCESS CRON jobs for: {mynamespace}QueryTest-7
14:07:53,822 INFO  [BpelProcess] Created new process DAO for {mynamespace}QueryTest-7 (guid=14bnrs7l5mdn02555qx669tgn11b4pvu)
14:07:53,822 INFO  [BpelProcess] Created new process DAO for {mynamespace}QueryTest-7 (guid=14bnrs7l5mdn02555qx669tgn11b4pvu).
14:07:53,838 INFO  [BpelServerImpl] Registered process {mynamespace}QueryTest-7.
14:07:53,838 INFO  [CronScheduler] Cancelling PROCESS CRON jobs for: {mynamespace}QueryTest-7
14:07:53,838 INFO  [CronScheduler] Scheduling PROCESS CRON jobs for: {mynamespace}QueryTest-7
14:07:53,838 ERROR [DeploymentPoller] Error while creating  file TestToQuery-7.deployed ,deployment
could be inconsistent
14:07:53,838 INFO  [DeploymentWebService] Deployment of artifact TestToQuery-7 successful.
[INFO] Running BPELUnit: TestToQuery.bpts
[INFO] Tests run: 1, Failures: 0, Errors: 0, Time elapsed: 0.468 sec
14:07:55,463 INFO  [BpelServerImpl] Unregistered process {mynamespace}QueryTest-7.
14:07:55,517 INFO  [BpelServerImpl] Deleted only the process {mynamespace}QueryTest-7.
14:07:55,547 INFO  [CronScheduler] Cancelling PROCESS CRON jobs for: {mynamespace}QueryTest-7
14:07:55,550 ERROR [DeploymentPoller] Error while deleting file TestToQuery-7.deployed , please
check if file is locked or if it really exist
Error on line 11 
  FOAR0001: Integer division by zero
14:07:56,262 INFO  [CronScheduler] Cancelling PROCESS CRON jobs for: {http://ode/bpel/unit-test}HelloXQueryWorld-8
14:07:56,262 INFO  [CronScheduler] Scheduling PROCESS CRON jobs for: {http://ode/bpel/unit-test}HelloXQueryWorld-8
14:07:56,343 INFO  [BpelProcess] Created new process DAO for {http://ode/bpel/unit-test}HelloXQueryWorld-8
(guid=3nwk4bvoi6lj7ivrlpm87dqlqj5frxlp)
14:07:56,343 INFO  [BpelProcess] Created new process DAO for {http://ode/bpel/unit-test}HelloXQueryWorld-8
(guid=3nwk4bvoi6lj7ivrlpm87dqlqj5frxlp).
14:07:56,546 INFO  [BpelServerImpl] Registered process {http://ode/bpel/unit-test}HelloXQueryWorld-8.
14:07:56,546 INFO  [CronScheduler] Cancelling PROCESS CRON jobs for: {http://ode/bpel/unit-test}HelloXQueryWorld-8
14:07:56,546 INFO  [CronScheduler] Scheduling PROCESS CRON jobs for: {http://ode/bpel/unit-test}HelloXQueryWorld-8
14:07:56,546 ERROR [DeploymentPoller] Error while creating  file TestXQueryExpression-8.deployed
,deployment could be inconsistent
14:07:56,546 INFO  [DeploymentWebService] Deployment of artifact TestXQueryExpression-8 successful.
[INFO] Running BPELUnit: TestXQueryExpression.bpts
14:07:56,570 INFO  [CronScheduler] Cancelling PROCESS CRON jobs for: {http://ode/bpel/unit-test}HelloXQueryWorld-8
14:07:56,570 INFO  [CronScheduler] Scheduling PROCESS CRON jobs for: {http://ode/bpel/unit-test}HelloXQueryWorld-8
14:07:56,633 WARN  [BpelRuntimeContextImpl] Couldn't extract property '{OProperty {http://ode/bpel/unit-test.wsdl}content}'
and variable {Variable __PROCESS_SCOPE:HelloXQueryWorld.myVar:OMessageVarType#7({http://ode/bpel/unit-test.wsdl}HelloXQueryMessage)}
at HelloXQueryWorld:43 in property pre-extraction: org.apache.ode.bpel.common.FaultException:
No results for expression: 'content' against '<?xml version="1.0" encoding="UTF-8"?>
<TestPart xmlns:SOAP-ENV="http://schemas.xmlsoap.org/soap/envelope/" xmlns:rpcwrappernsprefix="http://ode/bpel/unit-test.wsdl"
xmlns:tes="http://www.bpelunit.org/schema/testSuite">HelloXQuery World</TestPart>'
Error on line 11 
  FOAR0001: Integer division by zero
14:07:56,688 WARN  [SCOPE] ({OScope 'scope-implicit-scope-line-197' id=100},TerminationChannel#61,ParentScopeChannel#63):
has a fault handler for {http://docs.oasis-open.org/wsbpel/2.0/process/executable}subLanguageExecutionFault:
{OCatch faultName={http://docs.oasis-open.org/wsbpel/2.0/process/executable}subLanguageExecutionFault,
faultVariable=null} ,  FaultData: [faultName={http://docs.oasis-open.org/wsbpel/2.0/process/executable}subLanguageExecutionFault,
faulType=null (An exception occured while evaluating "{OXPath10Expression null}": Error while
executing an XQuery expression: net.sf.saxon.trans.XPathException: Integer division by zero)]
@204
[INFO] Tests run: 1, Failures: 1, Errors: 0, Time elapsed: 0.615 sec
14:07:58,323 INFO  [BpelServerImpl] Unregistered process {http://ode/bpel/unit-test}HelloXQueryWorld-8.
14:07:58,456 INFO  [BpelServerImpl] Deleted only the process {http://ode/bpel/unit-test}HelloXQueryWorld-8.
14:07:58,475 INFO  [CronScheduler] Cancelling PROCESS CRON jobs for: {http://ode/bpel/unit-test}HelloXQueryWorld-8
14:07:59,086 ERROR [DeploymentPoller] Error while deleting file TestXQueryExpression-8.deployed
, please check if file is locked or if it really exist
14:07:59,199 WARN  [BpelObjectFactory$BOMSAXErrorHandler] null:file:///zonestorage/hudson_solaris/home/hudson/hudson-slave/workspace/ODE-trunk-maven2-jdk5/trunk/bpel-itest/target/tmp/webapp/WEB-INF/processes/TestCorrelationJoinOnMessage-9/CorrelationJoinOnMessageTest.bpel:39:18:cvc-complex-type.2.4.a:
Invalid content was found starting with element 'bpel:variables'. One of '{"http://docs.oasis-open.org/wsbpel/2.0/process/executable":faultHandlers,
"http://docs.oasis-open.org/wsbpel/2.0/process/executable":eventHandlers, "http://docs.oasis-open.org/wsbpel/2.0/process/executable":assign,
"http://docs.oasis-open.org/wsbpel/2.0/process/executable":compensate, "http://docs.oasis-open.org/wsbpel/2.0/process/executable":compensateScope,
"http://docs.oasis-open.org/wsbpel/2.0/process/executable":empty, "http://docs.oasis-open.org/wsbpel/2.0/process/executable":exit,
"http://docs.oasis-open.org/wsbpel/2.0/process/executable":extensionActivity, "http://docs.oasis-open.org/wsbpel/2.0/process/executable":flow,
"http://docs.oasis-open.org/wsbpel/2.0/process/executable":forEach, "http://docs.oasis-open.org/wsbpel/2.0/process/executable":if,
"http://docs.oasis-open.org/wsbpel/2.0/process/executable":invoke, "http://docs.oasis-open.org/wsbpel/2.0/process/executable":pick,
"http://docs.oasis-open.org/wsbpel/2.0/process/executable":receive, "http://docs.oasis-open.org/wsbpel/2.0/process/executable":repeatUntil,
"http://docs.oasis-open.org/wsbpel/2.0/process/executable":reply, "http://docs.oasis-open.org/wsbpel/2.0/process/executable":rethrow,
"http://docs.oasis-open.org/wsbpel/2.0/process/executable":scope, "http://docs.oasis-open.org/wsbpel/2.0/process/executable":sequence,
"http://docs.oasis-open.org/wsbpel/2.0/process/executable":throw, "http://docs.oasis-open.org/wsbpel/2.0/process/executable":validate,
"http://docs.oasis-open.org/wsbpel/2.0/process/executable":wait, "http://docs.oasis-open.org/wsbpel/2.0/process/executable":while}'
is expected.
14:07:59,203 WARN  [BpelObjectFactory] Validation errors during parsing, continuing due to
-Dorg.apache.ode.compiler.failOnValidationErrors=false switch
14:07:59,264 INFO  [CronScheduler] Cancelling PROCESS CRON jobs for: {http://ode.apache.org/test4/process}Process-9
14:07:59,264 INFO  [CronScheduler] Scheduling PROCESS CRON jobs for: {http://ode.apache.org/test4/process}Process-9
14:07:59,329 INFO  [BpelProcess] Created new process DAO for {http://ode.apache.org/test4/process}Process-9
(guid=2xct5qg0tn0i169rvn8fqfm3xmhssv4t)
14:07:59,329 INFO  [BpelProcess] Created new process DAO for {http://ode.apache.org/test4/process}Process-9
(guid=2xct5qg0tn0i169rvn8fqfm3xmhssv4t).
14:07:59,336 INFO  [BpelServerImpl] Registered process {http://ode.apache.org/test4/process}Process-9.
14:07:59,336 INFO  [CronScheduler] Cancelling PROCESS CRON jobs for: {http://ode.apache.org/test4/process}Process-9
14:07:59,336 INFO  [CronScheduler] Scheduling PROCESS CRON jobs for: {http://ode.apache.org/test4/process}Process-9
14:07:59,336 ERROR [DeploymentPoller] Error while creating  file TestCorrelationJoinOnMessage-9.deployed
,deployment could be inconsistent
14:07:59,336 INFO  [DeploymentWebService] Deployment of artifact TestCorrelationJoinOnMessage-9
successful.
[INFO] Running BPELUnit: TestCorrelationJoinOnMessage.bpts
[INFO] Tests run: 2, Failures: 0, Errors: 1, Time elapsed: 0.013 sec
14:08:00,462 INFO  [CronScheduler] Cancelling PROCESS CRON jobs for: {http://ode.apache.org/test4/process}Process-9
14:08:00,462 INFO  [CronScheduler] Scheduling PROCESS CRON jobs for: {http://ode.apache.org/test4/process}Process-9
14:08:00,482 INFO  [BpelServerImpl] Unregistered process {http://ode.apache.org/test4/process}Process-9.
14:08:00,494 WARN  [Runtime] Detected possible orphaned reference to deleted object "org.apache.ode.dao.jpa.CorrelatorDAOImpl-112"
in "org.apache.ode.dao.jpa.MessageExchangeDAOImpl._correlator".
14:08:00,501 INFO  [BpelServerImpl] Deleted only the process {http://ode.apache.org/test4/process}Process-9.
14:08:00,527 INFO  [CronScheduler] Cancelling PROCESS CRON jobs for: {http://ode.apache.org/test4/process}Process-9
14:08:00,530 ERROR [DeploymentPoller] Error while deleting file TestCorrelationJoinOnMessage-9.deployed
, please check if file is locked or if it really exist
14:08:01,508 INFO  [CronScheduler] Cancelling PROCESS CRON jobs for: {http://ode/bpel/unit-test}HelloXslWorld-10
14:08:01,508 INFO  [CronScheduler] Scheduling PROCESS CRON jobs for: {http://ode/bpel/unit-test}HelloXslWorld-10
14:08:01,542 INFO  [BpelProcess] Created new process DAO for {http://ode/bpel/unit-test}HelloXslWorld-10
(guid=q2hdlmhonqfxk7mku4t3n0o1idw1oa5d)
14:08:01,542 INFO  [BpelProcess] Created new process DAO for {http://ode/bpel/unit-test}HelloXslWorld-10
(guid=q2hdlmhonqfxk7mku4t3n0o1idw1oa5d).
14:08:01,545 INFO  [BpelServerImpl] Registered process {http://ode/bpel/unit-test}HelloXslWorld-10.
14:08:01,545 INFO  [CronScheduler] Cancelling PROCESS CRON jobs for: {http://ode/bpel/unit-test}HelloXslWorld-10
14:08:01,545 INFO  [CronScheduler] Scheduling PROCESS CRON jobs for: {http://ode/bpel/unit-test}HelloXslWorld-10
14:08:01,545 ERROR [DeploymentPoller] Error while creating  file TestXslTransform-10.deployed
,deployment could be inconsistent
14:08:01,545 INFO  [DeploymentWebService] Deployment of artifact TestXslTransform-10 successful.
[INFO] Running BPELUnit: TestXslTransform.bpts
[INFO] Tests run: 1, Failures: 1, Errors: 0, Time elapsed: 0.103 sec
14:08:02,912 INFO  [BpelServerImpl] Unregistered process {http://ode/bpel/unit-test}HelloXslWorld-10.
14:08:02,948 INFO  [BpelServerImpl] Deleted only the process {http://ode/bpel/unit-test}HelloXslWorld-10.
14:08:02,950 INFO  [CronScheduler] Cancelling PROCESS CRON jobs for: {http://ode/bpel/unit-test}HelloXslWorld-10
14:08:02,958 ERROR [DeploymentPoller] Error while deleting file TestXslTransform-10.deployed
, please check if file is locked or if it really exist
14:08:03,146 INFO  [CronScheduler] Cancelling PROCESS CRON jobs for: {http://ode/bpel/unit-test}TestIf-11
14:08:03,146 INFO  [CronScheduler] Scheduling PROCESS CRON jobs for: {http://ode/bpel/unit-test}TestIf-11
14:08:03,181 INFO  [BpelProcess] Created new process DAO for {http://ode/bpel/unit-test}TestIf-11
(guid=1c484fsfbh6iu0sjcogtqliv93jgr294)
14:08:03,181 INFO  [BpelProcess] Created new process DAO for {http://ode/bpel/unit-test}TestIf-11
(guid=1c484fsfbh6iu0sjcogtqliv93jgr294).
14:08:03,200 INFO  [BpelServerImpl] Registered process {http://ode/bpel/unit-test}TestIf-11.
14:08:03,200 INFO  [CronScheduler] Cancelling PROCESS CRON jobs for: {http://ode/bpel/unit-test}TestIf-11
14:08:03,200 INFO  [CronScheduler] Scheduling PROCESS CRON jobs for: {http://ode/bpel/unit-test}TestIf-11
14:08:03,201 ERROR [DeploymentPoller] Error while creating  file TestIf-11.deployed ,deployment
could be inconsistent
14:08:03,201 INFO  [DeploymentWebService] Deployment of artifact TestIf-11 successful.
[INFO] Running BPELUnit: TestIf.bpts
[INFO] Tests run: 1, Failures: 0, Errors: 0, Time elapsed: 0.156 sec
14:08:04,459 INFO  [CronScheduler] Cancelling PROCESS CRON jobs for: {http://ode/bpel/unit-test}TestIf-11
14:08:04,459 INFO  [CronScheduler] Scheduling PROCESS CRON jobs for: {http://ode/bpel/unit-test}TestIf-11
14:08:04,479 INFO  [BpelServerImpl] Unregistered process {http://ode/bpel/unit-test}TestIf-11.
14:08:04,516 INFO  [BpelServerImpl] Deleted only the process {http://ode/bpel/unit-test}TestIf-11.
14:08:04,518 INFO  [CronScheduler] Cancelling PROCESS CRON jobs for: {http://ode/bpel/unit-test}TestIf-11
14:08:04,521 ERROR [DeploymentPoller] Error while deleting file TestIf-11.deployed , please
check if file is locked or if it really exist
[INFO] ------------------------------------------------------------------------
[INFO] Building ODE :: Distribution
[INFO]    task-segment: [clean, test, integration-test]
[INFO] ------------------------------------------------------------------------
[INFO] [clean:clean {execution: default-clean}]
[INFO] Deleting file set: <http://hudson.zones.apache.org/hudson/job/ODE-trunk-maven2-jdk5/ws/trunk/distro/target>
(included: [**], excluded: [])
[INFO] [remote-resources:process {execution: default}]
[INFO] [remote-resources:process {execution: default}]
[INFO] [site:attach-descriptor {execution: default-attach-descriptor}]
[INFO] [assembly:single {execution: war-distro}]
[INFO] Reading assembly descriptor: src/main/assembly/war.xml
[WARNING] Cannot include project artifact: org.apache.ode:ode-distro:pom:1.3.5-SNAPSHOT; it
doesn't have an associated file or directory.
[WARNING] Cannot include project artifact: org.apache.ode:ode-distro:pom:1.3.5-SNAPSHOT; it
doesn't have an associated file or directory.
[WARNING] Cannot include project artifact: org.apache.ode:ode-distro:pom:1.3.5-SNAPSHOT; it
doesn't have an associated file or directory.
[INFO] Building zip: <http://hudson.zones.apache.org/hudson/job/ODE-trunk-maven2-jdk5/ws/trunk/distro/target/apache-ode-war-1.3.5-SNAPSHOT.zip>
[INFO] [assembly:single {execution: jbi-distro}]
[INFO] Reading assembly descriptor: src/main/assembly/jbi.xml
[WARNING] Cannot include project artifact: org.apache.ode:ode-distro:pom:1.3.5-SNAPSHOT; it
doesn't have an associated file or directory.
[WARNING] Cannot include project artifact: org.apache.ode:ode-distro:pom:1.3.5-SNAPSHOT; it
doesn't have an associated file or directory.
[WARNING] Cannot include project artifact: org.apache.ode:ode-distro:pom:1.3.5-SNAPSHOT; it
doesn't have an associated file or directory.
[INFO] Building zip: <http://hudson.zones.apache.org/hudson/job/ODE-trunk-maven2-jdk5/ws/trunk/distro/target/apache-ode-jbi-1.3.5-SNAPSHOT.zip>
[HUDSON] Archiving <http://hudson.zones.apache.org/hudson/job/ODE-trunk-maven2-jdk5/ws/trunk/distro/pom.xml>
to /export/home/hudson/hudson/jobs/ODE-trunk-maven2-jdk5/modules/org.apache.ode$ode-distro/builds/2010-08-05_12-07-43/archive/org.apache.ode/ode-distro/1.3.5-SNAPSHOT/pom.xml
[HUDSON] Archiving <http://hudson.zones.apache.org/hudson/job/ODE-trunk-maven2-jdk5/ws/trunk/distro/target/apache-ode-war-1.3.5-SNAPSHOT.zip>
to /export/home/hudson/hudson/jobs/ODE-trunk-maven2-jdk5/modules/org.apache.ode$ode-distro/builds/2010-08-05_12-07-43/archive/org.apache.ode/ode-distro/1.3.5-SNAPSHOT/apache-ode-war-1.3.5-SNAPSHOT.zip
Build timed out. Aborting
Sending e-mails to: dev@ode.apache.org
Sending e-mails to: dev@ode.apache.org
Sending e-mails to: dev@ode.apache.org
channel stopped
15:07:50,055 INFO  [DeploymentPoller] Poller stopped.
15:07:50,055 INFO  [BpelServerImpl] BPEL Server Stopped.
[INFO] ------------------------------------------------------------------------
[ERROR] FATAL ERROR
[INFO] ------------------------------------------------------------------------
[INFO] null
channel is already closed
[INFO] ------------------------------------------------------------------------
[INFO] Trace
java.lang.reflect.UndeclaredThrowableException
	at $Proxy2.isArchivingDisabled(Unknown Source)
	at hudson.maven.MavenBuildProxy$Filter.isArchivingDisabled(MavenBuildProxy.java:210)
	at hudson.maven.reporters.MavenArtifact.archive(MavenArtifact.java:192)
	at hudson.maven.reporters.MavenArtifactArchiver.postBuild(MavenArtifactArchiver.java:109)
	at hudson.maven.MavenModuleSetBuild$Builder.postModule(MavenModuleSetBuild.java:729)
	at hudson.maven.MavenBuilder$Adapter.fireLeaveModule(MavenBuilder.java:317)
	at hudson.maven.MavenBuilder$Adapter.postBuild(MavenBuilder.java:275)
	at org.apache.maven.lifecycle.LifecycleExecutorInterceptor.execute(LifecycleExecutorInterceptor.java:68)
	at org.apache.maven.DefaultMaven.doExecute(DefaultMaven.java:328)
	at org.apache.maven.DefaultMaven.execute(DefaultMaven.java:138)
	at org.apache.maven.cli.MavenCli.main(MavenCli.java:362)
	at sun.reflect.NativeMethodAccessorImpl.invoke0(Native Method)
	at sun.reflect.NativeMethodAccessorImpl.invoke(NativeMethodAccessorImpl.java:39)
	at sun.reflect.DelegatingMethodAccessorImpl.invoke(DelegatingMethodAccessorImpl.java:25)
	at java.lang.reflect.Method.invoke(Method.java:585)
	at org.codehaus.classworlds.Launcher.launchEnhanced(Launcher.java:315)
	at org.codehaus.classworlds.Launcher.launch(Launcher.java:255)
	at hudson.maven.agent.Main.launch(Main.java:165)
	at hudson.maven.MavenBuilder.call(MavenBuilder.java:165)
	at hudson.maven.MavenModuleSetBuild$Builder.call(MavenModuleSetBuild.java:696)
	at hudson.maven.MavenModuleSetBuild$Builder.call(MavenModuleSetBuild.java:640)
	at hudson.remoting.UserRequest.perform(UserRequest.java:114)
	at hudson.remoting.UserRequest.perform(UserRequest.java:48)
	at hudson.remoting.Request$2.run(Request.java:270)
	at java.util.concurrent.Executors$RunnableAdapter.call(Executors.java:417)
	at java.util.concurrent.FutureTask$Sync.innerRun(FutureTask.java:269)
	at java.util.concurrent.FutureTask.run(FutureTask.java:123)
	at java.util.concurrent.ThreadPoolExecutor$Worker.runTask(ThreadPoolExecutor.java:650)
	at java.util.concurrent.ThreadPoolExecutor$Worker.run(ThreadPoolExecutor.java:675)
	at java.lang.Thread.run(Thread.java:595)
Caused by: hudson.remoting.ChannelClosedException: channel is already closed
	at hudson.remoting.Channel.send(Channel.java:412)
	at hudson.remoting.Request.call(Request.java:105)
	at hudson.remoting.Channel.call(Channel.java:555)
	at hudson.remoting.RemoteInvocationHandler.invoke(RemoteInvocationHandler.java:158)
	... 30 more
[INFO] ------------------------------------------------------------------------
[INFO] Total time: 178 minutes 23 seconds
[INFO] Finished at: Thu Aug 05 15:07:50 GMT+00:00 2010
[INFO] Final Memory: 108M/430M
[INFO] ------------------------------------------------------------------------
15:07:51,680 INFO  [ODEServer] Shutdown completed. 


Mime
View raw message