ode-dev mailing list archives

Site index · List index
Message view « Date » · « Thread »
Top « Date » · « Thread »
From Apache Hudson Server <hud...@hudson.zones.apache.org>
Subject Build failed in Hudson: ODE-trunk-maven2-jdk5 » ODE :: BPELUnit Integration Tests #110
Date Mon, 02 Aug 2010 15:17:33 GMT
See <http://hudson.zones.apache.org/hudson/job/ODE-trunk-maven2-jdk5/org.apache.ode$ode-bpelunit-itests/110/>

------------------------------------------
[INFO] ------------------------------------------------------------------------
[INFO] Building ODE :: BPELUnit Integration Tests
[INFO]    task-segment: [clean, test, integration-test]
[INFO] ------------------------------------------------------------------------
[INFO] snapshot net.bpelunit:bpelunit:1.4.1-SNAPSHOT: checking for updates from oss.sonatype.snapshots
[INFO] snapshot net.bpelunit:bpelunit:1.4.1-SNAPSHOT: checking for updates from central
[INFO] snapshot net.bpelunit:bpelunit:1.4.1-SNAPSHOT: checking for updates from apache.snapshots
[INFO] [clean:clean {execution: default-clean}]
[INFO] Deleting file set: <http://hudson.zones.apache.org/hudson/job/ODE-trunk-maven2-jdk5/org.apache.ode$ode-bpelunit-itests/ws/target>
(included: [**], excluded: [])
[INFO] snapshot net.bpelunit:maven-bpelunit-plugin:1.4.1-SNAPSHOT: checking for updates from
oss.sonatype.snapshots
[INFO] [remote-resources:process {execution: default}]
[INFO] [remote-resources:process {execution: default}]
[INFO] [site:attach-descriptor {execution: default-attach-descriptor}]
[INFO] Preparing jetty:run-war
[WARNING] Removing: run-war from forked lifecycle, to prevent recursive invocation.
[HUDSON] Archiving <http://hudson.zones.apache.org/hudson/job/ODE-trunk-maven2-jdk5/org.apache.ode$ode-bpelunit-itests/ws/pom.xml>
to /export/home/hudson/hudson/jobs/ODE-trunk-maven2-jdk5/modules/org.apache.ode$ode-bpelunit-itests/builds/2010-08-02_14-40-12/archive/org.apache.ode/ode-bpelunit-itests/1.3.5-SNAPSHOT/pom.xml
[INFO] [remote-resources:process {execution: default}]
[INFO] [site:attach-descriptor {execution: default-attach-descriptor}]
[INFO] [jetty:run-war {execution: start-jetty}]
[INFO] Configuring Jetty for project: ODE :: BPELUnit Integration Tests
[INFO] Context path = /ode
[INFO] Tmp directory = <http://hudson.zones.apache.org/hudson/job/ODE-trunk-maven2-jdk5/org.apache.ode$ode-bpelunit-itests/ws/target/tmp>
[INFO] Web defaults = org/eclipse/jetty/webapp/webdefault.xml
[INFO] Web overrides =  none
[INFO] Starting jetty 7.1.5.v20100705 ...
2010-08-02 15:18:00.895:INFO::jetty-7.1.5.v20100705
2010-08-02 15:18:00.948:INFO::Extract jar:file:/home/hudson/hudson-slave/workspace/ODE-trunk-maven2-jdk5/trunk/axis2-war/target/ode-axis2-war-1.3.5-SNAPSHOT.war!/
to <http://hudson.zones.apache.org/hudson/job/ODE-trunk-maven2-jdk5/org.apache.ode$ode-bpelunit-itests/ws/target/tmp/webapp>
2010-08-02 15:18:04.539:INFO::No Transaction manager found - if your webapp requires one,
please configure one.
15:18:05,767 INFO  [ODEServer] Using DAO Connection Factory class org.apache.ode.dao.jpa.BPELDAOConnectionFactoryImpl.
15:18:09,769 INFO  [BpelServerImpl] BPEL Server Started.
15:18:09,773 INFO  [SystemSchedulesConfig] SYSTEM CRON configuration: <http://hudson.zones.apache.org/hudson/job/ODE-trunk-maven2-jdk5/org.apache.ode$ode-bpelunit-itests/ws/target/tmp/webapp/WEB-INF/conf/schedules.xml>
15:18:11,323 INFO  [DeploymentPoller] Poller started.
15:18:11,323 INFO  [ODEServer] Process deployment polling started on path <http://hudson.zones.apache.org/hudson/job/ODE-trunk-maven2-jdk5/org.apache.ode$ode-bpelunit-itests/ws/target/tmp/webapp/WEB-INF/processes.>
15:18:11,323 INFO  [ODEServer] ODE Service Engine has been started.
2010-08-02 15:18:11.334:WARN::FAILED SelectChannelConnector@0.0.0.0:8080: java.net.BindException:
Address already in use
2010-08-02 15:18:11.334:WARN::FAILED org.mortbay.jetty.plugin.JettyServer@6c72e9: java.net.BindException:
Address already in use
[INFO] ------------------------------------------------------------------------
[ERROR] BUILD ERROR
[INFO] ------------------------------------------------------------------------
[INFO] Failure

Embedded error: Address already in use
[INFO] ------------------------------------------------------------------------
[INFO] For more information, run Maven with the -e switch
[INFO] ------------------------------------------------------------------------
[INFO] Total time: 35 minutes 28 seconds
[INFO] Finished at: Mon Aug 02 15:18:12 UTC 2010
[INFO] Final Memory: 117M/297M
[INFO] ------------------------------------------------------------------------
Waiting for Hudson to finish collecting data


Mime
View raw message