ode-dev mailing list archives

Site index · List index
Message view « Date » · « Thread »
Top « Date » · « Thread »
From Apache Jenkins Server <jenk...@builds.apache.org>
Subject Build failed in Jenkins: ODE-1.x #146
Date Fri, 01 Feb 2013 12:50:16 GMT
See <https://builds.apache.org/job/ODE-1.x/146/>

------------------------------------------
[...truncated 3279 lines...]
    [junit]    </soapenv:Body></soapenv:Envelope>
    [junit] <?xml version="1.0" encoding="UTF-8"?>
    [junit] <message><parameters><getObjectId foo="bar" xmlns="http://documentum.com/ws/2005/services"
xmlns:soapenv="http://schemas.xmlsoap.org/soap/envelope/">
    [junit]           <someFooBar xmlns="http://documentum.com/ws/2005/services"/>
    [junit]           <barbaz xmlns=""/>
    [junit]       </getObjectId></parameters></message>
    [junit] <?xml version="1.0" encoding="UTF-8"?>
    [junit] <message><TestPart xmlns="" xmlns:SOAP-ENV="http://schemas.xmlsoap.org/soap/envelope/"
xmlns:foo="urn:/bar" xmlns:ns1="http://ode/bpel/unit-test.wsdl">ns1:Hello</TestPart></message>
    [junit] ------------- ---------------- ---------------
    [junit] 
    [junit] Testcase: testBadPortName took 0.02 sec
    [junit] Testcase: testBadServiceName took 0 sec
    [junit] Testcase: testCreateSOAPRequest took 0.073 sec
    [junit] Testcase: testCreateSOAPRequestFail took 0.002 sec
    [junit] Testcase: testGetSoapAction took 0 sec
    [junit] Testcase: testParseRequest took 0.048 sec
    [junit] Testcase: testHelloWorldRequest took 0.074 sec
    [junit] Testsuite: org.apache.ode.axis2.httpbinding.HttpBindingValidatorTest
    [junit] Tests run: 1, Failures: 0, Errors: 0, Time elapsed: 0.047 sec
    [junit] 
    [junit] Testcase: testAll took 0.044 sec
    [junit] Testsuite: org.apache.ode.axis2.httpbinding.HttpHelperTest
    [junit] Tests run: 2, Failures: 0, Errors: 0, Time elapsed: 0.006 sec
    [junit] 
    [junit] Testcase: testIsXml took 0.002 sec
    [junit] Testcase: testIsText took 0 sec
    [junit] Testsuite: org.apache.ode.axis2.httpbinding.HttpMethodConverterTest
    [junit] Tests run: 3, Failures: 0, Errors: 0, Time elapsed: 0.062 sec
    [junit] 
    [junit] Testcase: testGetTag took 0.04 sec
    [junit] Testcase: testGetTagWithNoPart took 0.008 sec
    [junit] Testcase: testHello took 0.011 sec
    [junit] Testsuite: org.apache.ode.axis2.util.UrlEncodedTransformerTest
    [junit] Tests run: 2, Failures: 0, Errors: 0, Time elapsed: 0.004 sec
    [junit] 
    [junit] Testcase: testSimple took 0 sec
    [junit] Testcase: testComplexType took 0.001 sec
    [junit] Testsuite: org.apache.ode.axis2.util.UrlReplacementTransformerTest
    [junit] Tests run: 4, Failures: 0, Errors: 0, Time elapsed: 0.011 sec
    [junit] 
    [junit] Testcase: testComplexType took 0 sec
    [junit] Testcase: testWithParentheses took 0.002 sec
    [junit] Testcase: testWithBraces took 0.003 sec
    [junit] Testcase: testWithMixnMatch took 0.001 sec
Testing ode:axis2-war
Packaging ode-axis2-1.3.6-SNAPSHOT.jar
Compiling ode:axis2-war:test into <https://builds.apache.org/job/ODE-1.x/ws/axis2-war/target/test/classes>
Note: <https://builds.apache.org/job/ODE-1.x/ws/axis2-war/src/test/java/org/apache/ode/axis2/management/InstanceManagementTest.java>
uses unchecked or unsafe operations.
Note: Recompile with -Xlint:unchecked for details.
Testing ode:bpel-api
Testing ode:bpel-api-jca
Testing ode:bpel-compiler
Testing ode:bpel-connector
Testing ode:bpel-dao
Testing ode:bpel-epr
Testing ode:bpel-obj
Testing ode:bpel-ql
Testing ode:bpel-runtime
Testing ode:bpel-schemas
Testing ode:bpel-scripts
Testing ode:bpel-store
Testing ode:bpel-test
Packaging ode-bpel-scripts-1.3.6-SNAPSHOT.jar
Compiling ode:bpel-test:test into <https://builds.apache.org/job/ODE-1.x/ws/bpel-test/target/test/classes>
Running tests in ode:bpel-test
Trying to override old definition of datatype junit
    [junit] Testsuite: org.apache.ode.test.BasicActivities20Test
    [junit] Tests run: 9, Failures: 0, Errors: 0, Time elapsed: 33.709 sec
    [junit] 
    [junit] Testcase: testHelloWorld2 took 4.292 sec
    [junit] Testcase: testNegativeTargetNS1 took 0.108 sec
    [junit] Testcase: testTimer took 10.266 sec
    [junit] Testcase: testIf took 2.182 sec
    [junit] Testcase: testIfBoolean took 2.138 sec
    [junit] Testcase: testWaitFor took 5.142 sec
    [junit] Testcase: testWaitUntil took 5.14 sec
    [junit] Testcase: testWaitUntilPast took 2.082 sec
    [junit] Testcase: testOnAlarm took 2.164 sec
    [junit] Testsuite: org.apache.ode.test.CompensationHandling20Test
    [junit] Tests run: 1, Failures: 0, Errors: 0, Time elapsed: 4.181 sec
    [junit] 
    [junit] Testcase: testCompensationHandlers took 4.177 sec
    [junit] Testsuite: org.apache.ode.test.DataHandling20Test
    [junit] Tests run: 21, Failures: 0, Errors: 0, Time elapsed: 50.425 sec
    [junit] ------------- Standard Error -----------------
    [junit] Error on line 11 
    [junit]   FOAR0001: Integer division by zero
    [junit] Error on line 11 
    [junit]   FOAR0001: Integer division by zero
    [junit] ------------- ---------------- ---------------
    [junit] 
    [junit] Testcase: testComposeUrl took 4.105 sec
    [junit] Testcase: testCombineUrl took 2.092 sec
    [junit] Testcase: testExpandTemplate took 4.114 sec
    [junit] Testcase: testXPathNamespace1 took 2.094 sec
    [junit] Testcase: testXPathNamespace2 took 2.104 sec
    [junit] Testcase: testToQuery took 2.101 sec
    [junit] Testcase: testSubTreeAssign took 2.184 sec
    [junit] Testcase: testAssignActivity1 took 2.133 sec
    [junit] Testcase: testAssignActivity2 took 2.118 sec
    [junit] Testcase: testAssignComplex took 2.102 sec
    [junit] Testcase: testSimpleTypeParts took 2.078 sec
    [junit] Testcase: testSimpleVariableType took 2.078 sec
    [junit] Testcase: testXslTransform took 2.183 sec
    [junit] Testcase: testSplit took 2.074 sec
    [junit] Testcase: testCounter took 2.081 sec
    [junit] Testcase: testDate took 2.093 sec
    [junit] Testcase: testMsgDate took 2.077 sec
    [junit] Testcase: testDuration took 2.087 sec
    [junit] Testcase: testAssignMissingData took 4.143 sec
    [junit] Testcase: testXQueryExpression took 2.273 sec
    [junit] Testcase: testInsertMissingData took 2.096 sec
    [junit] Testsuite: org.apache.ode.test.ExternalVariableTest
    [junit] Tests run: 4, Failures: 0, Errors: 0, Time elapsed: 16.009 sec
    [junit] 
    [junit] Testcase: testHelloWorld2 took 7.127 sec
    [junit] Testcase: testExtVar2 took 3.163 sec
    [junit] Testcase: testExtVar3 took 2.85 sec
    [junit] Testcase: testExtVarKeyGen took 2.865 sec
    [junit] Testsuite: org.apache.ode.test.FaultHandling20Test
    [junit] Tests run: 4, Failures: 0, Errors: 0, Time elapsed: 18.422 sec
    [junit] 
    [junit] Testcase: testFaultHandlers took 6.103 sec
    [junit] Testcase: testFaultWithVariable took 6.131 sec
    [junit] Testcase: testCatchFaultInFaultHandler took 2.082 sec
    [junit] Testcase: testOnEventThrow took 4.103 sec
    [junit] Testsuite: org.apache.ode.test.MessageRouting20Test
    [junit] Tests run: 18, Failures: 1, Errors: 0, Time elapsed: 161.767 sec
    [junit] ------------- Standard Error -----------------
    [junit] Exception in thread "Thread-151" java.lang.AssertionError: Invocation#<https://builds.apache.org/job/ODE-1.x/ws/bpel-test/target/test/resources/bpel/2.0/TestIMA/test1.properties>#1:
Exception on future object.; got exception msg: Message exchange org.apache.ode.bpel.engine.MyRoleMessageExchangeImpl$ResponseFuture@c4920e
timed out(60000 ms) when waiting for a response!
    [junit] 	at org.junit.Assert.fail(Assert.java:91)
    [junit] 	at org.apache.ode.test.BPELTestAbstract.failure(BPELTestAbstract.java:389)
    [junit] 	at org.apache.ode.test.BPELTestAbstract.access$000(BPELTestAbstract.java:64)
    [junit] 	at org.apache.ode.test.BPELTestAbstract$InvokerThread.run2(BPELTestAbstract.java:631)
    [junit] 	at org.apache.ode.test.BPELTestAbstract$InvokerThread.run(BPELTestAbstract.java:564)
    [junit] Exception in thread "Thread-154" java.lang.AssertionError: Invocation#<https://builds.apache.org/job/ODE-1.x/ws/bpel-test/target/test/resources/bpel/2.0/TestIMA/test3.properties>#1:
Exception on future object.; got exception msg: Message exchange org.apache.ode.bpel.engine.MyRoleMessageExchangeImpl$ResponseFuture@13578d9
timed out(60000 ms) when waiting for a response!
    [junit] 	at org.junit.Assert.fail(Assert.java:91)
    [junit] 	at org.apache.ode.test.BPELTestAbstract.failure(BPELTestAbstract.java:389)
    [junit] 	at org.apache.ode.test.BPELTestAbstract.access$000(BPELTestAbstract.java:64)
    [junit] 	at org.apache.ode.test.BPELTestAbstract$InvokerThread.run2(BPELTestAbstract.java:631)
    [junit] 	at org.apache.ode.test.BPELTestAbstract$InvokerThread.run(BPELTestAbstract.java:564)
    [junit] Exception in thread "Thread-156" java.lang.AssertionError: Invocation#<https://builds.apache.org/job/ODE-1.x/ws/bpel-test/target/test/resources/bpel/2.0/TestIMA/test4.properties>#1:
Exception on future object.; got exception msg: Message exchange org.apache.ode.bpel.engine.MyRoleMessageExchangeImpl$ResponseFuture@1debd32
timed out(60000 ms) when waiting for a response!
    [junit] 	at org.junit.Assert.fail(Assert.java:91)
    [junit] 	at org.apache.ode.test.BPELTestAbstract.failure(BPELTestAbstract.java:389)
    [junit] 	at org.apache.ode.test.BPELTestAbstract.access$000(BPELTestAbstract.java:64)
    [junit] 	at org.apache.ode.test.BPELTestAbstract$InvokerThread.run2(BPELTestAbstract.java:631)
    [junit] 	at org.apache.ode.test.BPELTestAbstract$InvokerThread.run(BPELTestAbstract.java:564)
    [junit] Exception in thread "Thread-157" java.lang.AssertionError: Invocation#<https://builds.apache.org/job/ODE-1.x/ws/bpel-test/target/test/resources/bpel/2.0/TestIMA/test4.properties>#2:
Exception on future object.; got exception msg: Message exchange org.apache.ode.bpel.engine.MyRoleMessageExchangeImpl$ResponseFuture@573211
timed out(60000 ms) when waiting for a response!
    [junit] 	at org.junit.Assert.fail(Assert.java:91)
    [junit] 	at org.apache.ode.test.BPELTestAbstract.failure(BPELTestAbstract.java:389)
    [junit] 	at org.apache.ode.test.BPELTestAbstract.access$000(BPELTestAbstract.java:64)
    [junit] 	at org.apache.ode.test.BPELTestAbstract$InvokerThread.run2(BPELTestAbstract.java:631)
    [junit] 	at org.apache.ode.test.BPELTestAbstract$InvokerThread.run(BPELTestAbstract.java:564)
    [junit] Failure report:
    [junit] Invocation#<https://builds.apache.org/job/ODE-1.x/ws/bpel-test/target/test/resources/bpel/2.0/TestIMA/test1.properties>#1:
Exception on future object.; got exception msg: Message exchange org.apache.ode.bpel.engine.MyRoleMessageExchangeImpl$ResponseFuture@c4920e
timed out(60000 ms) when waiting for a response!
    [junit] Invocation#<https://builds.apache.org/job/ODE-1.x/ws/bpel-test/target/test/resources/bpel/2.0/TestIMA/test3.properties>#1:
Exception on future object.; got exception msg: Message exchange org.apache.ode.bpel.engine.MyRoleMessageExchangeImpl$ResponseFuture@13578d9
timed out(60000 ms) when waiting for a response!
    [junit] Invocation#<https://builds.apache.org/job/ODE-1.x/ws/bpel-test/target/test/resources/bpel/2.0/TestIMA/test4.properties>#1:
Exception on future object.; got exception msg: Message exchange org.apache.ode.bpel.engine.MyRoleMessageExchangeImpl$ResponseFuture@1debd32
timed out(60000 ms) when waiting for a response!
    [junit] Invocation#<https://builds.apache.org/job/ODE-1.x/ws/bpel-test/target/test/resources/bpel/2.0/TestIMA/test4.properties>#2:
Exception on future object.; got exception msg: Message exchange org.apache.ode.bpel.engine.MyRoleMessageExchangeImpl$ResponseFuture@573211
timed out(60000 ms) when waiting for a response!
    [junit] 
    [junit] ------------- ---------------- ---------------
    [junit] 
    [junit] Testcase: testCorrelation took 4.088 sec
    [junit] Testcase: testCorrelation1 took 6.084 sec
    [junit] Testcase: testCorrelationJoin took 4.09 sec
    [junit] Testcase: testCorrelationJoinReceive took 4.088 sec
    [junit] Testcase: testCorrelationJoinInvoke took 4.087 sec
    [junit] Testcase: testCorrelationJoinOnMessage took 4.098 sec
    [junit] Testcase: testCorrelationJoinEvent took 4.096 sec
    [junit] Testcase: testCorrelationJoinReply took 4.089 sec
    [junit] Testcase: testCorrelationMulti took 4.072 sec
    [junit] Testcase: testCorrelationMultiNegative took 6.089 sec
    [junit] Testcase: testCorrelationMultiJoin took 6.076 sec
    [junit] Testcase: testCorrelationMultiComplex took 8.105 sec
    [junit] Testcase: testDynamicPick took 6.091 sec
    [junit] Testcase: testInstPick took 4.099 sec
    [junit] Testcase: testStaticOnMessage took 10.103 sec
    [junit] Testcase: testStaticPick took 8.089 sec
    [junit] Testcase: testConcurrentSyncMex took 2.175 sec
    [junit] Testcase: testIMA took 72.134 sec
    [junit] 	FAILED
    [junit] Failure report:
    [junit] Invocation#<https://builds.apache.org/job/ODE-1.x/ws/bpel-test/target/test/resources/bpel/2.0/TestIMA/test1.properties>#1:
Exception on future object.; got exception msg: Message exchange org.apache.ode.bpel.engine.MyRoleMessageExchangeImpl$ResponseFuture@c4920e
timed out(60000 ms) when waiting for a response!
    [junit] Invocation#<https://builds.apache.org/job/ODE-1.x/ws/bpel-test/target/test/resources/bpel/2.0/TestIMA/test3.properties>#1:
Exception on future object.; got exception msg: Message exchange org.apache.ode.bpel.engine.MyRoleMessageExchangeImpl$ResponseFuture@13578d9
timed out(60000 ms) when waiting for a response!
    [junit] Invocation#<https://builds.apache.org/job/ODE-1.x/ws/bpel-test/target/test/resources/bpel/2.0/TestIMA/test4.properties>#1:
Exception on future object.; got exception msg: Message exchange org.apache.ode.bpel.engine.MyRoleMessageExchangeImpl$ResponseFuture@1debd32
timed out(60000 ms) when waiting for a response!
    [junit] Invocation#<https://builds.apache.org/job/ODE-1.x/ws/bpel-test/target/test/resources/bpel/2.0/TestIMA/test4.properties>#2:
Exception on future object.; got exception msg: Message exchange org.apache.ode.bpel.engine.MyRoleMessageExchangeImpl$ResponseFuture@573211
timed out(60000 ms) when waiting for a response!
    [junit] 
    [junit] junit.framework.AssertionFailedError: Failure report:
    [junit] Invocation#<https://builds.apache.org/job/ODE-1.x/ws/bpel-test/target/test/resources/bpel/2.0/TestIMA/test1.properties>#1:
Exception on future object.; got exception msg: Message exchange org.apache.ode.bpel.engine.MyRoleMessageExchangeImpl$ResponseFuture@c4920e
timed out(60000 ms) when waiting for a response!
    [junit] Invocation#<https://builds.apache.org/job/ODE-1.x/ws/bpel-test/target/test/resources/bpel/2.0/TestIMA/test3.properties>#1:
Exception on future object.; got exception msg: Message exchange org.apache.ode.bpel.engine.MyRoleMessageExchangeImpl$ResponseFuture@13578d9
timed out(60000 ms) when waiting for a response!
    [junit] Invocation#<https://builds.apache.org/job/ODE-1.x/ws/bpel-test/target/test/resources/bpel/2.0/TestIMA/test4.properties>#1:
Exception on future object.; got exception msg: Message exchange org.apache.ode.bpel.engine.MyRoleMessageExchangeImpl$ResponseFuture@1debd32
timed out(60000 ms) when waiting for a response!
    [junit] Invocation#<https://builds.apache.org/job/ODE-1.x/ws/bpel-test/target/test/resources/bpel/2.0/TestIMA/test4.properties>#2:
Exception on future object.; got exception msg: Message exchange org.apache.ode.bpel.engine.MyRoleMessageExchangeImpl$ResponseFuture@573211
timed out(60000 ms) when waiting for a response!
    [junit] 
    [junit] 	at org.apache.ode.test.BPELTestAbstract.checkFailure(BPELTestAbstract.java:288)
    [junit] 	at org.apache.ode.test.BPELTestAbstract.go(BPELTestAbstract.java:276)
    [junit] 	at org.apache.ode.test.BPELTestAbstract.go(BPELTestAbstract.java:205)
    [junit] 	at org.apache.ode.test.BPELTestAbstract.go(BPELTestAbstract.java:190)
    [junit] 	at org.apache.ode.test.MessageRouting20Test.testIMA(MessageRouting20Test.java:132)
    [junit] 
    [junit] TEST org.apache.ode.test.MessageRouting20Test FAILED
    [junit] Testsuite: org.apache.ode.test.PubSubTest
    [junit] Tests run: 0, Failures: 0, Errors: 0, Time elapsed: 0.002 sec
    [junit] 
    [junit] Testsuite: org.apache.ode.test.StructuredActivities20Test
    [junit] Tests run: 5, Failures: 0, Errors: 0, Time elapsed: 34.522 sec
    [junit] 
    [junit] Testcase: testFlowActivity1 took 12.13 sec
    [junit] Testcase: testFlowActivity2 took 12.136 sec
    [junit] Testcase: testFlowLinks took 2.084 sec
    [junit] Testcase: testForEach took 2.072 sec
    [junit] Testcase: testPickOneWay took 6.097 sec
    [junit] Testsuite: org.apache.ode.test.VersionedRedeployTest
    [junit] Tests run: 3, Failures: 0, Errors: 0, Time elapsed: 10.324 sec
    [junit] 
    [junit] Testcase: testRetireOld took 0.137 sec
    [junit] Testcase: testInstancePersistence took 6.118 sec
    [junit] Testcase: testVersionedUndeployDeploy took 4.064 sec
    [junit] Tests FAILED
The following tests failed:
org.apache.ode.test.MessageRouting20Test
Testing ode:dao-hibernate
Testing ode:dao-hibernate-db
Testing ode:dao-jpa
Testing ode:dao-jpa-ojpa-derby
Testing ode:jacob
Testing ode:jacob-ap
Testing ode:jbi
Testing ode:jbi-bundle
Testing ode:jbi-karaf
Testing ode:jbi-karaf-commands
Testing ode:jbi-karaf-examples
Testing ode:jbi-karaf-examples:helloworld2-osgi
Testing ode:jbi-karaf-examples:ping-pong-osgi
Testing ode:jbi-karaf-pmapi-httpbinding
Testing ode:jca-ra
Testing ode:jca-server
Testing ode:scheduler-simple
Testing ode:tools
Testing ode:utils
Testing apache-ode
Testing apache-ode:distro
Completed in 10m1.189s
[locks-and-latches] Releasing all the locks
[locks-and-latches] All the locks released
Recording fingerprints
Archiving artifacts
ERROR: No artifacts found that match the file pattern "**/distro/target/*.zip,trunk/axis2-war/target/*.war,trunk/jbi/target/*.zip,trunk/jbi-karaf/target/**".
Configuration error?
ERROR: '**/distro/target/*.zip' doesn't match anything: '**' exists but not '**/distro/target/*.zip'
Build step 'Archive the artifacts' changed build result to FAILURE
Recording test results

Mime
View raw message