ode-dev mailing list archives

Site index · List index
Message view « Date » · « Thread »
Top « Date » · « Thread »
From Apache Jenkins Server <jenk...@builds.apache.org>
Subject Build failed in Jenkins: ODE-1.x #440
Date Thu, 02 Jan 2014 01:09:04 GMT
See <https://builds.apache.org/job/ODE-1.x/440/>

------------------------------------------
[...truncated 4452 lines...]
	at org.testng.TestRunner.privateRun(TestRunner.java:767)
	at org.testng.TestRunner.run(TestRunner.java:617)
	at org.testng.SuiteRunner.runTest(SuiteRunner.java:334)
	at org.testng.SuiteRunner.runSequentially(SuiteRunner.java:329)
	at org.testng.SuiteRunner.privateRun(SuiteRunner.java:291)
	at org.testng.SuiteRunner.run(SuiteRunner.java:240)
	at org.testng.SuiteRunnerWorker.runSuite(SuiteRunnerWorker.java:52)
	at org.testng.SuiteRunnerWorker.run(SuiteRunnerWorker.java:86)
	at org.testng.TestNG.runSuitesSequentially(TestNG.java:1198)
	at org.testng.TestNG.runSuitesLocally(TestNG.java:1123)
	at org.testng.TestNG.run(TestNG.java:1031)
	at org.testng.TestNG.privateMain(TestNG.java:1338)
	at org.testng.TestNG.main(TestNG.java:1307)

FAILED: testCorrelationMulti
java.lang.AssertionError: expected [true] but found [false]
	at org.testng.Assert.fail(Assert.java:94)
	at org.testng.Assert.failNotEquals(Assert.java:494)
	at org.testng.Assert.assertTrue(Assert.java:42)
	at org.testng.Assert.assertTrue(Assert.java:52)
	at org.apache.ode.axis2.correlation.CorrelationMultiTest.testCorrelationMulti(CorrelationMultiTest.java:54)
	at sun.reflect.NativeMethodAccessorImpl.invoke0(Native Method)
	at sun.reflect.NativeMethodAccessorImpl.invoke(NativeMethodAccessorImpl.java:39)
	at sun.reflect.DelegatingMethodAccessorImpl.invoke(DelegatingMethodAccessorImpl.java:25)
	at java.lang.reflect.Method.invoke(Method.java:597)
	at org.testng.internal.MethodInvocationHelper.invokeMethod(MethodInvocationHelper.java:80)
	at org.testng.internal.Invoker.invokeMethod(Invoker.java:714)
	at org.testng.internal.Invoker.invokeTestMethod(Invoker.java:901)
	at org.testng.internal.Invoker.invokeTestMethods(Invoker.java:1231)
	at org.testng.internal.TestMethodWorker.invokeTestMethods(TestMethodWorker.java:127)
	at org.testng.internal.TestMethodWorker.run(TestMethodWorker.java:111)
	at org.testng.TestRunner.privateRun(TestRunner.java:767)
	at org.testng.TestRunner.run(TestRunner.java:617)
	at org.testng.SuiteRunner.runTest(SuiteRunner.java:334)
	at org.testng.SuiteRunner.runSequentially(SuiteRunner.java:329)
	at org.testng.SuiteRunner.privateRun(SuiteRunner.java:291)
	at org.testng.SuiteRunner.run(SuiteRunner.java:240)
	at org.testng.SuiteRunnerWorker.runSuite(SuiteRunnerWorker.java:52)
	at org.testng.SuiteRunnerWorker.run(SuiteRunnerWorker.java:86)
	at org.testng.TestNG.runSuitesSequentially(TestNG.java:1198)
	at org.testng.TestNG.runSuitesLocally(TestNG.java:1123)
	at org.testng.TestNG.run(TestNG.java:1031)
	at org.testng.TestNG.privateMain(TestNG.java:1338)
	at org.testng.TestNG.main(TestNG.java:1307)

FAILED: testCorrelationMulti
java.lang.AssertionError: expected [true] but found [false]
	at org.testng.Assert.fail(Assert.java:94)
	at org.testng.Assert.failNotEquals(Assert.java:494)
	at org.testng.Assert.assertTrue(Assert.java:42)
	at org.testng.Assert.assertTrue(Assert.java:52)
	at org.apache.ode.axis2.correlation.CorrelationMultiTest.testCorrelationMulti(CorrelationMultiTest.java:54)
	at sun.reflect.NativeMethodAccessorImpl.invoke0(Native Method)
	at sun.reflect.NativeMethodAccessorImpl.invoke(NativeMethodAccessorImpl.java:39)
	at sun.reflect.DelegatingMethodAccessorImpl.invoke(DelegatingMethodAccessorImpl.java:25)
	at java.lang.reflect.Method.invoke(Method.java:597)
	at org.testng.internal.MethodInvocationHelper.invokeMethod(MethodInvocationHelper.java:80)
	at org.testng.internal.Invoker.invokeMethod(Invoker.java:714)
	at org.testng.internal.Invoker.invokeTestMethod(Invoker.java:901)
	at org.testng.internal.Invoker.invokeTestMethods(Invoker.java:1231)
	at org.testng.internal.TestMethodWorker.invokeTestMethods(TestMethodWorker.java:127)
	at org.testng.internal.TestMethodWorker.run(TestMethodWorker.java:111)
	at org.testng.TestRunner.privateRun(TestRunner.java:767)
	at org.testng.TestRunner.run(TestRunner.java:617)
	at org.testng.SuiteRunner.runTest(SuiteRunner.java:334)
	at org.testng.SuiteRunner.runSequentially(SuiteRunner.java:329)
	at org.testng.SuiteRunner.privateRun(SuiteRunner.java:291)
	at org.testng.SuiteRunner.run(SuiteRunner.java:240)
	at org.testng.SuiteRunnerWorker.runSuite(SuiteRunnerWorker.java:52)
	at org.testng.SuiteRunnerWorker.run(SuiteRunnerWorker.java:86)
	at org.testng.TestNG.runSuitesSequentially(TestNG.java:1198)
	at org.testng.TestNG.runSuitesLocally(TestNG.java:1123)
	at org.testng.TestNG.run(TestNG.java:1031)
	at org.testng.TestNG.privateMain(TestNG.java:1338)
	at org.testng.TestNG.main(TestNG.java:1307)

FAILED: test
java.lang.AssertionError: 
	at org.testng.AssertJUnit.fail(AssertJUnit.java:59)
	at org.testng.AssertJUnit.assertTrue(AssertJUnit.java:24)
	at org.testng.AssertJUnit.assertTrue(AssertJUnit.java:33)
	at org.apache.ode.axis2.correlation.CorrelationUnicityTest.test(CorrelationUnicityTest.java:47)
	at sun.reflect.NativeMethodAccessorImpl.invoke0(Native Method)
	at sun.reflect.NativeMethodAccessorImpl.invoke(NativeMethodAccessorImpl.java:39)
	at sun.reflect.DelegatingMethodAccessorImpl.invoke(DelegatingMethodAccessorImpl.java:25)
	at java.lang.reflect.Method.invoke(Method.java:597)
	at org.testng.internal.MethodInvocationHelper.invokeMethod(MethodInvocationHelper.java:80)
	at org.testng.internal.Invoker.invokeMethod(Invoker.java:714)
	at org.testng.internal.Invoker.invokeTestMethod(Invoker.java:901)
	at org.testng.internal.Invoker.invokeTestMethods(Invoker.java:1231)
	at org.testng.internal.TestMethodWorker.invokeTestMethods(TestMethodWorker.java:127)
	at org.testng.internal.TestMethodWorker.run(TestMethodWorker.java:111)
	at org.testng.TestRunner.privateRun(TestRunner.java:767)
	at org.testng.TestRunner.run(TestRunner.java:617)
	at org.testng.SuiteRunner.runTest(SuiteRunner.java:334)
	at org.testng.SuiteRunner.runSequentially(SuiteRunner.java:329)
	at org.testng.SuiteRunner.privateRun(SuiteRunner.java:291)
	at org.testng.SuiteRunner.run(SuiteRunner.java:240)
	at org.testng.SuiteRunnerWorker.runSuite(SuiteRunnerWorker.java:52)
	at org.testng.SuiteRunnerWorker.run(SuiteRunnerWorker.java:86)
	at org.testng.TestNG.runSuitesSequentially(TestNG.java:1198)
	at org.testng.TestNG.runSuitesLocally(TestNG.java:1123)
	at org.testng.TestNG.run(TestNG.java:1031)
	at org.testng.TestNG.privateMain(TestNG.java:1338)
	at org.testng.TestNG.main(TestNG.java:1307)

SKIPPED: testDeployUndeploy
SKIPPED: testGetProcessPackage
SKIPPED: testListDeployedPackages
SKIPPED: testListProcesses
SKIPPED: testMultipleDeployUndeployVersion
SKIPPED: undeployBlankPackage
SKIPPED: testEndpointProperties
SKIPPED: testHttpAuthentication
SKIPPED: testTimeouts
SKIPPED: testHttpBinding
SKIPPED: testHttpBindingExt_DELETE
SKIPPED: testHttpBindingExt_GET
SKIPPED: testHttpBindingExt_POST
SKIPPED: testHttpBindingExt_PUT
SKIPPED: testCorrelationJoin
SKIPPED: testDeleteInstances
SKIPPED: testGetInstanceInfo
SKIPPED: testGetInstanceInfoFault
SKIPPED: testGetScopeInfo
SKIPPED: testGetVariableInfo
SKIPPED: testInstanceSummaryListProcess
SKIPPED: testListAllInstances
SKIPPED: testListInstances
SKIPPED: testAttrWithNsValue
SKIPPED: test
SKIPPED: testNoP2P
SKIPPED: testCorrelationJoin
SKIPPED: testCorrelationJoin
SKIPPED: testRetiredInstance
SKIPPED: testRetiredInstance
SKIPPED: invokeSecuredProcesses("TestRampartBasic/secured-processes/process-sample10", "/x1/jenkins/jenkins-slave/workspace/ODE-1.x/axis2-war/target/test/resources/TestRampartBasic/secured-processes",
"/x1/jenkins/jenkins-slave/workspace/ODE-1.x/axis2-war/target/test/resources/TestRampartBasic/secured-processes/sample10-client.axis2")
SKIPPED: invokeSecuredProcesses("TestRampartBasic/secured-processes/process-sample05", "/x1/jenkins/jenkins-slave/workspace/ODE-1.x/axis2-war/target/test/resources/TestRampartBasic/secured-processes",
"/x1/jenkins/jenkins-slave/workspace/ODE-1.x/axis2-war/target/test/resources/TestRampartBasic/secured-processes/sample05-client.axis2")
SKIPPED: invokeSecuredProcesses("TestRampartBasic/secured-processes/process-sample08", "/x1/jenkins/jenkins-slave/workspace/ODE-1.x/axis2-war/target/test/resources/TestRampartBasic/secured-processes",
"/x1/jenkins/jenkins-slave/workspace/ODE-1.x/axis2-war/target/test/resources/TestRampartBasic/secured-processes/sample08-client.axis2")
SKIPPED: invokeSecuredProcesses("TestRampartBasic/secured-processes/process-sample04", "/x1/jenkins/jenkins-slave/workspace/ODE-1.x/axis2-war/target/test/resources/TestRampartBasic/secured-processes",
"/x1/jenkins/jenkins-slave/workspace/ODE-1.x/axis2-war/target/test/resources/TestRampartBasic/secured-processes/sample04-client.axis2")
SKIPPED: invokeSecuredProcesses("TestRampartBasic/secured-processes/process-sample07", "/x1/jenkins/jenkins-slave/workspace/ODE-1.x/axis2-war/target/test/resources/TestRampartBasic/secured-processes",
"/x1/jenkins/jenkins-slave/workspace/ODE-1.x/axis2-war/target/test/resources/TestRampartBasic/secured-processes/sample07-client.axis2")
SKIPPED: invokeSecuredProcesses("TestRampartBasic/secured-processes/process-sample03", "/x1/jenkins/jenkins-slave/workspace/ODE-1.x/axis2-war/target/test/resources/TestRampartBasic/secured-processes",
"/x1/jenkins/jenkins-slave/workspace/ODE-1.x/axis2-war/target/test/resources/TestRampartBasic/secured-processes/sample03-client.axis2")
SKIPPED: invokeSecuredProcesses("TestRampartBasic/secured-processes/process-sample09", "/x1/jenkins/jenkins-slave/workspace/ODE-1.x/axis2-war/target/test/resources/TestRampartBasic/secured-processes",
"/x1/jenkins/jenkins-slave/workspace/ODE-1.x/axis2-war/target/test/resources/TestRampartBasic/secured-processes/sample09-client.axis2")
SKIPPED: invokeSecuredProcesses("TestRampartBasic/secured-processes/process-sample02", "/x1/jenkins/jenkins-slave/workspace/ODE-1.x/axis2-war/target/test/resources/TestRampartBasic/secured-processes",
"/x1/jenkins/jenkins-slave/workspace/ODE-1.x/axis2-war/target/test/resources/TestRampartBasic/secured-processes/sample02-client.axis2")
SKIPPED: invokeSecuredProcesses("TestRampartBasic/secured-processes/process-sample06", "/x1/jenkins/jenkins-slave/workspace/ODE-1.x/axis2-war/target/test/resources/TestRampartBasic/secured-processes",
"/x1/jenkins/jenkins-slave/workspace/ODE-1.x/axis2-war/target/test/resources/TestRampartBasic/secured-processes/sample06-client.axis2")
SKIPPED: invokeSecuredProcesses("TestRampartPolicy/secured-processes/process-sample04", "/x1/jenkins/jenkins-slave/workspace/ODE-1.x/axis2-war/target/test/resources/TestRampartPolicy/secured-processes",
"/x1/jenkins/jenkins-slave/workspace/ODE-1.x/axis2-war/target/test/resources/TestRampartPolicy/secured-processes/sample04-policy.xml")
SKIPPED: invokeSecuredProcesses("TestRampartPolicy/secured-processes/process-sample01", "/x1/jenkins/jenkins-slave/workspace/ODE-1.x/axis2-war/target/test/resources/TestRampartPolicy/secured-processes",
"/x1/jenkins/jenkins-slave/workspace/ODE-1.x/axis2-war/target/test/resources/TestRampartPolicy/secured-processes/sample01-policy.xml")
SKIPPED: invokeSecuredProcesses("TestRampartPolicy/secured-processes/process-sample03", "/x1/jenkins/jenkins-slave/workspace/ODE-1.x/axis2-war/target/test/resources/TestRampartPolicy/secured-processes",
"/x1/jenkins/jenkins-slave/workspace/ODE-1.x/axis2-war/target/test/resources/TestRampartPolicy/secured-processes/sample03-policy.xml")
SKIPPED: invokeSecuredProcesses("TestRampartPolicy/secured-processes/process-sample02", "/x1/jenkins/jenkins-slave/workspace/ODE-1.x/axis2-war/target/test/resources/TestRampartPolicy/secured-processes",
"/x1/jenkins/jenkins-slave/workspace/ODE-1.x/axis2-war/target/test/resources/TestRampartPolicy/secured-processes/sample02-policy.xml")
SKIPPED: standAlonePolicy
SKIPPED: executeProcess("TestRampartBasic/secured-services/process-sample10")
SKIPPED: executeProcess("TestRampartBasic/secured-services/process-sample05")
SKIPPED: executeProcess("TestRampartBasic/secured-services/process-sample08")
SKIPPED: executeProcess("TestRampartBasic/secured-services/process-sample04")
SKIPPED: executeProcess("TestRampartBasic/secured-services/process-sample07")
SKIPPED: executeProcess("TestRampartBasic/secured-services/process-sample03")
SKIPPED: executeProcess("TestRampartBasic/secured-services/process-sample09")
SKIPPED: executeProcess("TestRampartBasic/secured-services/process-sample02")
SKIPPED: executeProcess("TestRampartBasic/secured-services/process-sample06")
SKIPPED: executeProcess("TestRampartPolicy/secured-services/process-sample04-policy")
SKIPPED: executeProcess("TestRampartPolicy/secured-services/process-sample01-policy")
SKIPPED: executeProcess("TestRampartPolicy/secured-services/process-sample02-policy")
SKIPPED: executeProcess("TestRampartPolicy/secured-services/process-sample03-policy")
SKIPPED: testPolicyInServiceXml
SKIPPED: testNoP2P
SKIPPED: testSimpleFaultCatch
SKIPPED: testSoapHeaders
SKIPPED: testSimplePassing
SKIPPED: testSimpleFaultCatch

===============================================
    Command line test
    Tests run: 107, Failures: 36, Skips: 63
    Configuration Failures: 1, Skips: 125
===============================================


===============================================
ode-axis2-war
Total tests run: 107, Failures: 36, Skips: 63
Configuration Failures: 1, Skips: 125
===============================================

[TestNG] Time taken by org.testng.reporters.jq.Main@193722c: 99 ms
[TestNG] Time taken by org.testng.reporters.EmailableReporter@dc57db: 86 ms
[TestNG] Time taken by org.testng.reporters.SuiteHTMLReporter@1989f84: 75 ms
[TestNG] Time taken by org.testng.reporters.JUnitReportReporter@a1d1f4: 41 ms
[TestNG] Time taken by [FailedReporter passed=0 failed=0 skipped=0]: 12 ms
[TestNG] Time taken by org.testng.reporters.XMLReporter@ccc588: 48 ms
[SimpleHTTPServer] Stop called
The following tests failed:
org.apache.ode.axis2.BpelActivityTest
org.apache.ode.axis2.ClusteredOutgoingTrafficTest
org.apache.ode.axis2.EndpointConfigurationTest
org.apache.ode.axis2.EndpointTimeoutsTest
org.apache.ode.axis2.MessageStructureTest
org.apache.ode.axis2.NoInputMessageInvocationTest
org.apache.ode.axis2.NoP2PTest
org.apache.ode.axis2.SelectorsTest
org.apache.ode.axis2.ServiceFaultCatchTest
org.apache.ode.axis2.SoapHeader2Test
org.apache.ode.axis2.SoapHeaderTest
org.apache.ode.axis2.XSDReferencesDeployTest
org.apache.ode.axis2.correlation.CorrelationJoinHibTest
org.apache.ode.axis2.correlation.CorrelationJoinLazyHibTest
org.apache.ode.axis2.correlation.CorrelationJoinLazyTest
org.apache.ode.axis2.correlation.CorrelationJoinTest
org.apache.ode.axis2.correlation.CorrelationMultiHibTest
org.apache.ode.axis2.correlation.CorrelationMultiTest
org.apache.ode.axis2.correlation.CorrelationUnicityTest
org.apache.ode.axis2.httpbinding.HttpBindingTest
org.apache.ode.axis2.hydration.InstanceCountTest
org.apache.ode.axis2.hydration.ProcessCountTest
org.apache.ode.axis2.hydration.ProcessSizeTest
org.apache.ode.axis2.instancecleanup.CleanFailureHibTest
org.apache.ode.axis2.instancecleanup.CleanFailureTest
org.apache.ode.axis2.instancecleanup.CleanFaultHibTest
org.apache.ode.axis2.instancecleanup.CleanFaultTest
org.apache.ode.axis2.instancecleanup.CleanSuccessHibTest
org.apache.ode.axis2.instancecleanup.CleanSuccessTest
org.apache.ode.axis2.management.ActivateRetiredProcessTest
org.apache.ode.axis2.management.DeploymentTest
org.apache.ode.axis2.management.InstanceManagementTest
org.apache.ode.axis2.management.Retire2Test
org.apache.ode.axis2.management.RetireTest
org.apache.ode.axis2.rampart.basic.SecuredProcessesTest
org.apache.ode.axis2.rampart.basic.SecuredServicesTest
org.apache.ode.axis2.rampart.policy.SecuredProcessesTest
org.apache.ode.axis2.rampart.policy.SecuredServicesTest
Packaging ode-bpel-scripts-1.3.6.jar
Packaging ode-bpel-scripts-1.3.6.zip
Compiling ode:bpel-test:test into /x1/jenkins/jenkins-slave/workspace/ODE-1.x/bpel-test/target/test/classes
error: error reading /x1/jenkins/jenkins-slave/workspace/ODE-1.x/bpel-scripts/target/ode-bpel-scripts-1.3.6.zip;
error in opening zip file
1 error
Buildr aborted!
RuntimeError : Failed to compile, see errors above

(See full trace by running task with --trace)
Build step 'Execute shell' marked build as failure
[locks-and-latches] Releasing all the locks
[locks-and-latches] All the locks released
Recording fingerprints
Archiving artifacts
Recording test results
TestNG Reports Processing: START
Looking for TestNG results report in workspace using pattern: **/reports/testng/testng-results.xml
Saving reports...
Processing '/x1/jenkins/jenkins-home/jobs/ODE-1.x/builds/2014-01-02_00-47-11/testng/testng-results.xml'
TestNG Reports Processing: FINISH

Mime
View raw message