ode-dev mailing list archives

Site index · List index
Message view « Date » · « Thread »
Top « Date » · « Thread »
From Apache Jenkins Server <jenk...@builds.apache.org>
Subject Build failed in Jenkins: ODE-trunk-jdk6 #856
Date Thu, 11 Jun 2015 12:19:24 GMT
See <https://builds.apache.org/job/ODE-trunk-jdk6/856/changes>

Changes:

[Tammo van Lessen] re-adding pom with dependency builder.

------------------------------------------
[...truncated 272 lines...]
    [junit] Testsuite: org.apache.ode.bpel.compiler.WSDLRegistryTest
    [junit] Tests run: 2, Failures: 0, Errors: 0, Time elapsed: 0.051 sec
    [junit] 
    [junit] Testcase: testAddWSDL took 0.036 sec
    [junit] Testcase: testInitialModel took 0.01 sec
    [junit] Testsuite: org.apache.ode.bpel.compiler.XPathTest
    [junit] Tests run: 5, Failures: 0, Errors: 0, Time elapsed: 0.048 sec
    [junit] 
    [junit] Testcase: testEmptyXPath20StringBPEL20Draft took 0.01 sec
    [junit] Testcase: testEmptyXPath10StringBPEL20Draft took 0.002 sec
    [junit] Testcase: testEmptyXPath20StringBPEL20 took 0.001 sec
    [junit] Testcase: testEmptyXPath10StringBPEL11 took 0.001 sec
    [junit] Testcase: testEmptyXPath10StringBPEL20 took 0 sec
    [junit] Testsuite: org.apache.ode.bpel.compiler_2_0.GoodCompileTest
    [junit] Tests run: 51, Failures: 0, Errors: 0, Time elapsed: 3.418 sec
    [junit] 
    [junit] Testcase: testAssign5_BPEL20 took 0.216 sec
    [junit] Testcase: testIf1 took 0.116 sec
    [junit] Testcase: testIf2 took 0.094 sec
    [junit] Testcase: testIf3 took 0.086 sec
    [junit] Testcase: testXPath10GetVariableData1 took 0.227 sec
    [junit] Testcase: testXPath10GetVariableData2 took 0.065 sec
    [junit] Testcase: testXPath10GetVariableData3 took 0.062 sec
    [junit] Testcase: testXPath10GetVariableData4 took 0.075 sec
    [junit] Testcase: testAsyncProcess took 0.216 sec
    [junit] Testcase: testXPath10GetVariableProperty1 took 0.06 sec
    [junit] Testcase: testFlow2 took 0.066 sec
    [junit] Testcase: testFlow3 took 0.061 sec
    [junit] Testcase: testFlow4 took 0.053 sec
    [junit] Testcase: testFlow5 took 0.062 sec
    [junit] Testcase: testFlow6 took 0.06 sec
    [junit] Testcase: testFlow7 took 0.056 sec
    [junit] Testcase: testPick3 took 0.044 sec
    [junit] Testcase: testPick4 took 0.052 sec
    [junit] Testcase: testPick5 took 0.051 sec
    [junit] Testcase: testPick6 took 0.044 sec
    [junit] Testcase: testWait1 took 0.037 sec
    [junit] Testcase: testWait2 took 0.038 sec
    [junit] Testcase: testWhile took 0.036 sec
    [junit] Testcase: testAssign3_BPEL20 took 0.045 sec
    [junit] Testcase: testAssign8_BPEL20 took 0.038 sec
    [junit] Testcase: testCompensation1 took 0.047 sec
    [junit] Testcase: testCompensation2 took 0.045 sec
    [junit] Testcase: testXSDImport took 0.349 sec
    [junit] Testcase: testAssign1_BPEL20 took 0.039 sec
    [junit] Testcase: testMultipleEmbeddedSchemas took 0.04 sec
    [junit] Testcase: testAssign6_BPEL20 took 0.039 sec
    [junit] Testcase: testRethrow1 took 0.048 sec
    [junit] Testcase: testRethrow2 took 0.04 sec
    [junit] Testcase: testAssign9_BPEL20 took 0.033 sec
    [junit] Testcase: testXPath20GetVariableProperty1 took 0.049 sec
    [junit] Testcase: testCircularReference took 0.04 sec
    [junit] Testcase: testForEach1 took 0.037 sec
    [junit] Testcase: testForEach2 took 0.039 sec
    [junit] Testcase: testForEach3 took 0.037 sec
    [junit] Testcase: testAssign2_BPEL20 took 0.036 sec
    [junit] Testcase: testAssign7_BPEL20 took 0.036 sec
    [junit] Testcase: testThrow1 took 0.041 sec
    [junit] Testcase: testThrow2 took 0.059 sec
    [junit] Testcase: testThrow3 took 0.04 sec
    [junit] Testcase: testThrow4 took 0.035 sec
    [junit] Testcase: testThrow5 took 0.04 sec
    [junit] Testcase: testThrow6 took 0.04 sec
    [junit] Testcase: testThrow7 took 0.037 sec
    [junit] Testcase: testXPath20GetVariableData2 took 0.044 sec
    [junit] Testcase: testXPath20GetVariableData3 took 0.067 sec
    [junit] Testcase: testXPath20GetVariableData4 took 0.033 sec
    [junit] Testsuite: org.apache.ode.bpel.compiler_2_0.XslTest
    [junit] Tests run: 2, Failures: 0, Errors: 0, Time elapsed: 0.236 sec
    [junit] 
    [junit] Testcase: testUTFEncoding took 0.191 sec
    [junit] Testcase: testISOEncoding took 0.041 sec
    [junit] Testsuite: org.apache.ode.bpel.elang.xpath20.compiler.XPath20ExpressionCompilerImplTest
    [junit] Tests run: 4, Failures: 0, Errors: 0, Time elapsed: 0.032 sec
    [junit] 
    [junit] Testcase: testExtractFunctionsExprs took 0 sec
    [junit] Testcase: testresolvedFunctionsExpr took 0.001 sec
    [junit] Testcase: testTimeStampInFunction took 0 sec
    [junit] Testcase: testresolvedFunctionsTimeStamp took 0.001 sec
    [junit] Testsuite: org.apache.ode.bpel.elang.xquery10.compiler.XQuery10ExpressionCompilerImplTest
    [junit] Tests run: 2, Failures: 0, Errors: 0, Time elapsed: 0.052 sec
    [junit] 
    [junit] Testcase: testGetVariableNames took 0.049 sec
    [junit] Testcase: testGetVariableNames_endsWithVariableName took 0 sec
Packaging ode-bpel-compiler-1.4-SNAPSHOT.jar
Compiling ode:bpel-dao into /workspace/bpel-dao/target/classes
Packaging ode-bpel-dao-1.4-SNAPSHOT.jar
Compiling ode:bpel-epr into /workspace/bpel-epr/target/classes
Note: Some input files use unchecked or unsafe operations.
Note: Recompile with -Xlint:unchecked for details.
Compiling ode:bpel-epr:test into /workspace/bpel-epr/target/test/classes
Running tests in ode:bpel-epr
Trying to override old definition of datatype junit
    [junit] Testsuite: org.apache.ode.bpel.epr.WSDL11EndpointTest
    [junit] Tests run: 4, Failures: 0, Errors: 0, Time elapsed: 0.579 sec
    [junit] 
    [junit] Testcase: testAcceptServiceWithRandomElement took 0.135 sec
    [junit] Testcase: testAcceptServiceElement took 0.002 sec
    [junit] Testcase: testAcceptServiceWithTextNode took 0.003 sec
    [junit] Testcase: testAcceptServiceRefElement took 0 sec
Packaging ode-bpel-epr-1.4-SNAPSHOT.jar
Compiling ode:bpel-ql into /workspace/bpel-ql/target/classes
Note: Some input files use unchecked or unsafe operations.
Note: Recompile with -Xlint:unchecked for details.
Compiling ode:bpel-ql:test into /workspace/bpel-ql/target/test/classes
Note: /workspace/bpel-ql/src/test/java/org/apache/ode/ql/SyntaxTest.java uses unchecked or
unsafe operations.
Note: Recompile with -Xlint:unchecked for details.
Running tests in ode:bpel-ql
Trying to override old definition of datatype junit
    [junit] Testsuite: org.apache.ode.ql.SyntaxTest
    [junit] Tests run: 1, Failures: 0, Errors: 0, Time elapsed: 0.069 sec
    [junit] 
    [junit] Testcase: test took 0.003 sec
Packaging ode-bpel-ql-1.4-SNAPSHOT.jar
Compiling ode:dao-hibernate into /workspace/dao-hibernate/target/classes
Note: Some input files use or override a deprecated API.
Note: Recompile with -Xlint:deprecation for details.
Note: Some input files use unchecked or unsafe operations.
Note: Recompile with -Xlint:unchecked for details.
Compiling ode:dao-hibernate:test into /workspace/dao-hibernate/target/test/classes
Running tests in ode:dao-hibernate
Trying to override old definition of datatype junit
    [junit] Testsuite: org.apache.ode.daohib.bpel.ListInstanceTest
    [junit] Tests run: 1, Failures: 0, Errors: 0, Time elapsed: 14.658 sec
    [junit] 
    [junit] Testcase: testListInstance took 14.595 sec
    [junit] Testsuite: org.apache.ode.daohib.bpel.MexTest
    [junit] Tests run: 2, Failures: 0, Errors: 0, Time elapsed: 16.325 sec
    [junit] 
    [junit] Testcase: test took 8.211 sec
    [junit] Testcase: testCleanup took 8.109 sec
    [junit] Testsuite: org.apache.ode.daohib.bpel.ProcessManagementDaoTest
    [junit] Tests run: 2, Failures: 0, Errors: 0, Time elapsed: 14.253 sec
    [junit] ------------- Standard Output ---------------
    [junit] resultSummary:{}
    [junit] resultSummary:{InstanceSummaryKey [instanceStatus=COMPLETED, pid={ns}pid]=1}
    [junit] ------------- ---------------- ---------------
    [junit] 
    [junit] Testcase: testInstanceSummaryFailures took 7.069 sec
    [junit] Testcase: testInstanceSummary took 7.18 sec
Packaging ode-dao-hibernate-1.4-SNAPSHOT.jar
Compiling ode:dao-jpa into /workspace/dao-jpa/target/classes
222  ode-dao  INFO   [main] openjpa.Tool - No targets were given.  Running on all classes
in your persistent classes list, or all metadata files in classpath directories if you have
not listed your persistent classes.  Use -help to display tool usage information.
Packaging ode-dao-jpa-1.4-SNAPSHOT.jar
Compiling ode:bpel-store into /workspace/bpel-store/target/classes
Note: /workspace/bpel-store/src/main/java/org/apache/ode/store/DocumentEntityResolver.java
uses or overrides a deprecated API.
Note: Recompile with -Xlint:deprecation for details.
Note: Some input files use unchecked or unsafe operations.
Note: Recompile with -Xlint:unchecked for details.
20  ode-store  INFO   [main] openjpa.Tool - No targets were given.  Running on all classes
in your persistent classes list, or all metadata files in classpath directories if you have
not listed your persistent classes.  Use -help to display tool usage information.
Compiling ode:bpel-store:test into /workspace/bpel-store/target/test/classes
Running tests in ode:bpel-store
Trying to override old definition of datatype junit
    [junit] Testsuite: org.apache.ode.store.DeploymentUnitTest
    [junit] Tests run: 2, Failures: 0, Errors: 0, Time elapsed: 1.285 sec
    [junit] 
    [junit] Testcase: testRegistry took 0.844 sec
    [junit] Testcase: testCompile took 0.002 sec
    [junit] Testsuite: org.apache.ode.store.ProcessStoreTest
    [junit] Tests run: 5, Failures: 0, Errors: 0, Time elapsed: 3.212 sec
    [junit] 
    [junit] Testcase: testGetProcesses took 2.587 sec
    [junit] Testcase: testGetProcess took 0.174 sec
    [junit] Testcase: testCleanupConfigurations took 0.184 sec
    [junit] Testcase: testDeploy took 0.154 sec
    [junit] Testcase: testSanity took 0.107 sec
    [junit] Testsuite: org.apache.ode.store.hib.DaoTest
    [junit] Tests run: 6, Failures: 0, Errors: 0, Time elapsed: 2.197 sec
    [junit] 
    [junit] Testcase: testCreateDU took 1.586 sec
    [junit] Testcase: testEmpty took 0.124 sec
    [junit] Testcase: testCreateProcess took 0.123 sec
    [junit] Testcase: testGetDeploymentUnits took 0.151 sec
    [junit] Testcase: testRollback took 0.108 sec
    [junit] Testcase: testProcessProperties took 0.098 sec
Packaging ode-bpel-store-1.4-SNAPSHOT.jar
Compiling ode:bpel-runtime into /workspace/bpel-runtime/target/classes
Note: Some input files use or override a deprecated API.
Note: Recompile with -Xlint:deprecation for details.
Note: Some input files use unchecked or unsafe operations.
Note: Recompile with -Xlint:unchecked for details.
Compiling ode:scheduler-simple into /workspace/scheduler-simple/target/classes
Compiling ode:scheduler-simple:test into /workspace/scheduler-simple/target/test/classes
Note: Some input files use or override a deprecated API.
Note: Recompile with -Xlint:deprecation for details.
Running tests in ode:scheduler-simple
Trying to override old definition of datatype junit
    [junit] Testsuite: org.apache.ode.scheduler.simple.JdbcDelegateTest
    [junit] Tests run: 8, Failures: 0, Errors: 0, Time elapsed: 1.938 sec
    [junit] 
    [junit] Testcase: testGetNodeIds took 1.051 sec
    [junit] Testcase: testScheduleImmediateTimeFilter took 0.044 sec
    [junit] Testcase: testScheduleImmediateNodeFilter took 0.035 sec
    [junit] Testcase: testUpgrade took 0.649 sec
    [junit] Testcase: testScheduleImmediateMaxRows took 0.01 sec
    [junit] Testcase: testMigration took 0.036 sec
    [junit] Testcase: testReassign took 0.009 sec
    [junit] Testcase: testDeleteJob took 0.01 sec
    [junit] Testsuite: org.apache.ode.scheduler.simple.RetriesTest
    [junit] Tests run: 2, Failures: 0, Errors: 0, Time elapsed: 12.178 sec
    [junit] 
    [junit] Testcase: testRetries took 10.162 sec
    [junit] Testcase: testExecTransaction took 2.008 sec
    [junit] Testsuite: org.apache.ode.scheduler.simple.SchedulerThreadTest
    [junit] Tests run: 4, Failures: 1, Errors: 0, Time elapsed: 5.459 sec
    [junit] 
    [junit] Testcase: testSchedulingResolution took 1.002 sec
    [junit] Testcase: testTaskDequeueOrderWithSameExecTime took 1.807 sec
    [junit] Testcase: testStartStop took 0.701 sec
    [junit] Testcase: testParallelEnqueue took 1.941 sec
    [junit] 	FAILED
    [junit] null
    [junit] junit.framework.AssertionFailedError
    [junit] 	at org.apache.ode.scheduler.simple.SchedulerThreadTest.testParallelEnqueue(SchedulerThreadTest.java:101)
    [junit] 
    [junit] TEST org.apache.ode.scheduler.simple.SchedulerThreadTest FAILED
    [junit] Testsuite: org.apache.ode.scheduler.simple.SimpleSchedulerTest
    [junit] Tests run: 7, Failures: 0, Errors: 0, Time elapsed: 31.168 sec
    [junit] 
    [junit] Testcase: testRecoverySuppressed took 5.02 sec
    [junit] Testcase: testFarFutureScheduling took 8.519 sec
    [junit] Testcase: testImmediateScheduling took 0.212 sec
    [junit] Testcase: testStartStop took 1.327 sec
    [junit] Testcase: testConcurrentExec took 3.536 sec
    [junit] Testcase: testRecovery took 4.013 sec
    [junit] Testcase: testNearFutureScheduling took 8.514 sec
    [junit] Tests FAILED
The following tests failed:
org.apache.ode.scheduler.simple.SchedulerThreadTest
Buildr aborted!
RuntimeError : Tests failed!

(See full trace by running task with --trace)
Build step 'Execute shell' marked build as failure
Recording fingerprints
Archiving artifacts
Sending artifact delta relative to ODE-trunk-jdk6 #855
Archived 2 artifacts
Archive block size is 32768
Received 628 blocks and 13696 bytes
Compression is 99.9%
Took 4.7 sec
Recording test results
TestNG Reports Processing: START
Looking for TestNG results report in workspace using pattern: **/reports/testng/testng-results.xml
testng-results.xml was last modified before this build started. Ignoring it.
Saving reports...
Found matching files but did not find any TestNG results.
Updating ODE-991

Mime
View raw message