ode-dev mailing list archives

Site index · List index
Message view « Date » · « Thread »
Top « Date » · « Thread »
From Apache Jenkins Server <jenk...@builds.apache.org>
Subject Build failed in Jenkins: ODE-trunk-jdk6 #848
Date Tue, 09 Jun 2015 18:51:48 GMT
See <https://builds.apache.org/job/ODE-trunk-jdk6/848/changes>

Changes:

[Tammo van Lessen] fixing ODE-1031, thanks to Igor Vorobiov for the patch.

------------------------------------------
[...truncated 681 lines...]
Downloading org.apache.geronimo.modules:geronimo-kernel:pom:2.0.1
Downloading http://repo1.maven.org/maven2/org/apache/geronimo/modules/geronimo-kernel/2.0.1/geronimo-kernel-2.0.1.pom
Downloading org.apache.geronimo.specs:geronimo-ejb_2.1_spec:jar:1.1
Downloading http://repo1.maven.org/maven2/org/apache/geronimo/specs/geronimo-ejb_2.1_spec/1.1/geronimo-ejb_2.1_spec-1.1.jar
Downloading org.apache.geronimo.specs:geronimo-ejb_2.1_spec:pom:1.1
Downloading http://repo1.maven.org/maven2/org/apache/geronimo/specs/geronimo-ejb_2.1_spec/1.1/geronimo-ejb_2.1_spec-1.1.pom
Compiling ode:dao-hibernate:test into /workspace/dao-hibernate/target/test/classes
Running tests in ode:dao-hibernate
Trying to override old definition of datatype junit
    [junit] Testsuite: org.apache.ode.daohib.bpel.ListInstanceTest
    [junit] Tests run: 1, Failures: 0, Errors: 0, Time elapsed: 5.273 sec
    [junit] 
    [junit] Testcase: testListInstance took 5.179 sec
    [junit] Testsuite: org.apache.ode.daohib.bpel.MexTest
    [junit] Tests run: 2, Failures: 0, Errors: 0, Time elapsed: 3.004 sec
    [junit] 
    [junit] Testcase: test took 1.565 sec
    [junit] Testcase: testCleanup took 1.434 sec
    [junit] Testsuite: org.apache.ode.daohib.bpel.ProcessManagementDaoTest
    [junit] Tests run: 2, Failures: 0, Errors: 0, Time elapsed: 1.832 sec
    [junit] ------------- Standard Output ---------------
    [junit] resultSummary:{}
    [junit] resultSummary:{InstanceSummaryKey [instanceStatus=COMPLETED, pid={ns}pid]=1}
    [junit] ------------- ---------------- ---------------
    [junit] 
    [junit] Testcase: testInstanceSummaryFailures took 0.966 sec
    [junit] Testcase: testInstanceSummary took 0.862 sec
Packaging ode-dao-hibernate-1.4-SNAPSHOT.jar
Downloading org.apache.openjpa:openjpa:jar:1.2.3
Downloading http://repo1.maven.org/maven2/org/apache/openjpa/openjpa/1.2.3/openjpa-1.2.3.jar
Downloading org.apache.openjpa:openjpa:pom:1.2.3
Downloading http://repo1.maven.org/maven2/org/apache/openjpa/openjpa/1.2.3/openjpa-1.2.3.pom
Compiling ode:dao-jpa into /workspace/dao-jpa/target/classes
214  ode-dao  INFO   [main] openjpa.Tool - No targets were given.  Running on all classes
in your persistent classes list, or all metadata files in classpath directories if you have
not listed your persistent classes.  Use -help to display tool usage information.
Packaging ode-dao-jpa-1.4-SNAPSHOT.jar
Compiling ode:bpel-store into /workspace/bpel-store/target/classes
Note: /workspace/bpel-store/src/main/java/org/apache/ode/store/DocumentEntityResolver.java
uses or overrides a deprecated API.
Note: Recompile with -Xlint:deprecation for details.
Note: Some input files use unchecked or unsafe operations.
Note: Recompile with -Xlint:unchecked for details.
18  ode-store  INFO   [main] openjpa.Tool - No targets were given.  Running on all classes
in your persistent classes list, or all metadata files in classpath directories if you have
not listed your persistent classes.  Use -help to display tool usage information.
Compiling ode:bpel-store:test into /workspace/bpel-store/target/test/classes
Running tests in ode:bpel-store
Trying to override old definition of datatype junit
    [junit] Testsuite: org.apache.ode.store.DeploymentUnitTest
    [junit] Tests run: 2, Failures: 0, Errors: 0, Time elapsed: 2.513 sec
    [junit] 
    [junit] Testcase: testRegistry took 0.772 sec
    [junit] Testcase: testCompile took 1.322 sec
    [junit] Testsuite: org.apache.ode.store.ProcessStoreTest
    [junit] Tests run: 5, Failures: 0, Errors: 0, Time elapsed: 2.421 sec
    [junit] 
    [junit] Testcase: testGetProcesses took 1.841 sec
    [junit] Testcase: testGetProcess took 0.184 sec
    [junit] Testcase: testCleanupConfigurations took 0.168 sec
    [junit] Testcase: testDeploy took 0.125 sec
    [junit] Testcase: testSanity took 0.097 sec
    [junit] Testsuite: org.apache.ode.store.hib.DaoTest
    [junit] Tests run: 6, Failures: 0, Errors: 0, Time elapsed: 2.095 sec
    [junit] 
    [junit] Testcase: testCreateDU took 1.451 sec
    [junit] Testcase: testEmpty took 0.126 sec
    [junit] Testcase: testCreateProcess took 0.118 sec
    [junit] Testcase: testGetDeploymentUnits took 0.151 sec
    [junit] Testcase: testRollback took 0.12 sec
    [junit] Testcase: testProcessProperties took 0.124 sec
Packaging ode-bpel-store-1.4-SNAPSHOT.jar
Compiling ode:agents into /workspace/agents/target/classes
Note: /workspace/agents/src/main/java/org/apache/ode/agents/memory/SizingAgent.java uses unchecked
or unsafe operations.
Note: Recompile with -Xlint:unchecked for details.
Packaging ode-agents-1.4-SNAPSHOT.jar
Compiling ode:bpel-runtime into /workspace/bpel-runtime/target/classes
Note: Some input files use or override a deprecated API.
Note: Recompile with -Xlint:deprecation for details.
Note: Some input files use unchecked or unsafe operations.
Note: Recompile with -Xlint:unchecked for details.
Compiling ode:scheduler-simple into /workspace/scheduler-simple/target/classes
Compiling ode:scheduler-simple:test into /workspace/scheduler-simple/target/test/classes
Note: Some input files use or override a deprecated API.
Note: Recompile with -Xlint:deprecation for details.
Running tests in ode:scheduler-simple
Trying to override old definition of datatype junit
    [junit] Testsuite: org.apache.ode.scheduler.simple.JdbcDelegateTest
    [junit] Tests run: 8, Failures: 0, Errors: 0, Time elapsed: 1.913 sec
    [junit] 
    [junit] Testcase: testGetNodeIds took 1.018 sec
    [junit] Testcase: testScheduleImmediateTimeFilter took 0.043 sec
    [junit] Testcase: testScheduleImmediateNodeFilter took 0.034 sec
    [junit] Testcase: testUpgrade took 0.666 sec
    [junit] Testcase: testScheduleImmediateMaxRows took 0.01 sec
    [junit] Testcase: testMigration took 0.034 sec
    [junit] Testcase: testReassign took 0.009 sec
    [junit] Testcase: testDeleteJob took 0.009 sec
    [junit] Testsuite: org.apache.ode.scheduler.simple.RetriesTest
    [junit] Tests run: 2, Failures: 0, Errors: 0, Time elapsed: 12.16 sec
    [junit] 
    [junit] Testcase: testRetries took 10.146 sec
    [junit] Testcase: testExecTransaction took 2.009 sec
    [junit] Testsuite: org.apache.ode.scheduler.simple.SchedulerThreadTest
    [junit] Tests run: 4, Failures: 0, Errors: 0, Time elapsed: 5.329 sec
    [junit] 
    [junit] Testcase: testSchedulingResolution took 1.001 sec
    [junit] Testcase: testTaskDequeueOrderWithSameExecTime took 1.806 sec
    [junit] Testcase: testStartStop took 0.701 sec
    [junit] Testcase: testParallelEnqueue took 1.813 sec
    [junit] Testsuite: org.apache.ode.scheduler.simple.SimpleSchedulerTest
    [junit] Tests run: 7, Failures: 0, Errors: 0, Time elapsed: 31.145 sec
    [junit] 
    [junit] Testcase: testRecoverySuppressed took 5.024 sec
    [junit] Testcase: testFarFutureScheduling took 8.515 sec
    [junit] Testcase: testImmediateScheduling took 0.211 sec
    [junit] Testcase: testStartStop took 1.323 sec
    [junit] Testcase: testConcurrentExec took 3.537 sec
    [junit] Testcase: testRecovery took 4.013 sec
    [junit] Testcase: testNearFutureScheduling took 8.513 sec
Packaging ode-scheduler-simple-1.4-SNAPSHOT.jar
Downloading tranql:tranql-connector-derby-common:jar:1.1
Downloading http://repo1.maven.org/maven2/tranql/tranql-connector-derby-common/1.1/tranql-connector-derby-common-1.1.jar
Downloading tranql:tranql-connector-derby-common:pom:1.1
Downloading http://repo1.maven.org/maven2/tranql/tranql-connector-derby-common/1.1/tranql-connector-derby-common-1.1.pom
Compiling ode:bpel-runtime:test into /workspace/bpel-runtime/target/test/classes
Note: /workspace/bpel-runtime/src/test/java/org/apache/ode/bpel/elang/URIResolverTest.java
uses or overrides a deprecated API.
Note: Recompile with -Xlint:deprecation for details.
Note: Some input files use unchecked or unsafe operations.
Note: Recompile with -Xlint:unchecked for details.
Running tests in ode:bpel-runtime
Trying to override old definition of datatype junit
    [junit] Testsuite: org.apache.ode.bpel.elang.URIResolverTest
    [junit] Tests run: 3, Failures: 0, Errors: 0, Time elapsed: 0.767 sec
    [junit] 
    [junit] Testcase: testEncoding took 0.257 sec
    [junit] Testcase: testResolveExistingFile took 0.06 sec
    [junit] Testcase: testResolveNonExistingFile took 0.014 sec
    [junit] Testsuite: org.apache.ode.bpel.elang.xpath10.runtime.XPath10ExpressionRuntimeTest
    [junit] Tests run: 1, Failures: 0, Errors: 0, Time elapsed: 0.36 sec
    [junit] 
    [junit] Testcase: testEvaluate_NaN took 0.353 sec
    [junit] Testsuite: org.apache.ode.bpel.elang.xpath20.runtime.CombineUrlTest
    [junit] Tests run: 1, Failures: 0, Errors: 0, Time elapsed: 0.015 sec
    [junit] 
    [junit] Testcase: testCombineUrl took 0.009 sec
    [junit] Testsuite: org.apache.ode.bpel.elang.xpath20.runtime.FunctionHelperTest
    [junit] Tests run: 1, Failures: 0, Errors: 0, Time elapsed: 0.014 sec
    [junit] 
    [junit] Testcase: testExtractString took 0.009 sec
    [junit] Testsuite: org.apache.ode.bpel.elang.xpath20.runtime.XPath20ExpressionRuntimeTest
    [junit] Tests run: 8, Failures: 0, Errors: 0, Time elapsed: 0.564 sec
    [junit] 
    [junit] Testcase: testVariableSelectionEmpty took 0.372 sec
    [junit] Testcase: testMessageTypeVariableSelection took 0.006 sec
    [junit] Testcase: testXpathDocFunction took 0.103 sec
    [junit] Testcase: testVariableSelectionReallyEmpty took 0.006 sec
    [junit] Testcase: testVariableInsertMissingData took 0.044 sec
    [junit] Testcase: testVariableSelection took 0.006 sec
    [junit] Testcase: testCompilation took 0.006 sec
    [junit] Testcase: testMessageInsertMissingData took 0.01 sec
    [junit] Testsuite: org.apache.ode.bpel.elang.xpath20.runtime.XsdTypesTest
    [junit] Tests run: 2, Failures: 0, Errors: 0, Time elapsed: 0.032 sec
    [junit] 
    [junit] Testcase: testDateTime took 0.024 sec
    [junit] Testcase: testEmptyDateTime took 0.002 sec
    [junit] Testsuite: org.apache.ode.bpel.engine.CustomProcessPropertiesTest
    [junit] Tests run: 1, Failures: 0, Errors: 0, Time elapsed: 0.007 sec
    [junit] 
    [junit] Testcase: test took 0.002 sec
    [junit] Testsuite: org.apache.ode.bpel.engine.InstanceLockManagerTest
    [junit] Tests run: 3, Failures: 0, Errors: 0, Time elapsed: 0.516 sec
    [junit] 
    [junit] Testcase: testExclusion took 0.004 sec
    [junit] Testcase: testWakeUpQueue took 0.504 sec
    [junit] Testcase: testDistinctness took 0 sec
    [junit] Testsuite: org.apache.ode.bpel.engine.MessageTest
    [junit] Tests run: 1, Failures: 0, Errors: 0, Time elapsed: 0.01 sec
    [junit] 
    [junit] Testcase: testSetHeaderPart took 0.004 sec
    [junit] Testsuite: org.apache.ode.bpel.engine.MyRoleMessageExchangeImplTest
    [junit] Tests run: 2, Failures: 0, Errors: 0, Time elapsed: 0.155 sec
    [junit] 
    [junit] Testcase: testResponseTimeout took 0.148 sec
    [junit] Testcase: testResponseReceived took 0.002 sec
    [junit] Testsuite: org.apache.ode.bpel.engine.cron.CronSchedulerTest
    [junit] Tests run: 1, Failures: 0, Errors: 0, Time elapsed: 0.032 sec
    [junit] 
    [junit] Testcase: testNull took 0.028 sec
    [junit] Testsuite: org.apache.ode.bpel.extvar.jdbc.JdbcExternalVariableEngineTest
    [junit] Tests run: 5, Failures: 0, Errors: 0, Time elapsed: 0.488 sec
    [junit] ------------- Standard Output ---------------
    [junit] <?xml version="1.0" encoding="UTF-8"?>
    [junit] <foobar xmlns="foo"><id1>hqejbhcnphracn5k2jflh8</id1><id2>hqejbhcnphracn5k2jflh9</id2></foobar>
    [junit] ------------- ---------------- ---------------
    [junit] 
    [junit] Testcase: testRead took 0.327 sec
    [junit] Testcase: testInitWriteValue took 0.053 sec
    [junit] Testcase: testConfigurationParsing took 0.016 sec
    [junit] Testcase: testConfigure took 0.043 sec
    [junit] Testcase: testWriteUpdate took 0.042 sec
    [junit] Testsuite: org.apache.ode.bpel.runtime.ActivityRecoveryTest
    [junit] Tests run: 10, Failures: 0, Errors: 1, Time elapsed: 51.467 sec
    [junit] 
    [junit] Testcase: testFailureWithFaultAction took 7.489 sec
    [junit] Testcase: testFailureHandlingInheritence took 1.229 sec
    [junit] Testcase: testImmediateFailure took 28.89 sec
    [junit] 	Caused an ERROR
    [junit] No failures info, which are required
    [junit] java.lang.AssertionError: No failures info, which are required
    [junit] 	at org.apache.ode.bpel.runtime.ActivityRecoveryTest.assertRecovery(ActivityRecoveryTest.java:441)
    [junit] 	at org.apache.ode.bpel.runtime.ActivityRecoveryTest.testImmediateFailure(ActivityRecoveryTest.java:187)
    [junit] 
    [junit] Testcase: testFailureWithCancelAction took 2.189 sec
    [junit] Testcase: testInvokeSucceeds took 0.787 sec
    [junit] Testcase: testInstanceSummary took 6.983 sec
    [junit] Testcase: testImmediateFailureAndFault2 took 0.718 sec
    [junit] Testcase: testImmediateFailureAndFault took 0.702 sec
    [junit] Testcase: testFailureWithManualRecovery took 1.804 sec
    [junit] Testcase: testFailureWithRecoveryAfterRetry took 0.666 sec
    [junit] TEST org.apache.ode.bpel.runtime.ActivityRecoveryTest FAILED
    [junit] Testsuite: org.apache.ode.bpel.runtime.CoreBpelTest
    [junit] Tests run: 9, Failures: 0, Errors: 0, Time elapsed: 0.031 sec
    [junit] 
    [junit] Testcase: testOneElementSequence took 0.001 sec
    [junit] Testcase: testFaultHandling took 0.004 sec
    [junit] Testcase: testThrow took 0.002 sec
    [junit] Testcase: testTwoElementFlow took 0.003 sec
    [junit] Testcase: testEmptyFlow took 0.001 sec
    [junit] Testcase: testSingleElementFlow took 0.002 sec
    [junit] Testcase: testFlowTermination took 0.008 sec
    [junit] Testcase: testTwoElementSequence took 0.002 sec
    [junit] Testcase: testEmptyProcess took 0.001 sec
    [junit] Testsuite: org.apache.ode.bpel.runtime.ProcessManagementTest
    [junit] Tests run: 3, Failures: 0, Errors: 0, Time elapsed: 7.601 sec
    [junit] 
    [junit] Testcase: testFilterProcessesByName took 2.683 sec
    [junit] Testcase: testListProcessesOrder took 2.483 sec
    [junit] Testcase: testListProcessCustom took 2.431 sec
    [junit] Tests FAILED
The following tests failed:
org.apache.ode.bpel.runtime.ActivityRecoveryTest
Buildr aborted!
RuntimeError : Tests failed!

(See full trace by running task with --trace)
Build step 'Execute shell' marked build as failure
Recording fingerprints
Archiving artifacts
Recording test results
TestNG Reports Processing: START
Looking for TestNG results report in workspace using pattern: **/reports/testng/testng-results.xml
Did not find any matching files.
Updating ODE-1031

Mime
View raw message