ode-dev mailing list archives

Site index · List index
Message view « Date » · « Thread »
Top « Date » · « Thread »
From Apache Jenkins Server <jenk...@builds.apache.org>
Subject Build failed in Jenkins: ODE-trunk-jdk6 #853
Date Wed, 10 Jun 2015 15:00:44 GMT
See <https://builds.apache.org/job/ODE-trunk-jdk6/853/>

Started by user Tammo van Lessen
Building remotely on ubuntu-5 (docker Ubuntu ubuntu5 ubuntu) in workspace <https://builds.apache.org/job/ODE-trunk-jdk6/ws/>
 > git rev-parse --is-inside-work-tree # timeout=10
Fetching changes from the remote Git repository
 > git config remote.origin.url https://git-wip-us.apache.org/repos/asf/ode.git # timeout=10
Fetching upstream changes from https://git-wip-us.apache.org/repos/asf/ode.git
 > git --version # timeout=10
 > git fetch --tags --progress https://git-wip-us.apache.org/repos/asf/ode.git +refs/heads/*:refs/remotes/origin/*
 > git rev-parse refs/remotes/origin/master^{commit} # timeout=10
 > git rev-parse refs/remotes/origin/origin/master^{commit} # timeout=10
Checking out Revision e9a4f89d55fa4bb18b314fc4ac6256d2b02099b5 (refs/remotes/origin/master)
 > git config core.sparsecheckout # timeout=10
 > git checkout -f e9a4f89d55fa4bb18b314fc4ac6256d2b02099b5
 > git rev-list e9a4f89d55fa4bb18b314fc4ac6256d2b02099b5 # timeout=10
[ODE-trunk-jdk6] $ /bin/bash /tmp/hudson1892676595347391465.sh
Pulling repository vanto/apache-buildr
ce07dcfa29dc: Pulling image (latest-jruby-jdk7) from vanto/apache-buildr
ce07dcfa29dc: Pulling image (latest-jruby-jdk7) from vanto/apache-buildr, endpoint: https://registry-1.docker.io/v1/
ce07dcfa29dc: Pulling dependent layers
511136ea3c5a: Download complete
3b3a4796eef1: Download complete
50ec2d202fe8: Download complete
1073b544a1cb: Download complete
6a7520a7fd8c: Download complete
060a97546ea3: Download complete
4d752356e7c6: Download complete
0b2411d869ec: Download complete
fa5c5774f090: Download complete
77f2d3f65913: Download complete
0babbcba9751: Download complete
fd6640001a5a: Download complete
48869c3c973c: Download complete
b286f4397050: Download complete
f20752c62569: Download complete
13f80edaec04: Download complete
eb6d8436f4bb: Download complete
d5c38b656fbe: Download complete
3badb738b8d3: Download complete
c204de84de22: Download complete
c4a7ae7e0c6f: Download complete
ce07dcfa29dc: Download complete
ce07dcfa29dc: Download complete
Status: Image is up to date for vanto/apache-buildr:latest-jruby-jdk7
Don't run Bundler as root. Bundler can ask for sudo if it is needed, and
installing your bundle as root will break this application for all non-root
users on this machine.
Fetching gem metadata from https://rubygems.org/......
Fetching version metadata from https://rubygems.org/..
Using rake
Using atoulme-Antwrap 0.7.5
Using bouncy-castle-java 1.5.0147
Using builder 3.2.2
Using bundler 1.8.5
Using diff-lcs 1.2.4
Using hoe 3.7.1
Using jruby-openssl 0.8.10
Using jruby-pageant 1.1.1
Using json_pure 1.8.0
Using minitar 0.5.4
Using net-ssh 2.7.0
Using net-sftp 2.1.2
Using orderedhash 0.0.6
Using rubyzip 0.9.9
Using xml-simple 1.1.2
Using buildr 1.4.22
Installing rspec-core 2.14.5
Installing rspec-expectations 2.14.3
Installing rspec-mocks 2.14.3
Installing rspec 2.14.1
Bundle complete! 5 Gemfile dependencies, 21 gems now installed.
Use `bundle show [gemname]` to see where a bundled gem is installed.
mkdir -p /home/dummy/.buildr
(in /workspace, development)
Building ode
Running tests in ode:bpel-runtime
Trying to override old definition of datatype junit
    [junit] Testsuite: org.apache.ode.bpel.elang.URIResolverTest
    [junit] Tests run: 3, Failures: 0, Errors: 0, Time elapsed: 0.806 sec
    [junit] Testcase: testEncoding took 0.281 sec
    [junit] Testcase: testResolveExistingFile took 0.066 sec
    [junit] Testcase: testResolveNonExistingFile took 0.014 sec
    [junit] Testsuite: org.apache.ode.bpel.elang.xpath10.runtime.XPath10ExpressionRuntimeTest
    [junit] Tests run: 1, Failures: 0, Errors: 0, Time elapsed: 0.386 sec
    [junit] Testcase: testEvaluate_NaN took 0.379 sec
    [junit] Testsuite: org.apache.ode.bpel.elang.xpath20.runtime.CombineUrlTest
    [junit] Tests run: 1, Failures: 0, Errors: 0, Time elapsed: 0.046 sec
    [junit] Testcase: testCombineUrl took 0.01 sec
    [junit] Testsuite: org.apache.ode.bpel.elang.xpath20.runtime.FunctionHelperTest
    [junit] Tests run: 1, Failures: 0, Errors: 0, Time elapsed: 0.015 sec
    [junit] Testcase: testExtractString took 0.009 sec
    [junit] Testsuite: org.apache.ode.bpel.elang.xpath20.runtime.XPath20ExpressionRuntimeTest
    [junit] Tests run: 8, Failures: 0, Errors: 0, Time elapsed: 0.612 sec
    [junit] Testcase: testVariableSelectionEmpty took 0.385 sec
    [junit] Testcase: testMessageTypeVariableSelection took 0.007 sec
    [junit] Testcase: testXpathDocFunction took 0.113 sec
    [junit] Testcase: testVariableSelectionReallyEmpty took 0.008 sec
    [junit] Testcase: testVariableInsertMissingData took 0.047 sec
    [junit] Testcase: testVariableSelection took 0.008 sec
    [junit] Testcase: testCompilation took 0.006 sec
    [junit] Testcase: testMessageInsertMissingData took 0.009 sec
    [junit] Testsuite: org.apache.ode.bpel.elang.xpath20.runtime.XsdTypesTest
    [junit] Tests run: 2, Failures: 0, Errors: 0, Time elapsed: 0.055 sec
    [junit] Testcase: testDateTime took 0.032 sec
    [junit] Testcase: testEmptyDateTime took 0.002 sec
    [junit] Testsuite: org.apache.ode.bpel.engine.CustomProcessPropertiesTest
    [junit] Tests run: 1, Failures: 0, Errors: 0, Time elapsed: 0.008 sec
    [junit] Testcase: test took 0.002 sec
    [junit] Testsuite: org.apache.ode.bpel.engine.InstanceLockManagerTest
    [junit] Tests run: 3, Failures: 0, Errors: 0, Time elapsed: 0.536 sec
    [junit] Testcase: testExclusion took 0.005 sec
    [junit] Testcase: testWakeUpQueue took 0.503 sec
    [junit] Testcase: testDistinctness took 0.001 sec
    [junit] Testsuite: org.apache.ode.bpel.engine.MessageTest
    [junit] Tests run: 1, Failures: 0, Errors: 0, Time elapsed: 0.011 sec
    [junit] Testcase: testSetHeaderPart took 0.006 sec
    [junit] Testsuite: org.apache.ode.bpel.engine.MyRoleMessageExchangeImplTest
    [junit] Tests run: 2, Failures: 0, Errors: 0, Time elapsed: 0.162 sec
    [junit] Testcase: testResponseTimeout took 0.154 sec
    [junit] Testcase: testResponseReceived took 0.003 sec
    [junit] Testsuite: org.apache.ode.bpel.engine.cron.CronSchedulerTest
    [junit] Tests run: 1, Failures: 0, Errors: 0, Time elapsed: 0.039 sec
    [junit] Testcase: testNull took 0.034 sec
    [junit] Testsuite: org.apache.ode.bpel.extvar.jdbc.JdbcExternalVariableEngineTest
    [junit] Tests run: 5, Failures: 0, Errors: 0, Time elapsed: 0.534 sec
    [junit] ------------- Standard Output ---------------
    [junit] <?xml version="1.0" encoding="UTF-8"?>
    [junit] <foobar xmlns="foo"><id1>hqejbhcnphracps4jll0ge</id1><id2>hqejbhcnphracps4jll0gf</id2></foobar>
    [junit] ------------- ---------------- ---------------
    [junit] Testcase: testRead took 0.366 sec
    [junit] Testcase: testInitWriteValue took 0.055 sec
    [junit] Testcase: testConfigurationParsing took 0.017 sec
    [junit] Testcase: testConfigure took 0.046 sec
    [junit] Testcase: testWriteUpdate took 0.044 sec
    [junit] Testsuite: org.apache.ode.bpel.runtime.ActivityRecoveryTest
    [junit] Tests run: 10, Failures: 0, Errors: 1, Time elapsed: 51.843 sec
    [junit] Testcase: testFailureWithFaultAction took 7.144 sec
    [junit] Testcase: testFailureHandlingInheritence took 1.323 sec
    [junit] Testcase: testImmediateFailure took 28.811 sec
    [junit] 	Caused an ERROR
    [junit] No failures info, which are required
    [junit] java.lang.AssertionError: No failures info, which are required
    [junit] 	at org.apache.ode.bpel.runtime.ActivityRecoveryTest.assertRecovery(ActivityRecoveryTest.java:441)
    [junit] 	at org.apache.ode.bpel.runtime.ActivityRecoveryTest.testImmediateFailure(ActivityRecoveryTest.java:187)
    [junit] Testcase: testFailureWithCancelAction took 2.527 sec
    [junit] Testcase: testInvokeSucceeds took 0.889 sec
    [junit] Testcase: testInstanceSummary took 7.086 sec
    [junit] Testcase: testImmediateFailureAndFault2 took 0.689 sec
    [junit] Testcase: testImmediateFailureAndFault took 0.686 sec
    [junit] Testcase: testFailureWithManualRecovery took 1.914 sec
    [junit] Testcase: testFailureWithRecoveryAfterRetry took 0.753 sec
    [junit] TEST org.apache.ode.bpel.runtime.ActivityRecoveryTest FAILED
    [junit] Testsuite: org.apache.ode.bpel.runtime.CoreBpelTest
    [junit] Tests run: 9, Failures: 0, Errors: 0, Time elapsed: 0.22 sec
    [junit] Testcase: testOneElementSequence took 0.002 sec
    [junit] Testcase: testFaultHandling took 0.003 sec
    [junit] Testcase: testThrow took 0.002 sec
    [junit] Testcase: testTwoElementFlow took 0.004 sec
    [junit] Testcase: testEmptyFlow took 0.001 sec
    [junit] Testcase: testSingleElementFlow took 0.002 sec
    [junit] Testcase: testFlowTermination took 0.007 sec
    [junit] Testcase: testTwoElementSequence took 0.002 sec
    [junit] Testcase: testEmptyProcess took 0.001 sec
    [junit] Testsuite: org.apache.ode.bpel.runtime.ProcessManagementTest
    [junit] Tests run: 3, Failures: 0, Errors: 0, Time elapsed: 7.644 sec
    [junit] Testcase: testFilterProcessesByName took 2.652 sec
    [junit] Testcase: testListProcessesOrder took 2.517 sec
    [junit] Testcase: testListProcessCustom took 2.471 sec
    [junit] Tests FAILED
The following tests failed:
Buildr aborted!
RuntimeError : Tests failed!

(See full trace by running task with --trace)
Build step 'Execute shell' marked build as failure
Recording fingerprints
Archiving artifacts
Recording test results
TestNG Reports Processing: START
Looking for TestNG results report in workspace using pattern: **/reports/testng/testng-results.xml
Did not find any matching files.

View raw message