oltu-dev mailing list archives

Site index · List index
Message view « Date » · « Thread »
Top « Date » · « Thread »
From Apache Jenkins Server <jenk...@builds.apache.org>
Subject Build failed in Jenkins: Oltu-OAuth-2.0 #179
Date Thu, 26 Jun 2014 09:13:09 GMT
See <https://builds.apache.org/job/Oltu-OAuth-2.0/179/changes>

Changes:

[simonetripodi] OLTU-153 - Parent POM should have URL of user mailing list archive

Applied patch provided by Charles Simpson

------------------------------------------
[...truncated 18 lines...]
[INFO] Error stacktraces are turned on.
[INFO] Scanning for projects...
[WARNING] 
[WARNING] Some problems were encountered while building the effective model for org.apache.oltu.oauth2:org.apache.oltu.oauth2.parent:pom:1.0.1-SNAPSHOT
[WARNING] 'parent.relativePath' of POM org.apache.oltu:org.apache.oltu.parent:3-SNAPSHOT (<https://builds.apache.org/job/Oltu-OAuth-2.0/ws/trunk\parent\pom.xml)>
points at org.apache.oltu:org.apache.oltu.reactor instead of org.apache:apache, please verify
your project structure @ org.apache.oltu:org.apache.oltu.parent:3-SNAPSHOT, <https://builds.apache.org/job/Oltu-OAuth-2.0/ws/trunk\parent\pom.xml,>
line 21, column 11
[WARNING] 
[WARNING] It is highly recommended to fix these problems because they threaten the stability
of your build.
[WARNING] 
[WARNING] For this reason, future Maven versions might no longer support building such malformed
projects.
[WARNING] 
[INFO] ------------------------------------------------------------------------
[INFO] Reactor Build Order:
[INFO] 
[INFO] Apache Oltu - OAuth 2.0
[INFO] Apache Oltu - OAuth 2.0 - Common
[INFO] Apache Oltu - OAuth 2.0 - Client
[INFO] Apache Oltu - OAuth 2.0 - HttpClient
[INFO] Apache Oltu - OAuth 2.0 - Dynamic Registration Common
[INFO] Apache Oltu - OAuth 2.0 - Dynamic Registration Client
[INFO] Apache Oltu - OAuth 2.0 - Authorization Server
[INFO] Apache Oltu - OAuth 2.0 - Resource Server
[INFO] Apache Oltu - OAuth 2.0 - Resource Server Filter
[INFO] Apache Oltu - OAuth 2.0 - Test Utils
[INFO] Apache Oltu - OAuth 2.0 - Dynamic Registration Server
[INFO] Apache Oltu - OAuth 2.0 - Integration Tests
[INFO] Apache Oltu - OAuth 2.0 - JWT
[INFO]                                                                         
[INFO] ------------------------------------------------------------------------
[INFO] Building Apache Oltu - OAuth 2.0 1.0.1-SNAPSHOT
[INFO] ------------------------------------------------------------------------
[INFO] 
[INFO] --- maven-clean-plugin:2.5:clean (default-clean) @ org.apache.oltu.oauth2.parent ---
[INFO] Deleting <https://builds.apache.org/job/Oltu-OAuth-2.0/ws/trunk\oauth-2.0\target>
[INFO] 
[INFO] --- maven-enforcer-plugin:1.3.1:enforce (enforce-java) @ org.apache.oltu.oauth2.parent
---
[INFO] 
[INFO] --- buildnumber-maven-plugin:1.2:create (default) @ org.apache.oltu.oauth2.parent ---
[INFO] Checking for local modifications: skipped.
[INFO] Updating project files from SCM: skipped.
[INFO] Executing: cmd.exe /X /C "svn --non-interactive info"
[INFO] Working directory: <https://builds.apache.org/job/Oltu-OAuth-2.0/ws/trunk\oauth-2.0>
[INFO] Storing buildNumber: 1605370 at timestamp: 1403773914097
[INFO] Executing: cmd.exe /X /C "svn --non-interactive info"
[INFO] Working directory: <https://builds.apache.org/job/Oltu-OAuth-2.0/ws/trunk\oauth-2.0>
[INFO] Storing buildScmBranch: trunk
[INFO] 
[INFO] --- maven-remote-resources-plugin:1.2.1:process (default) @ org.apache.oltu.oauth2.parent
---
[INFO] 
[INFO] --- maven-bundle-plugin:2.3.7:manifest (bundle-manifest) @ org.apache.oltu.oauth2.parent
---
[WARNING] Ignoring project type pom - supportedProjectTypes = [jar, bundle]
[INFO] 
[INFO] --- maven-site-plugin:3.0:attach-descriptor (attach-descriptor) @ org.apache.oltu.oauth2.parent
---
[INFO] 
[INFO] --- maven-install-plugin:2.5.1:install (default-install) @ org.apache.oltu.oauth2.parent
---
[INFO] Installing <https://builds.apache.org/job/Oltu-OAuth-2.0/ws/trunk\oauth-2.0\pom.xml>
to <https://builds.apache.org/job/Oltu-OAuth-2.0/ws/.repository\org\apache\oltu\oauth2\org.apache.oltu.oauth2.parent\1.0.1-SNAPSHOT\org.apache.oltu.oauth2.parent-1.0.1-SNAPSHOT.pom>
[INFO] 
[INFO] --- maven-deploy-plugin:2.8.1:deploy (default-deploy) @ org.apache.oltu.oauth2.parent
---
Downloading: https://repository.apache.org/content/repositories/snapshots/org/apache/oltu/oauth2/org.apache.oltu.oauth2.parent/1.0.1-SNAPSHOT/maven-metadata.xml
Downloaded: https://repository.apache.org/content/repositories/snapshots/org/apache/oltu/oauth2/org.apache.oltu.oauth2.parent/1.0.1-SNAPSHOT/maven-metadata.xml
(630 B at 0.8 KB/sec)
Uploading: https://repository.apache.org/content/repositories/snapshots/org/apache/oltu/oauth2/org.apache.oltu.oauth2.parent/1.0.1-SNAPSHOT/org.apache.oltu.oauth2.parent-1.0.1-20140626.091212-19.pom
[INFO] ------------------------------------------------------------------------
[INFO] Reactor Summary:
[INFO] 
[INFO] Apache Oltu - OAuth 2.0 ........................... FAILURE [32.737s]
[INFO] Apache Oltu - OAuth 2.0 - Common .................. SKIPPED
[INFO] Apache Oltu - OAuth 2.0 - Client .................. SKIPPED
[INFO] Apache Oltu - OAuth 2.0 - HttpClient .............. SKIPPED
[INFO] Apache Oltu - OAuth 2.0 - Dynamic Registration Common  SKIPPED
[INFO] Apache Oltu - OAuth 2.0 - Dynamic Registration Client  SKIPPED
[INFO] Apache Oltu - OAuth 2.0 - Authorization Server .... SKIPPED
[INFO] Apache Oltu - OAuth 2.0 - Resource Server ......... SKIPPED
[INFO] Apache Oltu - OAuth 2.0 - Resource Server Filter .. SKIPPED
[INFO] Apache Oltu - OAuth 2.0 - Test Utils .............. SKIPPED
[INFO] Apache Oltu - OAuth 2.0 - Dynamic Registration Server  SKIPPED
[INFO] Apache Oltu - OAuth 2.0 - Integration Tests ....... SKIPPED
[INFO] Apache Oltu - OAuth 2.0 - JWT ..................... SKIPPED
[INFO] ------------------------------------------------------------------------
[INFO] BUILD FAILURE
[INFO] ------------------------------------------------------------------------
[INFO] Total time: 34.624s
[INFO] Finished at: Thu Jun 26 02:12:13 PDT 2014
[INFO] Final Memory: 18M/61M
[INFO] ------------------------------------------------------------------------
Waiting for Jenkins to finish collecting data
[ERROR] Failed to execute goal org.apache.maven.plugins:maven-deploy-plugin:2.8.1:deploy (default-deploy)
on project org.apache.oltu.oauth2.parent: Failed to deploy artifacts: Could not transfer artifact
org.apache.oltu.oauth2:org.apache.oltu.oauth2.parent:pom:1.0.1-20140626.091212-19 from/to
apache.snapshots.https (https://repository.apache.org/content/repositories/snapshots): Failed
to transfer file: https://repository.apache.org/content/repositories/snapshots/org/apache/oltu/oauth2/org.apache.oltu.oauth2.parent/1.0.1-SNAPSHOT/org.apache.oltu.oauth2.parent-1.0.1-20140626.091212-19.pom.
Return code is: 401 -> [Help 1]
org.apache.maven.lifecycle.LifecycleExecutionException: Failed to execute goal org.apache.maven.plugins:maven-deploy-plugin:2.8.1:deploy
(default-deploy) on project org.apache.oltu.oauth2.parent: Failed to deploy artifacts: Could
not transfer artifact org.apache.oltu.oauth2:org.apache.oltu.oauth2.parent:pom:1.0.1-20140626.091212-19
from/to apache.snapshots.https (https://repository.apache.org/content/repositories/snapshots):
Failed to transfer file: https://repository.apache.org/content/repositories/snapshots/org/apache/oltu/oauth2/org.apache.oltu.oauth2.parent/1.0.1-SNAPSHOT/org.apache.oltu.oauth2.parent-1.0.1-20140626.091212-19.pom.
Return code is: 401
	at org.apache.maven.lifecycle.internal.MojoExecutor.execute(MojoExecutor.java:217)
	at org.apache.maven.lifecycle.internal.MojoExecutor.execute(MojoExecutor.java:153)
	at org.apache.maven.lifecycle.internal.MojoExecutor.execute(MojoExecutor.java:145)
	at org.apache.maven.lifecycle.internal.LifecycleModuleBuilder.buildProject(LifecycleModuleBuilder.java:84)
	at org.apache.maven.lifecycle.internal.LifecycleModuleBuilder.buildProject(LifecycleModuleBuilder.java:59)
	at org.apache.maven.lifecycle.internal.LifecycleStarter.singleThreadedBuild(LifecycleStarter.java:183)
	at org.apache.maven.lifecycle.internal.LifecycleStarter.execute(LifecycleStarter.java:161)
	at org.apache.maven.DefaultMaven.doExecute(DefaultMaven.java:319)
	at org.apache.maven.DefaultMaven.execute(DefaultMaven.java:156)
	at org.jvnet.hudson.maven3.launcher.Maven3Launcher.main(Maven3Launcher.java:117)
	at sun.reflect.NativeMethodAccessorImpl.invoke0(Native Method)
	at sun.reflect.NativeMethodAccessorImpl.invoke(NativeMethodAccessorImpl.java:39)
	at sun.reflect.DelegatingMethodAccessorImpl.invoke(DelegatingMethodAccessorImpl.java:25)
	at java.lang.reflect.Method.invoke(Method.java:597)
	at org.codehaus.plexus.classworlds.launcher.Launcher.launchStandard(Launcher.java:329)
	at org.codehaus.plexus.classworlds.launcher.Launcher.launch(Launcher.java:239)
	at org.jvnet.hudson.maven3.agent.Maven3Main.launch(Maven3Main.java:178)
	at sun.reflect.NativeMethodAccessorImpl.invoke0(Native Method)
	at sun.reflect.NativeMethodAccessorImpl.invoke(NativeMethodAccessorImpl.java:39)
	at sun.reflect.DelegatingMethodAccessorImpl.invoke(DelegatingMethodAccessorImpl.java:25)
	at java.lang.reflect.Method.invoke(Method.java:597)
	at hudson.maven.Maven3Builder.call(Maven3Builder.java:134)
	at hudson.maven.Maven3Builder.call(Maven3Builder.java:69)
	at hudson.remoting.UserRequest.perform(UserRequest.java:118)
	at hudson.remoting.UserRequest.perform(UserRequest.java:48)
	at hudson.remoting.Request$2.run(Request.java:328)
	at hudson.remoting.InterceptingExecutorService$1.call(InterceptingExecutorService.java:72)
	at java.util.concurrent.FutureTask$Sync.innerRun(FutureTask.java:303)
	at java.util.concurrent.FutureTask.run(FutureTask.java:138)
	at java.util.concurrent.ThreadPoolExecutor$Worker.runTask(ThreadPoolExecutor.java:886)
	at java.util.concurrent.ThreadPoolExecutor$Worker.run(ThreadPoolExecutor.java:908)
	at java.lang.Thread.run(Thread.java:662)
Caused by: org.apache.maven.plugin.MojoExecutionException: Failed to deploy artifacts: Could
not transfer artifact org.apache.oltu.oauth2:org.apache.oltu.oauth2.parent:pom:1.0.1-20140626.091212-19
from/to apache.snapshots.https (https://repository.apache.org/content/repositories/snapshots):
Failed to transfer file: https://repository.apache.org/content/repositories/snapshots/org/apache/oltu/oauth2/org.apache.oltu.oauth2.parent/1.0.1-SNAPSHOT/org.apache.oltu.oauth2.parent-1.0.1-20140626.091212-19.pom.
Return code is: 401
	at org.apache.maven.plugin.deploy.DeployMojo.deployProject(DeployMojo.java:282)
	at org.apache.maven.plugin.deploy.DeployMojo.execute(DeployMojo.java:169)
	at org.apache.maven.plugin.DefaultBuildPluginManager.executeMojo(DefaultBuildPluginManager.java:101)
	at org.apache.maven.lifecycle.internal.MojoExecutor.execute(MojoExecutor.java:209)
	... 31 more
Caused by: org.apache.maven.artifact.deployer.ArtifactDeploymentException: Failed to deploy
artifacts: Could not transfer artifact org.apache.oltu.oauth2:org.apache.oltu.oauth2.parent:pom:1.0.1-20140626.091212-19
from/to apache.snapshots.https (https://repository.apache.org/content/repositories/snapshots):
Failed to transfer file: https://repository.apache.org/content/repositories/snapshots/org/apache/oltu/oauth2/org.apache.oltu.oauth2.parent/1.0.1-SNAPSHOT/org.apache.oltu.oauth2.parent-1.0.1-20140626.091212-19.pom.
Return code is: 401
	at org.apache.maven.artifact.deployer.DefaultArtifactDeployer.deploy(DefaultArtifactDeployer.java:141)
	at org.apache.maven.plugin.deploy.AbstractDeployMojo.deploy(AbstractDeployMojo.java:171)
	at org.apache.maven.plugin.deploy.DeployMojo.deployProject(DeployMojo.java:240)
	... 34 more
Caused by: org.sonatype.aether.deployment.DeploymentException: Failed to deploy artifacts:
Could not transfer artifact org.apache.oltu.oauth2:org.apache.oltu.oauth2.parent:pom:1.0.1-20140626.091212-19
from/to apache.snapshots.https (https://repository.apache.org/content/repositories/snapshots):
Failed to transfer file: https://repository.apache.org/content/repositories/snapshots/org/apache/oltu/oauth2/org.apache.oltu.oauth2.parent/1.0.1-SNAPSHOT/org.apache.oltu.oauth2.parent-1.0.1-20140626.091212-19.pom.
Return code is: 401
	at org.sonatype.aether.impl.internal.DefaultDeployer.deploy(DefaultDeployer.java:284)
	at org.sonatype.aether.impl.internal.DefaultDeployer.deploy(DefaultDeployer.java:215)
	at org.sonatype.aether.impl.internal.DefaultRepositorySystem.deploy(DefaultRepositorySystem.java:480)
	at org.apache.maven.artifact.deployer.DefaultArtifactDeployer.deploy(DefaultArtifactDeployer.java:137)
	... 36 more
Caused by: org.sonatype.aether.transfer.ArtifactTransferException: Could not transfer artifact
org.apache.oltu.oauth2:org.apache.oltu.oauth2.parent:pom:1.0.1-20140626.091212-19 from/to
apache.snapshots.https (https://repository.apache.org/content/repositories/snapshots): Failed
to transfer file: https://repository.apache.org/content/repositories/snapshots/org/apache/oltu/oauth2/org.apache.oltu.oauth2.parent/1.0.1-SNAPSHOT/org.apache.oltu.oauth2.parent-1.0.1-20140626.091212-19.pom.
Return code is: 401
	at org.sonatype.aether.connector.wagon.WagonRepositoryConnector$4.wrap(WagonRepositoryConnector.java:949)
	at org.sonatype.aether.connector.wagon.WagonRepositoryConnector$4.wrap(WagonRepositoryConnector.java:940)
	at org.sonatype.aether.connector.wagon.WagonRepositoryConnector$PutTask.flush(WagonRepositoryConnector.java:864)
	at org.sonatype.aether.connector.wagon.WagonRepositoryConnector.put(WagonRepositoryConnector.java:466)
	at org.sonatype.aether.impl.internal.DefaultDeployer.deploy(DefaultDeployer.java:278)
	... 39 more
Caused by: org.apache.maven.wagon.TransferFailedException: Failed to transfer file: https://repository.apache.org/content/repositories/snapshots/org/apache/oltu/oauth2/org.apache.oltu.oauth2.parent/1.0.1-SNAPSHOT/org.apache.oltu.oauth2.parent-1.0.1-20140626.091212-19.pom.
Return code is: 401
	at org.apache.maven.wagon.providers.http.LightweightHttpWagon.finishPutTransfer(LightweightHttpWagon.java:205)
	at org.apache.maven.wagon.AbstractWagon.putTransfer(AbstractWagon.java:413)
	at org.apache.maven.wagon.AbstractWagon.transfer(AbstractWagon.java:392)
	at org.apache.maven.wagon.AbstractWagon.putTransfer(AbstractWagon.java:365)
	at org.apache.maven.wagon.StreamWagon.put(StreamWagon.java:163)
	at org.sonatype.aether.connector.wagon.WagonRepositoryConnector$PutTask.run(WagonRepositoryConnector.java:825)
	at org.sonatype.aether.connector.wagon.WagonRepositoryConnector.put(WagonRepositoryConnector.java:465)
	... 40 more
[ERROR] 
[ERROR] Re-run Maven using the -X switch to enable full debug logging.
[ERROR] 
[ERROR] For more information about the errors and possible solutions, please read the following
articles:
[ERROR] [Help 1] http://cwiki.apache.org/confluence/display/MAVEN/MojoExecutionException
[JENKINS] Archiving F:\jenkins\jenkins-slave\workspace\Oltu-OAuth-2.0\trunk\oauth-2.0\integration-tests\pom.xml
to org.apache.oltu.oauth2/org.apache.oltu.oauth2.integration-tests/1.0.1-SNAPSHOT/org.apache.oltu.oauth2.integration-tests-1.0.1-SNAPSHOT.pom
Sending artifact delta relative to Oltu-OAuth-2.0 » Apache Oltu - OAuth 2.0 - Integration
Tests #178
Archived 1 artifacts
Archive block size is 32768
Received 0 blocks and 5073 bytes
Compression is 0.0%
Took 0.11 sec
[JENKINS] Archiving F:\jenkins\jenkins-slave\workspace\Oltu-OAuth-2.0\trunk\oauth-2.0\authzserver\pom.xml
to org.apache.oltu.oauth2/org.apache.oltu.oauth2.authzserver/1.0.1-SNAPSHOT/org.apache.oltu.oauth2.authzserver-1.0.1-SNAPSHOT.pom
Sending artifact delta relative to Oltu-OAuth-2.0 » Apache Oltu - OAuth 2.0 - Authorization
Server #178
Archived 1 artifacts
Archive block size is 32768
Received 0 blocks and 3254 bytes
Compression is 0.0%
Took 0.5 sec
[JENKINS] Archiving F:\jenkins\jenkins-slave\workspace\Oltu-OAuth-2.0\trunk\oauth-2.0\jwt\pom.xml
to org.apache.oltu.oauth2/org.apache.oltu.oauth2.jwt/1.0.1-SNAPSHOT/org.apache.oltu.oauth2.jwt-1.0.1-SNAPSHOT.pom
Sending artifact delta relative to Oltu-OAuth-2.0 » Apache Oltu - OAuth 2.0 - JWT #178
Archived 1 artifacts
Archive block size is 32768
Received 0 blocks and 2209 bytes
Compression is 0.0%
Took 49 ms
[JENKINS] Archiving F:\jenkins\jenkins-slave\workspace\Oltu-OAuth-2.0\trunk\oauth-2.0\resourceserver-filter\pom.xml
to org.apache.oltu.oauth2/org.apache.oltu.oauth2.resourceserver-filter/1.0.1-SNAPSHOT/org.apache.oltu.oauth2.resourceserver-filter-1.0.1-SNAPSHOT.pom
Sending artifact delta relative to Oltu-OAuth-2.0 » Apache Oltu - OAuth 2.0 - Resource Server
Filter #178
Archived 1 artifacts
Archive block size is 32768
Received 0 blocks and 2982 bytes
Compression is 0.0%
Took 0.11 sec
[JENKINS] Archiving F:\jenkins\jenkins-slave\workspace\Oltu-OAuth-2.0\trunk\oauth-2.0\dynamicreg-client\pom.xml
to org.apache.oltu.oauth2/org.apache.oltu.oauth2.dynamicreg.client/1.0.1-SNAPSHOT/org.apache.oltu.oauth2.dynamicreg.client-1.0.1-SNAPSHOT.pom
Sending artifact delta relative to Oltu-OAuth-2.0 » Apache Oltu - OAuth 2.0 - Dynamic Registration
Client #178
Archived 1 artifacts
Archive block size is 32768
Received 0 blocks and 3173 bytes
Compression is 0.0%
Took 96 ms
[JENKINS] Archiving F:\jenkins\jenkins-slave\workspace\Oltu-OAuth-2.0\trunk\oauth-2.0\httpclient4\pom.xml
to org.apache.oltu.oauth2/org.apache.oltu.oauth2.httpclient4/1.0.1-SNAPSHOT/org.apache.oltu.oauth2.httpclient4-1.0.1-SNAPSHOT.pom
Sending artifact delta relative to Oltu-OAuth-2.0 » Apache Oltu - OAuth 2.0 - HttpClient
#178
Archived 1 artifacts
Archive block size is 32768
Received 0 blocks and 2860 bytes
Compression is 0.0%
Took 0.11 sec
[JENKINS] Archiving F:\jenkins\jenkins-slave\workspace\Oltu-OAuth-2.0\trunk\oauth-2.0\dynamicreg-common\pom.xml
to org.apache.oltu.oauth2/org.apache.oltu.oauth2.dynamicreg.common/1.0.1-SNAPSHOT/org.apache.oltu.oauth2.dynamicreg.common-1.0.1-SNAPSHOT.pom
Sending artifact delta relative to Oltu-OAuth-2.0 » Apache Oltu - OAuth 2.0 - Dynamic Registration
Common #178
Archived 1 artifacts
Archive block size is 32768
Received 0 blocks and 2104 bytes
Compression is 0.0%
Took 17 ms
[JENKINS] Archiving F:\jenkins\jenkins-slave\workspace\Oltu-OAuth-2.0\trunk\oauth-2.0\client\pom.xml
to org.apache.oltu.oauth2/org.apache.oltu.oauth2.client/1.0.1-SNAPSHOT/org.apache.oltu.oauth2.client-1.0.1-SNAPSHOT.pom
Sending artifact delta relative to Oltu-OAuth-2.0 » Apache Oltu - OAuth 2.0 - Client #178
Archived 1 artifacts
Archive block size is 32768
Received 0 blocks and 3056 bytes
Compression is 0.0%
Took 0.36 sec
[JENKINS] Archiving F:\jenkins\jenkins-slave\workspace\Oltu-OAuth-2.0\trunk\oauth-2.0\resourceserver\pom.xml
to org.apache.oltu.oauth2/org.apache.oltu.oauth2.resourceserver/1.0.1-SNAPSHOT/org.apache.oltu.oauth2.resourceserver-1.0.1-SNAPSHOT.pom
Sending artifact delta relative to Oltu-OAuth-2.0 » Apache Oltu - OAuth 2.0 - Resource Server
#178
Archived 1 artifacts
Archive block size is 32768
Received 0 blocks and 3034 bytes
Compression is 0.0%
Took 0.13 sec
[JENKINS] Archiving F:\jenkins\jenkins-slave\workspace\Oltu-OAuth-2.0\trunk\oauth-2.0\dynamicreg-server\pom.xml
to org.apache.oltu.oauth2/org.apache.oltu.oauth2.dynamicreg.server/1.0.1-SNAPSHOT/org.apache.oltu.oauth2.dynamicreg.server-1.0.1-SNAPSHOT.pom
Sending artifact delta relative to Oltu-OAuth-2.0 » Apache Oltu - OAuth 2.0 - Dynamic Registration
Server #178
Archived 1 artifacts
Archive block size is 32768
Received 0 blocks and 3515 bytes
Compression is 0.0%
Took 0.1 sec
[JENKINS] Archiving <https://builds.apache.org/job/Oltu-OAuth-2.0/ws/trunk\oauth-2.0\pom.xml>
to org.apache.oltu.oauth2/org.apache.oltu.oauth2.parent/1.0.1-SNAPSHOT/org.apache.oltu.oauth2.parent-1.0.1-SNAPSHOT.pom
Sending artifact delta relative to Oltu-OAuth-2.0 » Apache Oltu - OAuth 2.0 #178
Archived 1 artifacts
Archive block size is 32768
Received 0 blocks and 5768 bytes
Compression is 0.0%
Took 0.15 sec
[JENKINS] Archiving F:\jenkins\jenkins-slave\workspace\Oltu-OAuth-2.0\trunk\oauth-2.0\test-utils\pom.xml
to org.apache.oltu.oauth2/org.apache.oltu.oauth2.test-utils/1.0.1-SNAPSHOT/org.apache.oltu.oauth2.test-utils-1.0.1-SNAPSHOT.pom
Sending artifact delta relative to Oltu-OAuth-2.0 » Apache Oltu - OAuth 2.0 - Test Utils
#178
Archived 1 artifacts
Archive block size is 32768
Received 0 blocks and 2004 bytes
Compression is 0.0%
Took 78 ms
[JENKINS] Archiving F:\jenkins\jenkins-slave\workspace\Oltu-OAuth-2.0\trunk\oauth-2.0\common\pom.xml
to org.apache.oltu.oauth2/org.apache.oltu.oauth2.common/1.0.1-SNAPSHOT/org.apache.oltu.oauth2.common-1.0.1-SNAPSHOT.pom
Sending artifact delta relative to Oltu-OAuth-2.0 » Apache Oltu - OAuth 2.0 - Common #178
Archived 1 artifacts
Archive block size is 32768
Received 0 blocks and 2992 bytes
Compression is 0.0%
Took 56 ms
Sending e-mails to: dev@oltu.apache.org
channel stopped

Mime
View raw message