oltu-dev mailing list archives

Site index · List index
Message view « Date » · « Thread »
Top « Date » · « Thread »
From Apache Jenkins Server <jenk...@builds.apache.org>
Subject Build failed in Jenkins: Oltu-OAuth-2.0 #177
Date Wed, 25 Jun 2014 13:13:19 GMT
See <https://builds.apache.org/job/Oltu-OAuth-2.0/177/changes>

Changes:

[simonetripodi] OLTU-105 - Android 4.1 expects "realm" as first parameter in www-authenticate
header

applied patch kindly provided by Dominik Schuermann and reviewed by Charles Simpson

------------------------------------------
[...truncated 1046 lines...]
Downloading: http://repo1.maven.org/maven2/org/apache/maven/doxia/doxia-module-apt/1.2/doxia-module-apt-1.2.jar
Downloaded: http://repo1.maven.org/maven2/commons-codec/commons-codec/1.3/commons-codec-1.3.jar
(46 KB at 577.6 KB/sec)
Downloading: http://repo1.maven.org/maven2/org/apache/maven/doxia/doxia-module-xdoc/1.2/doxia-module-xdoc-1.2.jar
Downloaded: http://repo1.maven.org/maven2/org/apache/maven/doxia/doxia-module-xhtml/1.2/doxia-module-xhtml-1.2.jar
(15 KB at 114.3 KB/sec)
Downloading: http://repo1.maven.org/maven2/org/apache/maven/doxia/doxia-module-fml/1.2/doxia-module-fml-1.2.jar
Downloaded: http://repo1.maven.org/maven2/org/apache/maven/doxia/doxia-module-apt/1.2/doxia-module-apt-1.2.jar
(51 KB at 415.7 KB/sec)
Downloading: http://repo1.maven.org/maven2/org/apache/maven/doxia/doxia-decoration-model/1.2/doxia-decoration-model-1.2.jar
Downloaded: http://repo1.maven.org/maven2/org/apache/httpcomponents/httpcore/4.0.1/httpcore-4.0.1.jar
(169 KB at 734.1 KB/sec)
Downloading: http://repo1.maven.org/maven2/org/apache/maven/doxia/doxia-site-renderer/1.2/doxia-site-renderer-1.2.jar
Downloaded: http://repo1.maven.org/maven2/org/apache/maven/doxia/doxia-module-xdoc/1.2/doxia-module-xdoc-1.2.jar
(36 KB at 295.3 KB/sec)
Downloading: http://repo1.maven.org/maven2/commons-collections/commons-collections/3.2.1/commons-collections-3.2.1.jar
Downloaded: http://repo1.maven.org/maven2/org/apache/maven/doxia/doxia-module-fml/1.2/doxia-module-fml-1.2.jar
(37 KB at 506.4 KB/sec)
Downloading: http://repo1.maven.org/maven2/org/apache/maven/shared/maven-doxia-tools/1.4/maven-doxia-tools-1.4.jar
Downloaded: http://repo1.maven.org/maven2/org/apache/maven/doxia/doxia-decoration-model/1.2/doxia-decoration-model-1.2.jar
(59 KB at 799.1 KB/sec)
Downloading: http://repo1.maven.org/maven2/org/codehaus/plexus/plexus-i18n/1.0-beta-7/plexus-i18n-1.0-beta-7.jar
Downloaded: http://repo1.maven.org/maven2/org/apache/maven/doxia/doxia-site-renderer/1.2/doxia-site-renderer-1.2.jar
(51 KB at 706.5 KB/sec)
Downloading: http://repo1.maven.org/maven2/org/codehaus/plexus/plexus-utils/1.5.10/plexus-utils-1.5.10.jar
Downloaded: http://repo1.maven.org/maven2/xerces/xercesImpl/2.9.1/xercesImpl-2.9.1.jar (1201
KB at 3209.4 KB/sec)
Downloading: http://repo1.maven.org/maven2/org/mortbay/jetty/jetty/6.1.25/jetty-6.1.25.jar
Downloaded: http://repo1.maven.org/maven2/org/apache/maven/shared/maven-doxia-tools/1.4/maven-doxia-tools-1.4.jar
(45 KB at 612.6 KB/sec)
Downloading: http://repo1.maven.org/maven2/org/mortbay/jetty/servlet-api/2.5-20081211/servlet-api-2.5-20081211.jar
Downloaded: http://repo1.maven.org/maven2/org/codehaus/plexus/plexus-i18n/1.0-beta-7/plexus-i18n-1.0-beta-7.jar
(11 KB at 128.3 KB/sec)
Downloading: http://repo1.maven.org/maven2/org/mortbay/jetty/jetty-util/6.1.25/jetty-util-6.1.25.jar
Downloaded: http://repo1.maven.org/maven2/org/mortbay/jetty/jetty/6.1.25/jetty-6.1.25.jar
(526 KB at 4419.8 KB/sec)
Downloading: http://repo1.maven.org/maven2/commons-lang/commons-lang/2.5/commons-lang-2.5.jar
Downloaded: http://repo1.maven.org/maven2/commons-collections/commons-collections/3.2.1/commons-collections-3.2.1.jar
(562 KB at 2852.3 KB/sec)
Downloading: http://repo1.maven.org/maven2/commons-io/commons-io/1.4/commons-io-1.4.jar
Downloaded: http://repo1.maven.org/maven2/org/codehaus/plexus/plexus-utils/1.5.10/plexus-utils-1.5.10.jar
(274 KB at 1602.0 KB/sec)
Downloaded: http://repo1.maven.org/maven2/org/mortbay/jetty/servlet-api/2.5-20081211/servlet-api-2.5-20081211.jar
(131 KB at 1119.6 KB/sec)
Downloaded: http://repo1.maven.org/maven2/org/mortbay/jetty/jetty-util/6.1.25/jetty-util-6.1.25.jar
(174 KB at 1602.1 KB/sec)
Downloaded: http://repo1.maven.org/maven2/commons-io/commons-io/1.4/commons-io-1.4.jar (107
KB at 1439.0 KB/sec)
Downloaded: http://repo1.maven.org/maven2/commons-lang/commons-lang/2.5/commons-lang-2.5.jar
(273 KB at 2019.6 KB/sec)
[INFO] 
[INFO] --- maven-install-plugin:2.5.1:install (default-install) @ org.apache.oltu.oauth2.parent
---
Downloading: http://repo1.maven.org/maven2/commons-codec/commons-codec/1.6/commons-codec-1.6.pom
Downloaded: http://repo1.maven.org/maven2/commons-codec/commons-codec/1.6/commons-codec-1.6.pom
(11 KB at 157.9 KB/sec)
Downloading: http://repo1.maven.org/maven2/org/apache/commons/commons-parent/22/commons-parent-22.pom
Downloaded: http://repo1.maven.org/maven2/org/apache/commons/commons-parent/22/commons-parent-22.pom
(41 KB at 576.6 KB/sec)
Downloading: http://repo1.maven.org/maven2/org/apache/maven/shared/maven-shared-utils/0.4/maven-shared-utils-0.4.pom
Downloaded: http://repo1.maven.org/maven2/org/apache/maven/shared/maven-shared-utils/0.4/maven-shared-utils-0.4.pom
(4 KB at 57.3 KB/sec)
Downloading: http://repo1.maven.org/maven2/com/google/code/findbugs/jsr305/2.0.1/jsr305-2.0.1.pom
Downloaded: http://repo1.maven.org/maven2/com/google/code/findbugs/jsr305/2.0.1/jsr305-2.0.1.pom
(965 B at 12.2 KB/sec)
Downloading: http://repo1.maven.org/maven2/org/codehaus/plexus/plexus-utils/3.0.15/plexus-utils-3.0.15.pom
Downloaded: http://repo1.maven.org/maven2/org/codehaus/plexus/plexus-utils/3.0.15/plexus-utils-3.0.15.pom
(4 KB at 38.4 KB/sec)
Downloading: http://repo1.maven.org/maven2/org/codehaus/plexus/plexus/3.3.1/plexus-3.3.1.pom
Downloaded: http://repo1.maven.org/maven2/org/codehaus/plexus/plexus/3.3.1/plexus-3.3.1.pom
(20 KB at 266.2 KB/sec)
Downloading: http://repo1.maven.org/maven2/commons-codec/commons-codec/1.6/commons-codec-1.6.jar
Downloading: http://repo1.maven.org/maven2/org/apache/maven/shared/maven-shared-utils/0.4/maven-shared-utils-0.4.jar
Downloading: http://repo1.maven.org/maven2/org/codehaus/plexus/plexus-utils/3.0.15/plexus-utils-3.0.15.jar
Downloading: http://repo1.maven.org/maven2/com/google/code/findbugs/jsr305/2.0.1/jsr305-2.0.1.jar
Downloaded: http://repo1.maven.org/maven2/org/apache/maven/shared/maven-shared-utils/0.4/maven-shared-utils-0.4.jar
(152 KB at 1829.0 KB/sec)
Downloaded: http://repo1.maven.org/maven2/com/google/code/findbugs/jsr305/2.0.1/jsr305-2.0.1.jar
(32 KB at 353.6 KB/sec)
Downloaded: http://repo1.maven.org/maven2/org/codehaus/plexus/plexus-utils/3.0.15/plexus-utils-3.0.15.jar
(234 KB at 1666.8 KB/sec)
Downloaded: http://repo1.maven.org/maven2/commons-codec/commons-codec/1.6/commons-codec-1.6.jar
(228 KB at 1284.3 KB/sec)
[INFO] Installing <https://builds.apache.org/job/Oltu-OAuth-2.0/ws/trunk\oauth-2.0\pom.xml>
to <https://builds.apache.org/job/Oltu-OAuth-2.0/ws/.repository\org\apache\oltu\oauth2\org.apache.oltu.oauth2.parent\1.0.1-SNAPSHOT\org.apache.oltu.oauth2.parent-1.0.1-SNAPSHOT.pom>
[INFO] 
[INFO] --- maven-deploy-plugin:2.8.1:deploy (default-deploy) @ org.apache.oltu.oauth2.parent
---
Downloading: https://repository.apache.org/content/repositories/snapshots/org/apache/oltu/oauth2/org.apache.oltu.oauth2.parent/1.0.1-SNAPSHOT/maven-metadata.xml
Downloaded: https://repository.apache.org/content/repositories/snapshots/org/apache/oltu/oauth2/org.apache.oltu.oauth2.parent/1.0.1-SNAPSHOT/maven-metadata.xml
(630 B at 0.3 KB/sec)
Uploading: https://repository.apache.org/content/repositories/snapshots/org/apache/oltu/oauth2/org.apache.oltu.oauth2.parent/1.0.1-SNAPSHOT/org.apache.oltu.oauth2.parent-1.0.1-20140625.131301-17.pom
[INFO] ------------------------------------------------------------------------
[INFO] Reactor Summary:
[INFO] 
[INFO] Apache Oltu - OAuth 2.0 ........................... FAILURE [1:10.842s]
[INFO] Apache Oltu - OAuth 2.0 - Common .................. SKIPPED
[INFO] Apache Oltu - OAuth 2.0 - Client .................. SKIPPED
[INFO] Apache Oltu - OAuth 2.0 - HttpClient .............. SKIPPED
[INFO] Apache Oltu - OAuth 2.0 - Dynamic Registration Common  SKIPPED
[INFO] Apache Oltu - OAuth 2.0 - Dynamic Registration Client  SKIPPED
[INFO] Apache Oltu - OAuth 2.0 - Authorization Server .... SKIPPED
[INFO] Apache Oltu - OAuth 2.0 - Resource Server ......... SKIPPED
[INFO] Apache Oltu - OAuth 2.0 - Resource Server Filter .. SKIPPED
[INFO] Apache Oltu - OAuth 2.0 - Test Utils .............. SKIPPED
[INFO] Apache Oltu - OAuth 2.0 - Dynamic Registration Server  SKIPPED
[INFO] Apache Oltu - OAuth 2.0 - Integration Tests ....... SKIPPED
[INFO] Apache Oltu - OAuth 2.0 - JWT ..................... SKIPPED
[INFO] ------------------------------------------------------------------------
[INFO] BUILD FAILURE
[INFO] ------------------------------------------------------------------------
[INFO] Total time: 1:12.472s
[INFO] Finished at: Wed Jun 25 06:13:03 PDT 2014
[INFO] Final Memory: 18M/61M
[INFO] ------------------------------------------------------------------------
Waiting for Jenkins to finish collecting data
[ERROR] Failed to execute goal org.apache.maven.plugins:maven-deploy-plugin:2.8.1:deploy (default-deploy)
on project org.apache.oltu.oauth2.parent: Failed to deploy artifacts: Could not transfer artifact
org.apache.oltu.oauth2:org.apache.oltu.oauth2.parent:pom:1.0.1-20140625.131301-17 from/to
apache.snapshots.https (https://repository.apache.org/content/repositories/snapshots): Failed
to transfer file: https://repository.apache.org/content/repositories/snapshots/org/apache/oltu/oauth2/org.apache.oltu.oauth2.parent/1.0.1-SNAPSHOT/org.apache.oltu.oauth2.parent-1.0.1-20140625.131301-17.pom.
Return code is: 401 -> [Help 1]
org.apache.maven.lifecycle.LifecycleExecutionException: Failed to execute goal org.apache.maven.plugins:maven-deploy-plugin:2.8.1:deploy
(default-deploy) on project org.apache.oltu.oauth2.parent: Failed to deploy artifacts: Could
not transfer artifact org.apache.oltu.oauth2:org.apache.oltu.oauth2.parent:pom:1.0.1-20140625.131301-17
from/to apache.snapshots.https (https://repository.apache.org/content/repositories/snapshots):
Failed to transfer file: https://repository.apache.org/content/repositories/snapshots/org/apache/oltu/oauth2/org.apache.oltu.oauth2.parent/1.0.1-SNAPSHOT/org.apache.oltu.oauth2.parent-1.0.1-20140625.131301-17.pom.
Return code is: 401
	at org.apache.maven.lifecycle.internal.MojoExecutor.execute(MojoExecutor.java:217)
	at org.apache.maven.lifecycle.internal.MojoExecutor.execute(MojoExecutor.java:153)
	at org.apache.maven.lifecycle.internal.MojoExecutor.execute(MojoExecutor.java:145)
	at org.apache.maven.lifecycle.internal.LifecycleModuleBuilder.buildProject(LifecycleModuleBuilder.java:84)
	at org.apache.maven.lifecycle.internal.LifecycleModuleBuilder.buildProject(LifecycleModuleBuilder.java:59)
	at org.apache.maven.lifecycle.internal.LifecycleStarter.singleThreadedBuild(LifecycleStarter.java:183)
	at org.apache.maven.lifecycle.internal.LifecycleStarter.execute(LifecycleStarter.java:161)
	at org.apache.maven.DefaultMaven.doExecute(DefaultMaven.java:319)
	at org.apache.maven.DefaultMaven.execute(DefaultMaven.java:156)
	at org.jvnet.hudson.maven3.launcher.Maven3Launcher.main(Maven3Launcher.java:117)
	at sun.reflect.NativeMethodAccessorImpl.invoke0(Native Method)
	at sun.reflect.NativeMethodAccessorImpl.invoke(NativeMethodAccessorImpl.java:39)
	at sun.reflect.DelegatingMethodAccessorImpl.invoke(DelegatingMethodAccessorImpl.java:25)
	at java.lang.reflect.Method.invoke(Method.java:597)
	at org.codehaus.plexus.classworlds.launcher.Launcher.launchStandard(Launcher.java:329)
	at org.codehaus.plexus.classworlds.launcher.Launcher.launch(Launcher.java:239)
	at org.jvnet.hudson.maven3.agent.Maven3Main.launch(Maven3Main.java:178)
	at sun.reflect.NativeMethodAccessorImpl.invoke0(Native Method)
	at sun.reflect.NativeMethodAccessorImpl.invoke(NativeMethodAccessorImpl.java:39)
	at sun.reflect.DelegatingMethodAccessorImpl.invoke(DelegatingMethodAccessorImpl.java:25)
	at java.lang.reflect.Method.invoke(Method.java:597)
	at hudson.maven.Maven3Builder.call(Maven3Builder.java:134)
	at hudson.maven.Maven3Builder.call(Maven3Builder.java:69)
	at hudson.remoting.UserRequest.perform(UserRequest.java:118)
	at hudson.remoting.UserRequest.perform(UserRequest.java:48)
	at hudson.remoting.Request$2.run(Request.java:328)
	at hudson.remoting.InterceptingExecutorService$1.call(InterceptingExecutorService.java:72)
	at java.util.concurrent.FutureTask$Sync.innerRun(FutureTask.java:303)
	at java.util.concurrent.FutureTask.run(FutureTask.java:138)
	at java.util.concurrent.ThreadPoolExecutor$Worker.runTask(ThreadPoolExecutor.java:886)
	at java.util.concurrent.ThreadPoolExecutor$Worker.run(ThreadPoolExecutor.java:908)
	at java.lang.Thread.run(Thread.java:662)
Caused by: org.apache.maven.plugin.MojoExecutionException: Failed to deploy artifacts: Could
not transfer artifact org.apache.oltu.oauth2:org.apache.oltu.oauth2.parent:pom:1.0.1-20140625.131301-17
from/to apache.snapshots.https (https://repository.apache.org/content/repositories/snapshots):
Failed to transfer file: https://repository.apache.org/content/repositories/snapshots/org/apache/oltu/oauth2/org.apache.oltu.oauth2.parent/1.0.1-SNAPSHOT/org.apache.oltu.oauth2.parent-1.0.1-20140625.131301-17.pom.
Return code is: 401
	at org.apache.maven.plugin.deploy.DeployMojo.deployProject(DeployMojo.java:282)
	at org.apache.maven.plugin.deploy.DeployMojo.execute(DeployMojo.java:169)
	at org.apache.maven.plugin.DefaultBuildPluginManager.executeMojo(DefaultBuildPluginManager.java:101)
	at org.apache.maven.lifecycle.internal.MojoExecutor.execute(MojoExecutor.java:209)
	... 31 more
Caused by: org.apache.maven.artifact.deployer.ArtifactDeploymentException: Failed to deploy
artifacts: Could not transfer artifact org.apache.oltu.oauth2:org.apache.oltu.oauth2.parent:pom:1.0.1-20140625.131301-17
from/to apache.snapshots.https (https://repository.apache.org/content/repositories/snapshots):
Failed to transfer file: https://repository.apache.org/content/repositories/snapshots/org/apache/oltu/oauth2/org.apache.oltu.oauth2.parent/1.0.1-SNAPSHOT/org.apache.oltu.oauth2.parent-1.0.1-20140625.131301-17.pom.
Return code is: 401
	at org.apache.maven.artifact.deployer.DefaultArtifactDeployer.deploy(DefaultArtifactDeployer.java:141)
	at org.apache.maven.plugin.deploy.AbstractDeployMojo.deploy(AbstractDeployMojo.java:171)
	at org.apache.maven.plugin.deploy.DeployMojo.deployProject(DeployMojo.java:240)
	... 34 more
Caused by: org.sonatype.aether.deployment.DeploymentException: Failed to deploy artifacts:
Could not transfer artifact org.apache.oltu.oauth2:org.apache.oltu.oauth2.parent:pom:1.0.1-20140625.131301-17
from/to apache.snapshots.https (https://repository.apache.org/content/repositories/snapshots):
Failed to transfer file: https://repository.apache.org/content/repositories/snapshots/org/apache/oltu/oauth2/org.apache.oltu.oauth2.parent/1.0.1-SNAPSHOT/org.apache.oltu.oauth2.parent-1.0.1-20140625.131301-17.pom.
Return code is: 401
	at org.sonatype.aether.impl.internal.DefaultDeployer.deploy(DefaultDeployer.java:284)
	at org.sonatype.aether.impl.internal.DefaultDeployer.deploy(DefaultDeployer.java:215)
	at org.sonatype.aether.impl.internal.DefaultRepositorySystem.deploy(DefaultRepositorySystem.java:480)
	at org.apache.maven.artifact.deployer.DefaultArtifactDeployer.deploy(DefaultArtifactDeployer.java:137)
	... 36 more
Caused by: org.sonatype.aether.transfer.ArtifactTransferException: Could not transfer artifact
org.apache.oltu.oauth2:org.apache.oltu.oauth2.parent:pom:1.0.1-20140625.131301-17 from/to
apache.snapshots.https (https://repository.apache.org/content/repositories/snapshots): Failed
to transfer file: https://repository.apache.org/content/repositories/snapshots/org/apache/oltu/oauth2/org.apache.oltu.oauth2.parent/1.0.1-SNAPSHOT/org.apache.oltu.oauth2.parent-1.0.1-20140625.131301-17.pom.
Return code is: 401
	at org.sonatype.aether.connector.wagon.WagonRepositoryConnector$4.wrap(WagonRepositoryConnector.java:949)
	at org.sonatype.aether.connector.wagon.WagonRepositoryConnector$4.wrap(WagonRepositoryConnector.java:940)
	at org.sonatype.aether.connector.wagon.WagonRepositoryConnector$PutTask.flush(WagonRepositoryConnector.java:864)
	at org.sonatype.aether.connector.wagon.WagonRepositoryConnector.put(WagonRepositoryConnector.java:466)
	at org.sonatype.aether.impl.internal.DefaultDeployer.deploy(DefaultDeployer.java:278)
	... 39 more
Caused by: org.apache.maven.wagon.TransferFailedException: Failed to transfer file: https://repository.apache.org/content/repositories/snapshots/org/apache/oltu/oauth2/org.apache.oltu.oauth2.parent/1.0.1-SNAPSHOT/org.apache.oltu.oauth2.parent-1.0.1-20140625.131301-17.pom.
Return code is: 401
	at org.apache.maven.wagon.providers.http.LightweightHttpWagon.finishPutTransfer(LightweightHttpWagon.java:205)
	at org.apache.maven.wagon.AbstractWagon.putTransfer(AbstractWagon.java:413)
	at org.apache.maven.wagon.AbstractWagon.transfer(AbstractWagon.java:392)
	at org.apache.maven.wagon.AbstractWagon.putTransfer(AbstractWagon.java:365)
	at org.apache.maven.wagon.StreamWagon.put(StreamWagon.java:163)
	at org.sonatype.aether.connector.wagon.WagonRepositoryConnector$PutTask.run(WagonRepositoryConnector.java:825)
	at org.sonatype.aether.connector.wagon.WagonRepositoryConnector.put(WagonRepositoryConnector.java:465)
	... 40 more
[ERROR] 
[ERROR] Re-run Maven using the -X switch to enable full debug logging.
[ERROR] 
[ERROR] For more information about the errors and possible solutions, please read the following
articles:
[ERROR] [Help 1] http://cwiki.apache.org/confluence/display/MAVEN/MojoExecutionException
[JENKINS] Archiving F:\jenkins\jenkins-slave\workspace\Oltu-OAuth-2.0\trunk\oauth-2.0\integration-tests\pom.xml
to org.apache.oltu.oauth2/org.apache.oltu.oauth2.integration-tests/1.0.1-SNAPSHOT/org.apache.oltu.oauth2.integration-tests-1.0.1-SNAPSHOT.pom
Sending artifact delta relative to Oltu-OAuth-2.0 » Apache Oltu - OAuth 2.0 - Integration
Tests #175
Archived 1 artifacts
Archive block size is 32768
Received 0 blocks and 5073 bytes
Compression is 0.0%
Took 0.32 sec
[JENKINS] Archiving F:\jenkins\jenkins-slave\workspace\Oltu-OAuth-2.0\trunk\oauth-2.0\authzserver\pom.xml
to org.apache.oltu.oauth2/org.apache.oltu.oauth2.authzserver/1.0.1-SNAPSHOT/org.apache.oltu.oauth2.authzserver-1.0.1-SNAPSHOT.pom
Sending artifact delta relative to Oltu-OAuth-2.0 » Apache Oltu - OAuth 2.0 - Authorization
Server #175
Archived 1 artifacts
Archive block size is 32768
Received 0 blocks and 3254 bytes
Compression is 0.0%
Took 91 ms
[JENKINS] Archiving F:\jenkins\jenkins-slave\workspace\Oltu-OAuth-2.0\trunk\oauth-2.0\jwt\pom.xml
to org.apache.oltu.oauth2/org.apache.oltu.oauth2.jwt/1.0.1-SNAPSHOT/org.apache.oltu.oauth2.jwt-1.0.1-SNAPSHOT.pom
Sending artifact delta relative to Oltu-OAuth-2.0 » Apache Oltu - OAuth 2.0 - JWT #175
Archived 1 artifacts
Archive block size is 32768
Received 0 blocks and 2209 bytes
Compression is 0.0%
Took 35 ms
[JENKINS] Archiving F:\jenkins\jenkins-slave\workspace\Oltu-OAuth-2.0\trunk\oauth-2.0\resourceserver-filter\pom.xml
to org.apache.oltu.oauth2/org.apache.oltu.oauth2.resourceserver-filter/1.0.1-SNAPSHOT/org.apache.oltu.oauth2.resourceserver-filter-1.0.1-SNAPSHOT.pom
Sending artifact delta relative to Oltu-OAuth-2.0 » Apache Oltu - OAuth 2.0 - Resource Server
Filter #175
Archived 1 artifacts
Archive block size is 32768
Received 0 blocks and 2982 bytes
Compression is 0.0%
Took 70 ms
[JENKINS] Archiving F:\jenkins\jenkins-slave\workspace\Oltu-OAuth-2.0\trunk\oauth-2.0\dynamicreg-client\pom.xml
to org.apache.oltu.oauth2/org.apache.oltu.oauth2.dynamicreg.client/1.0.1-SNAPSHOT/org.apache.oltu.oauth2.dynamicreg.client-1.0.1-SNAPSHOT.pom
Sending artifact delta relative to Oltu-OAuth-2.0 » Apache Oltu - OAuth 2.0 - Dynamic Registration
Client #175
Archived 1 artifacts
Archive block size is 32768
Received 0 blocks and 3173 bytes
Compression is 0.0%
Took 0.1 sec
[JENKINS] Archiving F:\jenkins\jenkins-slave\workspace\Oltu-OAuth-2.0\trunk\oauth-2.0\httpclient4\pom.xml
to org.apache.oltu.oauth2/org.apache.oltu.oauth2.httpclient4/1.0.1-SNAPSHOT/org.apache.oltu.oauth2.httpclient4-1.0.1-SNAPSHOT.pom
Sending artifact delta relative to Oltu-OAuth-2.0 » Apache Oltu - OAuth 2.0 - HttpClient
#175
Archived 1 artifacts
Archive block size is 32768
Received 0 blocks and 2860 bytes
Compression is 0.0%
Took 0.11 sec
[JENKINS] Archiving F:\jenkins\jenkins-slave\workspace\Oltu-OAuth-2.0\trunk\oauth-2.0\dynamicreg-common\pom.xml
to org.apache.oltu.oauth2/org.apache.oltu.oauth2.dynamicreg.common/1.0.1-SNAPSHOT/org.apache.oltu.oauth2.dynamicreg.common-1.0.1-SNAPSHOT.pom
Sending artifact delta relative to Oltu-OAuth-2.0 » Apache Oltu - OAuth 2.0 - Dynamic Registration
Common #175
Archived 1 artifacts
Archive block size is 32768
Received 0 blocks and 2104 bytes
Compression is 0.0%
Took 26 ms
[JENKINS] Archiving F:\jenkins\jenkins-slave\workspace\Oltu-OAuth-2.0\trunk\oauth-2.0\client\pom.xml
to org.apache.oltu.oauth2/org.apache.oltu.oauth2.client/1.0.1-SNAPSHOT/org.apache.oltu.oauth2.client-1.0.1-SNAPSHOT.pom
Sending artifact delta relative to Oltu-OAuth-2.0 » Apache Oltu - OAuth 2.0 - Client #175
Archived 1 artifacts
Archive block size is 32768
Received 0 blocks and 3056 bytes
Compression is 0.0%
Took 56 ms
[JENKINS] Archiving F:\jenkins\jenkins-slave\workspace\Oltu-OAuth-2.0\trunk\oauth-2.0\resourceserver\pom.xml
to org.apache.oltu.oauth2/org.apache.oltu.oauth2.resourceserver/1.0.1-SNAPSHOT/org.apache.oltu.oauth2.resourceserver-1.0.1-SNAPSHOT.pom
Sending artifact delta relative to Oltu-OAuth-2.0 » Apache Oltu - OAuth 2.0 - Resource Server
#175
Archived 1 artifacts
Archive block size is 32768
Received 0 blocks and 3034 bytes
Compression is 0.0%
Took 33 ms
[JENKINS] Archiving F:\jenkins\jenkins-slave\workspace\Oltu-OAuth-2.0\trunk\oauth-2.0\dynamicreg-server\pom.xml
to org.apache.oltu.oauth2/org.apache.oltu.oauth2.dynamicreg.server/1.0.1-SNAPSHOT/org.apache.oltu.oauth2.dynamicreg.server-1.0.1-SNAPSHOT.pom
Sending artifact delta relative to Oltu-OAuth-2.0 » Apache Oltu - OAuth 2.0 - Dynamic Registration
Server #175
Archived 1 artifacts
Archive block size is 32768
Received 0 blocks and 3515 bytes
Compression is 0.0%
Took 74 ms
[JENKINS] Archiving <https://builds.apache.org/job/Oltu-OAuth-2.0/ws/trunk\oauth-2.0\pom.xml>
to org.apache.oltu.oauth2/org.apache.oltu.oauth2.parent/1.0.1-SNAPSHOT/org.apache.oltu.oauth2.parent-1.0.1-SNAPSHOT.pom
Sending artifact delta relative to Oltu-OAuth-2.0 » Apache Oltu - OAuth 2.0 #175
Archived 1 artifacts
Archive block size is 32768
Received 0 blocks and 5768 bytes
Compression is 0.0%
Took 14 ms
[JENKINS] Archiving F:\jenkins\jenkins-slave\workspace\Oltu-OAuth-2.0\trunk\oauth-2.0\test-utils\pom.xml
to org.apache.oltu.oauth2/org.apache.oltu.oauth2.test-utils/1.0.1-SNAPSHOT/org.apache.oltu.oauth2.test-utils-1.0.1-SNAPSHOT.pom
Sending artifact delta relative to Oltu-OAuth-2.0 » Apache Oltu - OAuth 2.0 - Test Utils
#175
Archived 1 artifacts
Archive block size is 32768
Received 0 blocks and 2004 bytes
Compression is 0.0%
Took 32 ms
[JENKINS] Archiving F:\jenkins\jenkins-slave\workspace\Oltu-OAuth-2.0\trunk\oauth-2.0\common\pom.xml
to org.apache.oltu.oauth2/org.apache.oltu.oauth2.common/1.0.1-SNAPSHOT/org.apache.oltu.oauth2.common-1.0.1-SNAPSHOT.pom
Sending artifact delta relative to Oltu-OAuth-2.0 » Apache Oltu - OAuth 2.0 - Common #175
Archived 1 artifacts
Archive block size is 32768
Received 0 blocks and 2992 bytes
Compression is 0.0%
Took 27 ms
Sending e-mails to: dev@oltu.apache.org
channel stopped

Mime
View raw message