oltu-dev mailing list archives

Site index · List index
Message view « Date » · « Thread »
Top « Date » · « Thread »
From Apache Jenkins Server <jenk...@builds.apache.org>
Subject Build failed in Jenkins: Oltu #133
Date Tue, 07 Jul 2015 01:36:22 GMT
See <https://builds.apache.org/job/Oltu/133/changes>

Changes:

[simonetripodi] [maven-release-plugin] prepare for next development iteration

[simonetripodi] [maven-release-plugin] prepare release org.apache.oltu.parent-3

------------------------------------------
Started by an SCM change
Building remotely on ubuntu3 (Ubuntu ubuntu legacy-ubuntu) in workspace <https://builds.apache.org/job/Oltu/ws/>
Updating https://svn.apache.org/repos/asf/oltu/trunk at revision '2015-07-07T01:36:13.407
+0000'
U         parent/pom.xml
At revision 1689555
Parsing POMs
Downloaded artifact http://repo.maven.apache.org/maven2/org/apache/apache/10/apache-10.pom
ERROR: Failed to parse POMs
java.io.IOException: remote file operation failed: <https://builds.apache.org/job/Oltu/ws/trunk>
at hudson.remoting.Channel@39b06cdc:ubuntu3
	at hudson.FilePath.act(FilePath.java:916)
	at hudson.FilePath.act(FilePath.java:893)
	at hudson.maven.MavenModuleSetBuild$MavenModuleSetBuildExecution.parsePoms(MavenModuleSetBuild.java:950)
	at hudson.maven.MavenModuleSetBuild$MavenModuleSetBuildExecution.doRun(MavenModuleSetBuild.java:677)
	at hudson.model.AbstractBuild$AbstractBuildExecution.run(AbstractBuild.java:529)
	at hudson.model.Run.execute(Run.java:1706)
	at hudson.maven.MavenModuleSetBuild.run(MavenModuleSetBuild.java:529)
	at hudson.model.ResourceController.execute(ResourceController.java:88)
	at hudson.model.Executor.run(Executor.java:232)
Caused by: hudson.remoting.ProxyException: hudson.maven.MavenModuleSetBuild$MavenExecutionException:
org.apache.maven.project.ProjectBuildingException: Some problems were encountered while processing
the POMs:
[FATAL] Non-resolvable parent POM: Could not find artifact org.apache.oltu:org.apache.oltu.parent:pom:3-SNAPSHOT
and 'parent.relativePath' points at wrong local POM @ line 21, column 11
[FATAL] Non-resolvable parent POM: Could not find artifact org.apache.oltu:org.apache.oltu.parent:pom:3-SNAPSHOT
and 'parent.relativePath' points at wrong local POM @ line 21, column 11
[FATAL] Non-resolvable parent POM: Could not find artifact org.apache.oltu:org.apache.oltu.parent:pom:3-SNAPSHOT
and 'parent.relativePath' points at wrong local POM @ line 21, column 11
[FATAL] Non-resolvable parent POM: Could not find artifact org.apache.oltu:org.apache.oltu.parent:pom:3-SNAPSHOT
and 'parent.relativePath' points at wrong local POM @ line 21, column 11
[FATAL] Non-resolvable parent POM: Could not find artifact org.apache.oltu:org.apache.oltu.parent:pom:3-SNAPSHOT
and 'parent.relativePath' points at wrong local POM @ line 21, column 11

	at hudson.maven.MavenModuleSetBuild$PomParser.invoke(MavenModuleSetBuild.java:1354)
	at hudson.maven.MavenModuleSetBuild$PomParser.invoke(MavenModuleSetBuild.java:1088)
	at hudson.FilePath$FileCallableWrapper.call(FilePath.java:2474)
	at hudson.remoting.UserRequest.perform(UserRequest.java:118)
	at hudson.remoting.UserRequest.perform(UserRequest.java:48)
	at hudson.remoting.Request$2.run(Request.java:328)
	at hudson.remoting.InterceptingExecutorService$1.call(InterceptingExecutorService.java:72)
	at java.util.concurrent.FutureTask.run(FutureTask.java:262)
	at java.util.concurrent.ThreadPoolExecutor.runWorker(ThreadPoolExecutor.java:1145)
	at java.util.concurrent.ThreadPoolExecutor$Worker.run(ThreadPoolExecutor.java:615)
	at java.lang.Thread.run(Thread.java:745)
Caused by: hudson.remoting.ProxyException: org.apache.maven.project.ProjectBuildingException:
Some problems were encountered while processing the POMs:
[FATAL] Non-resolvable parent POM: Could not find artifact org.apache.oltu:org.apache.oltu.parent:pom:3-SNAPSHOT
and 'parent.relativePath' points at wrong local POM @ line 21, column 11
[FATAL] Non-resolvable parent POM: Could not find artifact org.apache.oltu:org.apache.oltu.parent:pom:3-SNAPSHOT
and 'parent.relativePath' points at wrong local POM @ line 21, column 11
[FATAL] Non-resolvable parent POM: Could not find artifact org.apache.oltu:org.apache.oltu.parent:pom:3-SNAPSHOT
and 'parent.relativePath' points at wrong local POM @ line 21, column 11
[FATAL] Non-resolvable parent POM: Could not find artifact org.apache.oltu:org.apache.oltu.parent:pom:3-SNAPSHOT
and 'parent.relativePath' points at wrong local POM @ line 21, column 11
[FATAL] Non-resolvable parent POM: Could not find artifact org.apache.oltu:org.apache.oltu.parent:pom:3-SNAPSHOT
and 'parent.relativePath' points at wrong local POM @ line 21, column 11

	at org.apache.maven.project.DefaultProjectBuilder.build(DefaultProjectBuilder.java:364)
	at hudson.maven.MavenEmbedder.buildProjects(MavenEmbedder.java:361)
	at hudson.maven.MavenEmbedder.readProjects(MavenEmbedder.java:331)
	at hudson.maven.MavenModuleSetBuild$PomParser.invoke(MavenModuleSetBuild.java:1291)
	... 10 more

Mime
View raw message