oltu-dev mailing list archives

Site index · List index
Message view « Date » · « Thread »
Top « Date » · « Thread »
From Apache Jenkins Server <jenk...@builds.apache.org>
Subject Build failed in Jenkins: Oltu-OAuth-2.0-windows #152
Date Thu, 17 Sep 2015 13:10:40 GMT
See <https://builds.apache.org/job/Oltu-OAuth-2.0-windows/152/changes>

Changes:

[simonetripodi] [maven-release-plugin] prepare for next development iteration

[simonetripodi] [maven-release-plugin] prepare release org.apache.oltu.oauth2.parent-1.0.1

[simonetripodi] releng - update parent pom to v3 in order to prepare the incoming release

------------------------------------------
Started by an SCM change
[EnvInject] - Loading node environment variables.
Building remotely on windows1 (Windows) in workspace <https://builds.apache.org/job/Oltu-OAuth-2.0-windows/ws/>
Updating https://svn.apache.org/repos/asf/oltu/trunk at revision '2015-09-17T14:10:11.853
+0100'
U         site\src\site\xdoc\index.xml
U         oauth-2.0\common\pom.xml
U         oauth-2.0\dynamicreg-common\pom.xml
U         oauth-2.0\pom.xml
U         oauth-2.0\test-utils\pom.xml
U         oauth-2.0\client\pom.xml
U         oauth-2.0\dynamicreg-client\pom.xml
U         oauth-2.0\resourceserver\pom.xml
U         oauth-2.0\resourceserver-filter\pom.xml
U         oauth-2.0\authzserver\pom.xml
U         oauth-2.0\httpclient4\pom.xml
U         oauth-2.0\integration-tests\pom.xml
U         oauth-2.0\jwt\pom.xml
U         oauth-2.0\dynamicreg-server\pom.xml
At revision 1703612
WARNING: clock of the subversion server appears to be out of sync. This can result in inconsistent
check out behavior.
Parsing POMs
Failed to transfer Could not find artifact org.apache.oltu:org.apache.oltu.parent:pom:3 in
central (http://repo.maven.apache.org/maven2)
ERROR: Failed to parse POMs
java.io.IOException: remote file operation failed: <https://builds.apache.org/job/Oltu-OAuth-2.0-windows/ws/trunk>
at hudson.remoting.Channel@15a9051d:windows1
	at hudson.FilePath.act(FilePath.java:916)
	at hudson.FilePath.act(FilePath.java:893)
	at hudson.maven.MavenModuleSetBuild$MavenModuleSetBuildExecution.parsePoms(MavenModuleSetBuild.java:950)
	at hudson.maven.MavenModuleSetBuild$MavenModuleSetBuildExecution.doRun(MavenModuleSetBuild.java:677)
	at hudson.model.AbstractBuild$AbstractBuildExecution.run(AbstractBuild.java:529)
	at hudson.model.Run.execute(Run.java:1706)
	at hudson.maven.MavenModuleSetBuild.run(MavenModuleSetBuild.java:529)
	at hudson.model.ResourceController.execute(ResourceController.java:88)
	at hudson.model.Executor.run(Executor.java:232)
Caused by: hudson.remoting.ProxyException: hudson.maven.MavenModuleSetBuild$MavenExecutionException:
org.apache.maven.project.ProjectBuildingException: Some problems were encountered while processing
the POMs:
[FATAL] Non-resolvable parent POM: Could not find artifact org.apache.oltu:org.apache.oltu.parent:pom:3
in central (http://repo.maven.apache.org/maven2) and 'parent.relativePath' points at wrong
local POM @ line 21, column 11

	at hudson.maven.MavenModuleSetBuild$PomParser.invoke(MavenModuleSetBuild.java:1354)
	at hudson.maven.MavenModuleSetBuild$PomParser.invoke(MavenModuleSetBuild.java:1088)
	at hudson.FilePath$FileCallableWrapper.call(FilePath.java:2474)
	at hudson.remoting.UserRequest.perform(UserRequest.java:118)
	at hudson.remoting.UserRequest.perform(UserRequest.java:48)
	at hudson.remoting.Request$2.run(Request.java:328)
	at hudson.remoting.InterceptingExecutorService$1.call(InterceptingExecutorService.java:72)
	at java.util.concurrent.FutureTask.run(Unknown Source)
	at java.util.concurrent.ThreadPoolExecutor.runWorker(Unknown Source)
	at java.util.concurrent.ThreadPoolExecutor$Worker.run(Unknown Source)
	at hudson.remoting.Engine$1$1.run(Engine.java:63)
	at java.lang.Thread.run(Unknown Source)
Caused by: hudson.remoting.ProxyException: org.apache.maven.project.ProjectBuildingException:
Some problems were encountered while processing the POMs:
[FATAL] Non-resolvable parent POM: Could not find artifact org.apache.oltu:org.apache.oltu.parent:pom:3
in central (http://repo.maven.apache.org/maven2) and 'parent.relativePath' points at wrong
local POM @ line 21, column 11

	at org.apache.maven.project.DefaultProjectBuilder.build(DefaultProjectBuilder.java:364)
	at hudson.maven.MavenEmbedder.buildProjects(MavenEmbedder.java:361)
	at hudson.maven.MavenEmbedder.readProjects(MavenEmbedder.java:331)
	at hudson.maven.MavenModuleSetBuild$PomParser.invoke(MavenModuleSetBuild.java:1291)
	... 11 more

Mime
View raw message