openjpa-commits mailing list archives

Site index · List index
Message view « Date » · « Thread »
Top « Date » · « Thread »
From Apache Hudson Server <hud...@hudson.apache.org>
Subject Build failed in Hudson: OpenJPA-trunk #140
Date Tue, 24 Aug 2010 16:26:07 GMT
See <https://hudson.apache.org/hudson/job/OpenJPA-trunk/140/changes>

Changes:

[faywang] OPENJPA-735: OpenJPA support for SolidDB

------------------------------------------
[...truncated 16224 lines...]
validation exception upon removal
Remove failed as expected
------------------------------------------------
Violation: Image type must be specified.
Entity: Image
Attribute: type
Invalid value: null
------------------------------------------------
Done
Tests run: 1, Failures: 0, Errors: 0, Skipped: 0, Time elapsed: 6.378 sec

Results :

Tests run: 1, Failures: 0, Errors: 0, Skipped: 0

[HUDSON] Recording test results
[INFO] [jar:jar {execution: default-jar}]
[INFO] Building jar: C:\hudson\hudson-slave\workspace\OpenJPA-trunk\trunk\openjpa-examples\image-gallery\target\image-gallery-2.1.0-SNAPSHOT.jar
[INFO] [jar:jar {execution: default-jar}]
[INFO] [jar:test-jar {execution: attach-tests}]
[INFO] Building jar: C:\hudson\hudson-slave\workspace\OpenJPA-trunk\trunk\openjpa-examples\image-gallery\target\image-gallery-2.1.0-SNAPSHOT-tests.jar
[INFO] Preparing source:jar
[WARNING] Removing: jar from forked lifecycle, to prevent recursive invocation.
[HUDSON] Archiving C:\hudson\hudson-slave\workspace\OpenJPA-trunk\trunk\openjpa-examples\image-gallery\pom.xml
to /home/hudson/hudson/jobs/OpenJPA-trunk/modules/org.apache.openjpa.openjpa-examples$image-gallery/builds/2010-08-24_15-33-52/archive/org.apache.openjpa.openjpa-examples/image-gallery/2.1.0-SNAPSHOT/pom.xml
[HUDSON] Archiving C:\hudson\hudson-slave\workspace\OpenJPA-trunk\trunk\openjpa-examples\image-gallery\target\image-gallery-2.1.0-SNAPSHOT.jar
to /home/hudson/hudson/jobs/OpenJPA-trunk/modules/org.apache.openjpa.openjpa-examples$image-gallery/builds/2010-08-24_15-33-52/archive/org.apache.openjpa.openjpa-examples/image-gallery/2.1.0-SNAPSHOT/image-gallery-2.1.0-SNAPSHOT.jar
[HUDSON] Archiving C:\hudson\hudson-slave\workspace\OpenJPA-trunk\trunk\openjpa-examples\image-gallery\target\image-gallery-2.1.0-SNAPSHOT-tests.jar
to /home/hudson/hudson/jobs/OpenJPA-trunk/modules/org.apache.openjpa.openjpa-examples$image-gallery/builds/2010-08-24_15-33-52/archive/org.apache.openjpa.openjpa-examples/image-gallery/2.1.0-SNAPSHOT/image-gallery-2.1.0-SNAPSHOT-tests.jar
[INFO] [buildnumber:create {execution: default}]
[INFO] [enforcer:enforce {execution: default}]
[INFO] [source:jar {execution: attach-sources}]
[INFO] Building jar: C:\hudson\hudson-slave\workspace\OpenJPA-trunk\trunk\openjpa-examples\image-gallery\target\image-gallery-2.1.0-SNAPSHOT-sources.jar
[INFO] Preparing source:test-jar
[WARNING] Removing: jar from forked lifecycle, to prevent recursive invocation.
[WARNING] Removing: test-jar from forked lifecycle, to prevent recursive invocation.
[HUDSON] Archiving C:\hudson\hudson-slave\workspace\OpenJPA-trunk\trunk\openjpa-examples\image-gallery\target\image-gallery-2.1.0-SNAPSHOT-sources.jar
to /home/hudson/hudson/jobs/OpenJPA-trunk/modules/org.apache.openjpa.openjpa-examples$image-gallery/builds/2010-08-24_15-33-52/archive/org.apache.openjpa.openjpa-examples/image-gallery/2.1.0-SNAPSHOT/image-gallery-2.1.0-SNAPSHOT-sources.jar
[INFO] [buildnumber:create {execution: default}]
[INFO] [enforcer:enforce {execution: default}]
[INFO] [source:test-jar {execution: attach-sources}]
[INFO] Building jar: C:\hudson\hudson-slave\workspace\OpenJPA-trunk\trunk\openjpa-examples\image-gallery\target\image-gallery-2.1.0-SNAPSHOT-test-sources.jar
[INFO] [ianal:verify-legal-files {execution: default}]
[INFO] Checking legal files in: image-gallery-2.1.0-SNAPSHOT.jar
[INFO] Checking legal files in: image-gallery-2.1.0-SNAPSHOT-tests.jar
[INFO] Checking legal files in: image-gallery-2.1.0-SNAPSHOT-sources.jar
[INFO] Checking legal files in: image-gallery-2.1.0-SNAPSHOT-test-sources.jar
[INFO] [apache-rat:check {execution: default}]
[INFO] Exclude: **/javax.persistence.spi.PersistenceProvider
[INFO] Exclude: **/javax.annotation.processing.Processor
[INFO] Exclude: **/*.rsrc
[INFO] Exclude: **/org.apache.openjpa.revision.properties
[INFO] Exclude: scripts/*.list
[INFO] Exclude: scripts/*.options
[INFO] Exclude: scripts/*.dict
[INFO] Exclude: **/.*/**
[INFO] Exclude: **/target/**/*
[INFO] Exclude: **/dependency-reduced-pom.xml
[INFO] Exclude: **/*.log
[INFO] Exclude: **/maven-eclipse.xml
[INFO] Exclude: **/rat.txt
[INFO] Exclude: release.properties
[INFO] Exclude: DEPENDENCIES
[INFO] Exclude: **/internal-repository/**
[INFO] [install:install {execution: default-install}]
[INFO] Installing C:\hudson\hudson-slave\workspace\OpenJPA-trunk\trunk\openjpa-examples\image-gallery\target\image-gallery-2.1.0-SNAPSHOT.jar
to C:\Users\hudson\.m2\repository\org\apache\openjpa\openjpa-examples\image-gallery\2.1.0-SNAPSHOT\image-gallery-2.1.0-SNAPSHOT.jar
[INFO] Installing C:\hudson\hudson-slave\workspace\OpenJPA-trunk\trunk\openjpa-examples\image-gallery\target\image-gallery-2.1.0-SNAPSHOT-tests.jar
to C:\Users\hudson\.m2\repository\org\apache\openjpa\openjpa-examples\image-gallery\2.1.0-SNAPSHOT\image-gallery-2.1.0-SNAPSHOT-tests.jar
[INFO] Installing C:\hudson\hudson-slave\workspace\OpenJPA-trunk\trunk\openjpa-examples\image-gallery\target\image-gallery-2.1.0-SNAPSHOT-sources.jar
to C:\Users\hudson\.m2\repository\org\apache\openjpa\openjpa-examples\image-gallery\2.1.0-SNAPSHOT\image-gallery-2.1.0-SNAPSHOT-sources.jar
[INFO] Installing C:\hudson\hudson-slave\workspace\OpenJPA-trunk\trunk\openjpa-examples\image-gallery\target\image-gallery-2.1.0-SNAPSHOT-test-sources.jar
to C:\Users\hudson\.m2\repository\org\apache\openjpa\openjpa-examples\image-gallery\2.1.0-SNAPSHOT\image-gallery-2.1.0-SNAPSHOT-test-sources.jar
[HUDSON] Archiving C:\hudson\hudson-slave\workspace\OpenJPA-trunk\trunk\openjpa-examples\image-gallery\target\image-gallery-2.1.0-SNAPSHOT-test-sources.jar
to /home/hudson/hudson/jobs/OpenJPA-trunk/modules/org.apache.openjpa.openjpa-examples$image-gallery/builds/2010-08-24_15-33-52/archive/org.apache.openjpa.openjpa-examples/image-gallery/2.1.0-SNAPSHOT/image-gallery-2.1.0-SNAPSHOT-test-sources.jar
[INFO] ------------------------------------------------------------------------
[INFO] Building OpenJPA Examples - OpenBooks
[INFO]    task-segment: [clean, install]
[INFO] ------------------------------------------------------------------------
[INFO] [clean:clean {execution: default-clean}]
[INFO] Deleting file set: C:\hudson\hudson-slave\workspace\OpenJPA-trunk\trunk\openjpa-examples\openbooks\target
(included: [**], excluded: [])
[INFO] [buildnumber:create {execution: default}]
[INFO] [enforcer:enforce {execution: default}]
[INFO] [checkstyle:checkstyle {execution: default}]
[INFO] Starting audit...
Audit done.

[WARNING] Unable to locate Source XRef to link to - DISABLED
[INFO] [remote-resources:process {execution: default}]
[INFO] [resources:resources {execution: default-resources}]
[INFO] Using 'UTF-8' encoding to copy filtered resources.
[INFO] Copying 47 resources
[INFO] Copying 3 resources
[INFO] [antrun:run {execution: genmodel}]
[INFO] Executing tasks
     [echo] Running OpenBooks genmodel

info:
     [echo] 
     [echo] 			Builds OpenBooks demo application.
     [echo] 			OpenJPA Library: C:\Users\hudson\.m2\repository/org/apache/openjpa/openjpa-all/2.1.0-SNAPSHOT
     [echo] 			Build mode     : jse
     [echo] 			Deploy Location: C:\hudson\hudson-slave\workspace\OpenJPA-trunk\trunk\openjpa-examples\openbooks/target/openbooks
     [echo] 		

check-env:
    [mkdir] Created dir: C:\hudson\hudson-slave\workspace\OpenJPA-trunk\trunk\openjpa-examples\openbooks\target\openbooks

generate-canonical-model:
    [mkdir] Created dir: C:\hudson\hudson-slave\workspace\OpenJPA-trunk\trunk\openjpa-examples\openbooks\target\generated-metamodel\java
    [javac] Compiling 8 source files to C:\hudson\hudson-slave\workspace\OpenJPA-trunk\trunk\openjpa-examples\openbooks\target\classes
    [javac] Note: Starting OpenJPA Annotation Processor for Metamodel Generation 
    [javac] Note: Generating canonical metamodel source code "file:/C:/hudson/hudson-slave/workspace/OpenJPA-trunk/trunk/openjpa-examples/openbooks/target/generated-metamodel/java/openbook/domain/Author_.java"
    [javac] Note: Generating canonical metamodel source code "file:/C:/hudson/hudson-slave/workspace/OpenJPA-trunk/trunk/openjpa-examples/openbooks/target/generated-metamodel/java/openbook/domain/Book_.java"
    [javac] Note: Generating canonical metamodel source code "file:/C:/hudson/hudson-slave/workspace/OpenJPA-trunk/trunk/openjpa-examples/openbooks/target/generated-metamodel/java/openbook/domain/Customer_.java"
    [javac] Note: Generating canonical metamodel source code "file:/C:/hudson/hudson-slave/workspace/OpenJPA-trunk/trunk/openjpa-examples/openbooks/target/generated-metamodel/java/openbook/domain/Inventory_.java"
    [javac] Note: Generating canonical metamodel source code "file:/C:/hudson/hudson-slave/workspace/OpenJPA-trunk/trunk/openjpa-examples/openbooks/target/generated-metamodel/java/openbook/domain/LineItem_.java"
    [javac] Note: Generating canonical metamodel source code "file:/C:/hudson/hudson-slave/workspace/OpenJPA-trunk/trunk/openjpa-examples/openbooks/target/generated-metamodel/java/openbook/domain/PurchaseOrder_.java"
    [javac] Note: C:\hudson\hudson-slave\workspace\OpenJPA-trunk\trunk\openjpa-examples\openbooks\src\main\java\openbook\domain\Range.java
uses unchecked or unsafe operations.
    [javac] Note: Recompile with -Xlint:unchecked for details.
[INFO] Executed tasks
[INFO] [compiler:compile {execution: default-compile}]
[INFO] Compiling 59 source files to C:\hudson\hudson-slave\workspace\OpenJPA-trunk\trunk\openjpa-examples\openbooks\target\classes
[INFO] [antrun:run {execution: enhance}]
[INFO] Executing tasks
     [echo] Running OpenBooks Enhance

info:
     [echo] 
     [echo] 			Builds OpenBooks demo application.
     [echo] 			OpenJPA Library: C:\Users\hudson\.m2\repository/org/apache/openjpa/openjpa-all/2.1.0-SNAPSHOT
     [echo] 			Build mode     : jse
     [echo] 			Deploy Location: C:\hudson\hudson-slave\workspace\OpenJPA-trunk\trunk\openjpa-examples\openbooks/target/openbooks
     [echo] 		

check-env:

enhance:
     [java] 483  OpenBooks  INFO   [main] openjpa.Tool - No targets were given.  Running on
all classes in your persistent classes list, or all metadata files in classpath directories
if you have not listed your persistent classes.  Use -help to display tool usage information.
[INFO] Executed tasks
[INFO] [resources:testResources {execution: default-testResources}]
[INFO] Using 'UTF-8' encoding to copy filtered resources.
[INFO] skip non existing resourceDirectory C:\hudson\hudson-slave\workspace\OpenJPA-trunk\trunk\openjpa-examples\openbooks\src\test\resources
[INFO] Copying 3 resources
[INFO] [compiler:testCompile {execution: default-testCompile}]
[INFO] No sources to compile
[INFO] [surefire:test {execution: default-test}]
[INFO] Surefire report directory: C:\hudson\hudson-slave\workspace\OpenJPA-trunk\trunk\openjpa-examples\openbooks\target\surefire-reports

-------------------------------------------------------
 T E S T S
-------------------------------------------------------
There are no tests to run.

Results :

Tests run: 0, Failures: 0, Errors: 0, Skipped: 0

[HUDSON] Recording test results
[INFO] [antrun:run {execution: generate-source}]
[INFO] Executing tasks
     [echo] Running OpenBooks Generate Source

info:
     [echo] 
     [echo] 			Builds OpenBooks demo application.
     [echo] 			OpenJPA Library: C:\Users\hudson\.m2\repository/org/apache/openjpa/openjpa-all/2.1.0-SNAPSHOT
     [echo] 			Build mode     : jse
     [echo] 			Deploy Location: C:\hudson\hudson-slave\workspace\OpenJPA-trunk\trunk\openjpa-examples\openbooks/target/openbooks
     [echo] 		

check-env:

generate-source:
    [mkdir] Created dir: C:\hudson\hudson-slave\workspace\OpenJPA-trunk\trunk\openjpa-examples\openbooks\target\generated-html
     [copy] Copying 1 file to C:\hudson\hudson-slave\workspace\OpenJPA-trunk\trunk\openjpa-examples\openbooks\target\generated-html

generate-source-with-options:
     [copy] Copying 5 files to C:\hudson\hudson-slave\workspace\OpenJPA-trunk\trunk\openjpa-examples\openbooks\target
[INFO] Executed tasks
[INFO] [jar:jar {execution: default-jar}]
[INFO] Building jar: C:\hudson\hudson-slave\workspace\OpenJPA-trunk\trunk\openjpa-examples\openbooks\target\openbooks-2.1.0-SNAPSHOT.jar
[INFO] [assembly:attached {execution: bin}]
[INFO] Reading assembly descriptor: assembly.xml
[INFO] Building zip: C:\hudson\hudson-slave\workspace\OpenJPA-trunk\trunk\openjpa-examples\openbooks\target\openbooks-2.1.0-SNAPSHOT-binary.zip
[INFO] [jar:jar {execution: default-jar}]
[INFO] [jar:test-jar {execution: attach-tests}]
[INFO] Building jar: C:\hudson\hudson-slave\workspace\OpenJPA-trunk\trunk\openjpa-examples\openbooks\target\openbooks-2.1.0-SNAPSHOT-tests.jar
[INFO] Preparing source:jar
[WARNING] Removing: jar from forked lifecycle, to prevent recursive invocation.
[HUDSON] Archiving C:\hudson\hudson-slave\workspace\OpenJPA-trunk\trunk\openjpa-examples\openbooks\pom.xml
to /home/hudson/hudson/jobs/OpenJPA-trunk/modules/org.apache.openjpa.openjpa-examples$openbooks/builds/2010-08-24_15-33-52/archive/org.apache.openjpa.openjpa-examples/openbooks/2.1.0-SNAPSHOT/pom.xml
[HUDSON] Archiving C:\hudson\hudson-slave\workspace\OpenJPA-trunk\trunk\openjpa-examples\openbooks\target\openbooks-2.1.0-SNAPSHOT.jar
to /home/hudson/hudson/jobs/OpenJPA-trunk/modules/org.apache.openjpa.openjpa-examples$openbooks/builds/2010-08-24_15-33-52/archive/org.apache.openjpa.openjpa-examples/openbooks/2.1.0-SNAPSHOT/openbooks-2.1.0-SNAPSHOT.jar
[HUDSON] Archiving C:\hudson\hudson-slave\workspace\OpenJPA-trunk\trunk\openjpa-examples\openbooks\target\openbooks-2.1.0-SNAPSHOT-binary.zip
to /home/hudson/hudson/jobs/OpenJPA-trunk/modules/org.apache.openjpa.openjpa-examples$openbooks/builds/2010-08-24_15-33-52/archive/org.apache.openjpa.openjpa-examples/openbooks/2.1.0-SNAPSHOT/openbooks-2.1.0-SNAPSHOT-binary.zip
[HUDSON] Archiving C:\hudson\hudson-slave\workspace\OpenJPA-trunk\trunk\openjpa-examples\openbooks\target\openbooks-2.1.0-SNAPSHOT-tests.jar
to /home/hudson/hudson/jobs/OpenJPA-trunk/modules/org.apache.openjpa.openjpa-examples$openbooks/builds/2010-08-24_15-33-52/archive/org.apache.openjpa.openjpa-examples/openbooks/2.1.0-SNAPSHOT/openbooks-2.1.0-SNAPSHOT-tests.jar
[INFO] [buildnumber:create {execution: default}]
[INFO] [enforcer:enforce {execution: default}]
[INFO] [source:jar {execution: attach-sources}]
[INFO] Building jar: C:\hudson\hudson-slave\workspace\OpenJPA-trunk\trunk\openjpa-examples\openbooks\target\openbooks-2.1.0-SNAPSHOT-sources.jar
[INFO] Preparing source:test-jar
[WARNING] Removing: jar from forked lifecycle, to prevent recursive invocation.
[WARNING] Removing: test-jar from forked lifecycle, to prevent recursive invocation.
[HUDSON] Archiving C:\hudson\hudson-slave\workspace\OpenJPA-trunk\trunk\openjpa-examples\openbooks\target\openbooks-2.1.0-SNAPSHOT-sources.jar
to /home/hudson/hudson/jobs/OpenJPA-trunk/modules/org.apache.openjpa.openjpa-examples$openbooks/builds/2010-08-24_15-33-52/archive/org.apache.openjpa.openjpa-examples/openbooks/2.1.0-SNAPSHOT/openbooks-2.1.0-SNAPSHOT-sources.jar
[INFO] [buildnumber:create {execution: default}]
[INFO] [enforcer:enforce {execution: default}]
[INFO] ------------------------------------------------------------------------
[ERROR] BUILD FAILURE
[INFO] ------------------------------------------------------------------------
[INFO] remote file operation failed: /home/hudson/hudson/jobs/OpenJPA-trunk/modules/org.apache.openjpa.openjpa-examples$openbooks/builds/2010-08-24_15-33-52/archive/org.apache.openjpa.openjpa-examples/openbooks/2.1.0-SNAPSHOT/pom.xml
at hudson.remoting.Channel@5b6df84b:channel
/home/hudson/hudson/jobs/OpenJPA-trunk/modules/org.apache.openjpa.openjpa-examples$openbooks/builds/2010-08-24_15-33-52/archive/org.apache.openjpa.openjpa-examples/openbooks/2.1.0-SNAPSHOT/pom.xml
(Too many open files)
[INFO] ------------------------------------------------------------------------
[INFO] For more information, run Maven with the -e switch
[INFO] ------------------------------------------------------------------------
[INFO] Total time: 52 minutes 
[INFO] Finished at: Tue Aug 24 17:24:05 BST 2010
[INFO] Final Memory: 180M/600M
[INFO] ------------------------------------------------------------------------
ERROR: Asynchronous execution failure
java.util.concurrent.ExecutionException: hudson.util.IOException2: Failed to create a temporary
file in /home/hudson/hudson/fingerprints/ae/af
	at hudson.remoting.Channel$1.adapt(Channel.java:590)
	at hudson.remoting.Channel$1.adapt(Channel.java:585)
	at hudson.remoting.FutureAdapter.get(FutureAdapter.java:55)
	at hudson.maven.MavenBuilder.call(MavenBuilder.java:176)
	at hudson.maven.MavenModuleSetBuild$Builder.call(MavenModuleSetBuild.java:708)
	at hudson.maven.MavenModuleSetBuild$Builder.call(MavenModuleSetBuild.java:652)
	at hudson.remoting.UserRequest.perform(UserRequest.java:114)
	at hudson.remoting.UserRequest.perform(UserRequest.java:48)
	at hudson.remoting.Request$2.run(Request.java:270)
	at java.util.concurrent.Executors$RunnableAdapter.call(Executors.java:441)
	at java.util.concurrent.FutureTask$Sync.innerRun(FutureTask.java:303)
	at java.util.concurrent.FutureTask.run(FutureTask.java:138)
	at java.util.concurrent.ThreadPoolExecutor$Worker.runTask(ThreadPoolExecutor.java:886)
	at java.util.concurrent.ThreadPoolExecutor$Worker.run(ThreadPoolExecutor.java:908)
	at java.lang.Thread.run(Thread.java:619)
Caused by: hudson.util.IOException2: Failed to create a temporary file in /home/hudson/hudson/fingerprints/ae/af
	at hudson.util.AtomicFileWriter.<init>(AtomicFileWriter.java:67)
	at hudson.util.AtomicFileWriter.<init>(AtomicFileWriter.java:54)
	at hudson.XmlFile.write(XmlFile.java:162)
	at hudson.model.Fingerprint.save(Fingerprint.java:704)
	at hudson.model.Fingerprint.add(Fingerprint.java:666)
	at hudson.model.Fingerprint.add(Fingerprint.java:651)
	at hudson.maven.reporters.MavenFingerprinter$1.call(MavenFingerprinter.java:107)
	at hudson.maven.reporters.MavenFingerprinter$1.call(MavenFingerprinter.java:96)
	at hudson.maven.MavenBuild$ProxyImpl.execute(MavenBuild.java:341)
	at sun.reflect.GeneratedMethodAccessor373.invoke(Unknown Source)
	at sun.reflect.DelegatingMethodAccessorImpl.invoke(DelegatingMethodAccessorImpl.java:25)
	at java.lang.reflect.Method.invoke(Method.java:597)
	at hudson.model.Executor$1.call(Executor.java:380)
	at hudson.util.InterceptingProxy$1.invoke(InterceptingProxy.java:23)
	at $Proxy23.execute(Unknown Source)
	at hudson.maven.MavenBuildProxy$Filter$AsyncInvoker.call(MavenBuildProxy.java:261)
	... 9 more
Caused by: java.io.IOException: Too many open files
	at java.io.UnixFileSystem.createFileExclusively(Native Method)
	at java.io.File.checkAndCreate(File.java:1704)
	at java.io.File.createTempFile(File.java:1792)
	at hudson.util.AtomicFileWriter.<init>(AtomicFileWriter.java:65)
	... 24 more
channel stopped


Mime
View raw message