openjpa-commits mailing list archives

Site index · List index
Message view « Date » · « Thread »
Top « Date » · « Thread »
From Apache Hudson Server <hud...@hudson.apache.org>
Subject Build failed in Hudson: OpenJPA-trunk-deploy #23
Date Wed, 06 Oct 2010 06:56:52 GMT
See <https://hudson.apache.org/hudson/job/OpenJPA-trunk-deploy/23/changes>

Changes:

[curtisr7] OPENJPA-1801: Refactor cache statistics.

[mikedd] Set table names for attach entities in kernel.common.apps.

[mikedd] Make column names consistent for cache tests.

[kwsutter] Updating documentation to remove the restriction of using only a single type of
access (field or property) for each class.  As of JPA 2.0, this restriction no longer applies.

------------------------------------------
[...truncated 1576 lines...]
location: class org.apache.openjpa.persistence.datacache.TestStatistics

[ERROR] <https://hudson.apache.org/hudson/job/OpenJPA-trunk-deploy/ws/trunk/openjpa-persistence-jdbc/src/test/java/org/apache/openjpa/persistence/datacache/TestStatistics.java>:[148,20]
cannot find symbol
symbol  : class CachedEntityStatistics
location: class org.apache.openjpa.persistence.datacache.TestStatistics

[ERROR] <https://hudson.apache.org/hudson/job/OpenJPA-trunk-deploy/ws/trunk/openjpa-persistence-jdbc/src/test/java/org/apache/openjpa/persistence/datacache/TestStatistics.java>:[165,16]
cannot find symbol
symbol  : class CachedEntityStatistics
location: class org.apache.openjpa.persistence.datacache.TestStatistics

[ERROR] <https://hudson.apache.org/hudson/job/OpenJPA-trunk-deploy/ws/trunk/openjpa-persistence-jdbc/src/test/java/org/apache/openjpa/persistence/datacache/TestStatistics.java>:[165,74]
cannot find symbol
symbol  : class CachedEntityStatistics
location: class org.apache.openjpa.persistence.datacache.TestStatistics

[ERROR] <https://hudson.apache.org/hudson/job/OpenJPA-trunk-deploy/ws/trunk/openjpa-persistence-jdbc/src/test/java/org/apache/openjpa/persistence/datacache/TestStatistics.java>:[190,23]
cannot find symbol
symbol  : class CachedEntityStatistics
location: class org.apache.openjpa.persistence.datacache.TestStatistics

[ERROR] <https://hudson.apache.org/hudson/job/OpenJPA-trunk-deploy/ws/trunk/openjpa-persistence-jdbc/src/test/java/org/apache/openjpa/persistence/datacache/TestStatistics.java>:[197,8]
cannot find symbol
symbol  : class CachedEntityStatistics
location: class org.apache.openjpa.persistence.datacache.TestStatistics

[ERROR] <https://hudson.apache.org/hudson/job/OpenJPA-trunk-deploy/ws/trunk/openjpa-persistence-jdbc/src/test/java/org/apache/openjpa/persistence/datacache/TestStatistics.java>:[197,42]
cannot find symbol
symbol  : class CachedEntityStatistics
location: class org.apache.openjpa.persistence.datacache.TestStatistics

[ERROR] <https://hudson.apache.org/hudson/job/OpenJPA-trunk-deploy/ws/trunk/openjpa-persistence-jdbc/src/test/java/org/apache/openjpa/persistence/datacache/TestStatistics.java>:[198,26]
cannot find symbol
symbol  : class CachedEntityStatistics
location: class org.apache.openjpa.persistence.datacache.TestStatistics

[ERROR] <https://hudson.apache.org/hudson/job/OpenJPA-trunk-deploy/ws/trunk/openjpa-persistence-jdbc/src/test/java/org/apache/openjpa/persistence/datacache/TestStatistics.java>:[199,26]
cannot find symbol
symbol  : class CachedEntityStatistics
location: class org.apache.openjpa.persistence.datacache.TestStatistics

[ERROR] <https://hudson.apache.org/hudson/job/OpenJPA-trunk-deploy/ws/trunk/openjpa-persistence-jdbc/src/test/java/org/apache/openjpa/persistence/datacache/TestStatistics.java>:[200,25]
cannot find symbol
symbol  : class CachedEntityStatistics
location: class org.apache.openjpa.persistence.datacache.TestStatistics

[ERROR] <https://hudson.apache.org/hudson/job/OpenJPA-trunk-deploy/ws/trunk/openjpa-persistence-jdbc/src/test/java/org/apache/openjpa/persistence/datacache/TestStatistics.java>:[201,25]
cannot find symbol
symbol  : class CachedEntityStatistics
location: class org.apache.openjpa.persistence.datacache.TestStatistics

[ERROR] <https://hudson.apache.org/hudson/job/OpenJPA-trunk-deploy/ws/trunk/openjpa-persistence-jdbc/src/test/java/org/apache/openjpa/persistence/datacache/TestStatistics.java>:[212,8]
cannot find symbol
symbol  : class CachedEntityStatistics
location: class org.apache.openjpa.persistence.datacache.TestStatistics

[ERROR] <https://hudson.apache.org/hudson/job/OpenJPA-trunk-deploy/ws/trunk/openjpa-persistence-jdbc/src/test/java/org/apache/openjpa/persistence/datacache/TestStatistics.java>:[212,39]
cannot find symbol
symbol  : class CachedEntityStatistics
location: class org.apache.openjpa.persistence.datacache.TestStatistics

[ERROR] <https://hudson.apache.org/hudson/job/OpenJPA-trunk-deploy/ws/trunk/openjpa-persistence-jdbc/src/test/java/org/apache/openjpa/persistence/datacache/TestStatistics.java>:[230,8]
cannot find symbol
symbol  : class CachedEntityStatistics
location: class org.apache.openjpa.persistence.datacache.TestStatistics

[ERROR] <https://hudson.apache.org/hudson/job/OpenJPA-trunk-deploy/ws/trunk/openjpa-persistence-jdbc/src/test/java/org/apache/openjpa/persistence/datacache/TestStatistics.java>:[230,39]
cannot find symbol
symbol  : class CachedEntityStatistics
location: class org.apache.openjpa.persistence.datacache.TestStatistics

[ERROR] <https://hudson.apache.org/hudson/job/OpenJPA-trunk-deploy/ws/trunk/openjpa-persistence-jdbc/src/test/java/org/apache/openjpa/persistence/datacache/TestStatistics.java>:[253,13]
cannot find symbol
symbol  : class CachedEntityStatistics
location: class org.apache.openjpa.persistence.datacache.TestStatistics

[ERROR] <https://hudson.apache.org/hudson/job/OpenJPA-trunk-deploy/ws/trunk/openjpa-persistence-jdbc/src/test/java/org/apache/openjpa/persistence/datacache/TestStatistics.java>:[254,13]
cannot find symbol
symbol  : class CachedEntityStatistics
location: class org.apache.openjpa.persistence.datacache.TestStatistics

[ERROR] <https://hudson.apache.org/hudson/job/OpenJPA-trunk-deploy/ws/trunk/openjpa-persistence-jdbc/src/test/java/org/apache/openjpa/persistence/datacache/TestStatistics.java>:[257,8]
cannot find symbol
symbol  : class CachedEntityStatistics
location: class org.apache.openjpa.persistence.datacache.TestStatistics

[ERROR] <https://hudson.apache.org/hudson/job/OpenJPA-trunk-deploy/ws/trunk/openjpa-persistence-jdbc/src/test/java/org/apache/openjpa/persistence/datacache/TestStatistics.java>:[257,39]
cannot find symbol
symbol  : class CachedEntityStatistics
location: class org.apache.openjpa.persistence.datacache.TestStatistics

[ERROR] <https://hudson.apache.org/hudson/job/OpenJPA-trunk-deploy/ws/trunk/openjpa-persistence-jdbc/src/test/java/org/apache/openjpa/persistence/datacache/TestStatistics.java>:[259,26]
cannot find symbol
symbol  : class CachedEntityStatistics
location: class org.apache.openjpa.persistence.datacache.TestStatistics

[ERROR] <https://hudson.apache.org/hudson/job/OpenJPA-trunk-deploy/ws/trunk/openjpa-persistence-jdbc/src/test/java/org/apache/openjpa/persistence/datacache/TestStatistics.java>:[262,27]
cannot find symbol
symbol  : class CachedEntityStatistics
location: class org.apache.openjpa.persistence.datacache.TestStatistics

[ERROR] <https://hudson.apache.org/hudson/job/OpenJPA-trunk-deploy/ws/trunk/openjpa-persistence-jdbc/src/test/java/org/apache/openjpa/persistence/datacache/TestStatistics.java>:[263,27]
cannot find symbol
symbol  : class CachedEntityStatistics
location: class org.apache.openjpa.persistence.datacache.TestStatistics

[INFO] 36 errors 
[INFO] -------------------------------------------------------------
[HUDSON] Archiving <https://hudson.apache.org/hudson/job/OpenJPA-trunk-deploy/ws/trunk/openjpa-persistence-jdbc/pom.xml>
to /home/hudson/hudson/jobs/OpenJPA-trunk-deploy/modules/org.apache.openjpa$openjpa-persistence-jdbc/builds/2010-10-06_06-47-41/archive/org.apache.openjpa/openjpa-persistence-jdbc/2.1.0-SNAPSHOT/pom.xml
[INFO] ------------------------------------------------------------------------
[ERROR] BUILD FAILURE
[INFO] ------------------------------------------------------------------------
[INFO] Compilation failure

<https://hudson.apache.org/hudson/job/OpenJPA-trunk-deploy/ws/trunk/openjpa-persistence-jdbc/src/test/java/org/apache/openjpa/persistence/datacache/TestStatistics.java>:[252,4]
cannot find symbol
symbol  : class CachedEntityStatistics
location: class org.apache.openjpa.persistence.datacache.TestStatistics

<https://hudson.apache.org/hudson/job/OpenJPA-trunk-deploy/ws/trunk/openjpa-persistence-jdbc/src/test/java/org/apache/openjpa/persistence/datacache/TestStatistics.java>:[41,40]
cannot find symbol
symbol  : class CachedEntityStatistics
location: class org.apache.openjpa.persistence.datacache.TestStatistics

<https://hudson.apache.org/hudson/job/OpenJPA-trunk-deploy/ws/trunk/openjpa-persistence-jdbc/src/test/java/org/apache/openjpa/persistence/datacache/TestStatistics.java>:[44,37]
cannot find symbol
symbol  : class CachedEntityStatistics
location: class org.apache.openjpa.persistence.datacache.TestStatistics

<https://hudson.apache.org/hudson/job/OpenJPA-trunk-deploy/ws/trunk/openjpa-persistence-jdbc/src/test/java/org/apache/openjpa/persistence/datacache/TestStatistics.java>:[84,8]
cannot find symbol
symbol  : class CachedEntityStatistics
location: class org.apache.openjpa.persistence.datacache.TestStatistics

<https://hudson.apache.org/hudson/job/OpenJPA-trunk-deploy/ws/trunk/openjpa-persistence-jdbc/src/test/java/org/apache/openjpa/persistence/datacache/TestStatistics.java>:[92,8]
cannot find symbol
symbol  : class CachedEntityStatistics
location: class org.apache.openjpa.persistence.datacache.TestStatistics

<https://hudson.apache.org/hudson/job/OpenJPA-trunk-deploy/ws/trunk/openjpa-persistence-jdbc/src/test/java/org/apache/openjpa/persistence/datacache/TestStatistics.java>:[92,43]
cannot find symbol
symbol  : class CachedEntityStatistics
location: class org.apache.openjpa.persistence.datacache.TestStatistics

<https://hudson.apache.org/hudson/job/OpenJPA-trunk-deploy/ws/trunk/openjpa-persistence-jdbc/src/test/java/org/apache/openjpa/persistence/datacache/TestStatistics.java>:[98,16]
cannot find symbol
symbol  : class CachedEntityStatistics
location: class org.apache.openjpa.persistence.datacache.TestStatistics

<https://hudson.apache.org/hudson/job/OpenJPA-trunk-deploy/ws/trunk/openjpa-persistence-jdbc/src/test/java/org/apache/openjpa/persistence/datacache/TestStatistics.java>:[106,8]
cannot find symbol
symbol  : class CachedEntityStatistics
location: class org.apache.openjpa.persistence.datacache.TestStatistics

<https://hudson.apache.org/hudson/job/OpenJPA-trunk-deploy/ws/trunk/openjpa-persistence-jdbc/src/test/java/org/apache/openjpa/persistence/datacache/TestStatistics.java>:[118,8]
cannot find symbol
symbol  : class CachedEntityStatistics
location: class org.apache.openjpa.persistence.datacache.TestStatistics

<https://hudson.apache.org/hudson/job/OpenJPA-trunk-deploy/ws/trunk/openjpa-persistence-jdbc/src/test/java/org/apache/openjpa/persistence/datacache/TestStatistics.java>:[118,43]
cannot find symbol
symbol  : class CachedEntityStatistics
location: class org.apache.openjpa.persistence.datacache.TestStatistics

<https://hudson.apache.org/hudson/job/OpenJPA-trunk-deploy/ws/trunk/openjpa-persistence-jdbc/src/test/java/org/apache/openjpa/persistence/datacache/TestStatistics.java>:[128,16]
cannot find symbol
symbol  : class CachedEntityStatistics
location: class org.apache.openjpa.persistence.datacache.TestStatistics

<https://hudson.apache.org/hudson/job/OpenJPA-trunk-deploy/ws/trunk/openjpa-persistence-jdbc/src/test/java/org/apache/openjpa/persistence/datacache/TestStatistics.java>:[128,80]
cannot find symbol
symbol  : class CachedEntityStatistics
location: class org.apache.openjpa.persistence.datacache.TestStatistics

<https://hudson.apache.org/hudson/job/OpenJPA-trunk-deploy/ws/trunk/openjpa-persistence-jdbc/src/test/java/org/apache/openjpa/persistence/datacache/TestStatistics.java>:[134,25]
cannot find symbol
symbol  : class CachedEntityStatistics
location: class org.apache.openjpa.persistence.datacache.TestStatistics

<https://hudson.apache.org/hudson/job/OpenJPA-trunk-deploy/ws/trunk/openjpa-persistence-jdbc/src/test/java/org/apache/openjpa/persistence/datacache/TestStatistics.java>:[145,20]
cannot find symbol
symbol  : class CachedEntityStatistics
location: class org.apache.openjpa.persistence.datacache.TestStatistics

<https://hudson.apache.org/hudson/job/OpenJPA-trunk-deploy/ws/trunk/openjpa-persistence-jdbc/src/test/java/org/apache/openjpa/persistence/datacache/TestStatistics.java>:[145,84]
cannot find symbol
symbol  : class CachedEntityStatistics
location: class org.apache.openjpa.persistence.datacache.TestStatistics

<https://hudson.apache.org/hudson/job/OpenJPA-trunk-deploy/ws/trunk/openjpa-persistence-jdbc/src/test/java/org/apache/openjpa/persistence/datacache/TestStatistics.java>:[148,20]
cannot find symbol
symbol  : class CachedEntityStatistics
location: class org.apache.openjpa.persistence.datacache.TestStatistics

<https://hudson.apache.org/hudson/job/OpenJPA-trunk-deploy/ws/trunk/openjpa-persistence-jdbc/src/test/java/org/apache/openjpa/persistence/datacache/TestStatistics.java>:[165,16]
cannot find symbol
symbol  : class CachedEntityStatistics
location: class org.apache.openjpa.persistence.datacache.TestStatistics

<https://hudson.apache.org/hudson/job/OpenJPA-trunk-deploy/ws/trunk/openjpa-persistence-jdbc/src/test/java/org/apache/openjpa/persistence/datacache/TestStatistics.java>:[165,74]
cannot find symbol
symbol  : class CachedEntityStatistics
location: class org.apache.openjpa.persistence.datacache.TestStatistics

<https://hudson.apache.org/hudson/job/OpenJPA-trunk-deploy/ws/trunk/openjpa-persistence-jdbc/src/test/java/org/apache/openjpa/persistence/datacache/TestStatistics.java>:[190,23]
cannot find symbol
symbol  : class CachedEntityStatistics
location: class org.apache.openjpa.persistence.datacache.TestStatistics

<https://hudson.apache.org/hudson/job/OpenJPA-trunk-deploy/ws/trunk/openjpa-persistence-jdbc/src/test/java/org/apache/openjpa/persistence/datacache/TestStatistics.java>:[197,8]
cannot find symbol
symbol  : class CachedEntityStatistics
location: class org.apache.openjpa.persistence.datacache.TestStatistics

<https://hudson.apache.org/hudson/job/OpenJPA-trunk-deploy/ws/trunk/openjpa-persistence-jdbc/src/test/java/org/apache/openjpa/persistence/datacache/TestStatistics.java>:[197,42]
cannot find symbol
symbol  : class CachedEntityStatistics
location: class org.apache.openjpa.persistence.datacache.TestStatistics

<https://hudson.apache.org/hudson/job/OpenJPA-trunk-deploy/ws/trunk/openjpa-persistence-jdbc/src/test/java/org/apache/openjpa/persistence/datacache/TestStatistics.java>:[198,26]
cannot find symbol
symbol  : class CachedEntityStatistics
location: class org.apache.openjpa.persistence.datacache.TestStatistics

<https://hudson.apache.org/hudson/job/OpenJPA-trunk-deploy/ws/trunk/openjpa-persistence-jdbc/src/test/java/org/apache/openjpa/persistence/datacache/TestStatistics.java>:[199,26]
cannot find symbol
symbol  : class CachedEntityStatistics
location: class org.apache.openjpa.persistence.datacache.TestStatistics

<https://hudson.apache.org/hudson/job/OpenJPA-trunk-deploy/ws/trunk/openjpa-persistence-jdbc/src/test/java/org/apache/openjpa/persistence/datacache/TestStatistics.java>:[200,25]
cannot find symbol
symbol  : class CachedEntityStatistics
location: class org.apache.openjpa.persistence.datacache.TestStatistics

<https://hudson.apache.org/hudson/job/OpenJPA-trunk-deploy/ws/trunk/openjpa-persistence-jdbc/src/test/java/org/apache/openjpa/persistence/datacache/TestStatistics.java>:[201,25]
cannot find symbol
symbol  : class CachedEntityStatistics
location: class org.apache.openjpa.persistence.datacache.TestStatistics

<https://hudson.apache.org/hudson/job/OpenJPA-trunk-deploy/ws/trunk/openjpa-persistence-jdbc/src/test/java/org/apache/openjpa/persistence/datacache/TestStatistics.java>:[212,8]
cannot find symbol
symbol  : class CachedEntityStatistics
location: class org.apache.openjpa.persistence.datacache.TestStatistics

<https://hudson.apache.org/hudson/job/OpenJPA-trunk-deploy/ws/trunk/openjpa-persistence-jdbc/src/test/java/org/apache/openjpa/persistence/datacache/TestStatistics.java>:[212,39]
cannot find symbol
symbol  : class CachedEntityStatistics
location: class org.apache.openjpa.persistence.datacache.TestStatistics

<https://hudson.apache.org/hudson/job/OpenJPA-trunk-deploy/ws/trunk/openjpa-persistence-jdbc/src/test/java/org/apache/openjpa/persistence/datacache/TestStatistics.java>:[230,8]
cannot find symbol
symbol  : class CachedEntityStatistics
location: class org.apache.openjpa.persistence.datacache.TestStatistics

<https://hudson.apache.org/hudson/job/OpenJPA-trunk-deploy/ws/trunk/openjpa-persistence-jdbc/src/test/java/org/apache/openjpa/persistence/datacache/TestStatistics.java>:[230,39]
cannot find symbol
symbol  : class CachedEntityStatistics
location: class org.apache.openjpa.persistence.datacache.TestStatistics

<https://hudson.apache.org/hudson/job/OpenJPA-trunk-deploy/ws/trunk/openjpa-persistence-jdbc/src/test/java/org/apache/openjpa/persistence/datacache/TestStatistics.java>:[253,13]
cannot find symbol
symbol  : class CachedEntityStatistics
location: class org.apache.openjpa.persistence.datacache.TestStatistics

<https://hudson.apache.org/hudson/job/OpenJPA-trunk-deploy/ws/trunk/openjpa-persistence-jdbc/src/test/java/org/apache/openjpa/persistence/datacache/TestStatistics.java>:[254,13]
cannot find symbol
symbol  : class CachedEntityStatistics
location: class org.apache.openjpa.persistence.datacache.TestStatistics

<https://hudson.apache.org/hudson/job/OpenJPA-trunk-deploy/ws/trunk/openjpa-persistence-jdbc/src/test/java/org/apache/openjpa/persistence/datacache/TestStatistics.java>:[257,8]
cannot find symbol
symbol  : class CachedEntityStatistics
location: class org.apache.openjpa.persistence.datacache.TestStatistics

<https://hudson.apache.org/hudson/job/OpenJPA-trunk-deploy/ws/trunk/openjpa-persistence-jdbc/src/test/java/org/apache/openjpa/persistence/datacache/TestStatistics.java>:[257,39]
cannot find symbol
symbol  : class CachedEntityStatistics
location: class org.apache.openjpa.persistence.datacache.TestStatistics

<https://hudson.apache.org/hudson/job/OpenJPA-trunk-deploy/ws/trunk/openjpa-persistence-jdbc/src/test/java/org/apache/openjpa/persistence/datacache/TestStatistics.java>:[259,26]
cannot find symbol
symbol  : class CachedEntityStatistics
location: class org.apache.openjpa.persistence.datacache.TestStatistics

<https://hudson.apache.org/hudson/job/OpenJPA-trunk-deploy/ws/trunk/openjpa-persistence-jdbc/src/test/java/org/apache/openjpa/persistence/datacache/TestStatistics.java>:[262,27]
cannot find symbol
symbol  : class CachedEntityStatistics
location: class org.apache.openjpa.persistence.datacache.TestStatistics

<https://hudson.apache.org/hudson/job/OpenJPA-trunk-deploy/ws/trunk/openjpa-persistence-jdbc/src/test/java/org/apache/openjpa/persistence/datacache/TestStatistics.java>:[263,27]
cannot find symbol
symbol  : class CachedEntityStatistics
location: class org.apache.openjpa.persistence.datacache.TestStatistics


[INFO] ------------------------------------------------------------------------
[INFO] For more information, run Maven with the -e switch
[INFO] ------------------------------------------------------------------------
[INFO] Total time: 9 minutes 
[INFO] Finished at: Wed Oct 06 06:56:51 UTC 2010
[INFO] Final Memory: 128M/520M
[INFO] ------------------------------------------------------------------------
Sending e-mails to: commits@openjpa.apache.org
Sending e-mails to: commits@openjpa.apache.org
channel stopped


Mime
View raw message