openjpa-commits mailing list archives

Site index · List index
Message view « Date » · « Thread »
Top « Date » · « Thread »
From Apache Hudson Server <hud...@hudson.apache.org>
Subject Build failed in Hudson: OpenJPA-12x #17
Date Thu, 10 Feb 2011 22:58:10 GMT
See <https://hudson.apache.org/hudson/job/OpenJPA-12x/17/changes>

Changes:

[hthomann] OPENJPA-1911: fix merge problem for entities with derived id - merged this code
from Fay's changes for trunk

------------------------------------------
[...truncated 3598 lines...]
[HUDSON] Archiving <https://hudson.apache.org/hudson/job/OpenJPA-12x/ws/1.2.x/openjpa-kernel/target/openjpa-kernel-1.2.3-SNAPSHOT.jar>
to /home/hudson/hudson/jobs/OpenJPA-12x/modules/org.apache.openjpa$openjpa-kernel/builds/2011-02-10_22-55-46/archive/org.apache.openjpa/openjpa-kernel/1.2.3-20110210.225629-16/openjpa-kernel-1.2.3-SNAPSHOT.jar
[HUDSON] Archiving <https://hudson.apache.org/hudson/job/OpenJPA-12x/ws/1.2.x/openjpa-kernel/target/openjpa-kernel-1.2.3-SNAPSHOT-tests.jar>
to /home/hudson/hudson/jobs/OpenJPA-12x/modules/org.apache.openjpa$openjpa-kernel/builds/2011-02-10_22-55-46/archive/org.apache.openjpa/openjpa-kernel/1.2.3-20110210.225629-16/openjpa-kernel-1.2.3-SNAPSHOT-tests.jar
[INFO] ------------------------------------------------------------------------
[INFO] Building OpenJPA JDBC
[INFO]    task-segment: [clean, deploy]
[INFO] ------------------------------------------------------------------------
[INFO] [clean:clean {execution: default-clean}]
[INFO] [buildnumber:create {execution: default}]
[INFO] [enforcer:enforce {execution: default}]
[INFO] [remote-resources:process {execution: default}]
[INFO] [resources:resources {execution: default-resources}]
[INFO] Using 'UTF-8' encoding to copy filtered resources.
[INFO] Copying 14 resources
[INFO] Copying 3 resources
[INFO] [compiler:compile {execution: default-compile}]
[INFO] Compiling 321 source files to <https://hudson.apache.org/hudson/job/OpenJPA-12x/ws/1.2.x/openjpa-jdbc/target/classes>
[INFO] [resources:testResources {execution: default-testResources}]
[INFO] Using 'UTF-8' encoding to copy filtered resources.
[INFO] skip non existing resourceDirectory <https://hudson.apache.org/hudson/job/OpenJPA-12x/ws/1.2.x/openjpa-jdbc/src/test/resources>
[INFO] Copying 3 resources
[INFO] [compiler:testCompile {execution: default-testCompile}]
[INFO] Compiling 1 source file to <https://hudson.apache.org/hudson/job/OpenJPA-12x/ws/1.2.x/openjpa-jdbc/target/test-classes>
[INFO] [surefire:test {execution: default-test}]
[INFO] Surefire report directory: <https://hudson.apache.org/hudson/job/OpenJPA-12x/ws/1.2.x/openjpa-jdbc/target/surefire-reports>

-------------------------------------------------------
 T E S T S
-------------------------------------------------------
Running org.apache.openjpa.jdbc.kernel.TestUpdateManagerFlushException
Tests run: 1, Failures: 0, Errors: 0, Skipped: 0, Time elapsed: 0.057 sec

Results :

Tests run: 1, Failures: 0, Errors: 0, Skipped: 0

[HUDSON] Recording test results
[INFO] [jar:jar {execution: default-jar}]
[INFO] Building jar: <https://hudson.apache.org/hudson/job/OpenJPA-12x/ws/1.2.x/openjpa-jdbc/target/openjpa-jdbc-1.2.3-SNAPSHOT.jar>
[INFO] [jar:jar {execution: default-jar}]
[INFO] [jar:test-jar {execution: attach-tests}]
[INFO] Building jar: <https://hudson.apache.org/hudson/job/OpenJPA-12x/ws/1.2.x/openjpa-jdbc/target/openjpa-jdbc-1.2.3-SNAPSHOT-tests.jar>
[INFO] [ianal:verify-legal-files {execution: default}]
[INFO] Checking legal files in: openjpa-jdbc-1.2.3-SNAPSHOT.jar
[INFO] Checking legal files in: openjpa-jdbc-1.2.3-SNAPSHOT-tests.jar
[INFO] [apache-rat:check {execution: default}]
[INFO] Exclude: **/.*/**
[INFO] Exclude: **/target/**/*
[INFO] [install:install {execution: default-install}]
[INFO] Installing <https://hudson.apache.org/hudson/job/OpenJPA-12x/ws/1.2.x/openjpa-jdbc/target/openjpa-jdbc-1.2.3-SNAPSHOT.jar>
to /home/hudson/.m2/repository/org/apache/openjpa/openjpa-jdbc/1.2.3-SNAPSHOT/openjpa-jdbc-1.2.3-SNAPSHOT.jar
[INFO] Installing <https://hudson.apache.org/hudson/job/OpenJPA-12x/ws/1.2.x/openjpa-jdbc/target/openjpa-jdbc-1.2.3-SNAPSHOT-tests.jar>
to /home/hudson/.m2/repository/org/apache/openjpa/openjpa-jdbc/1.2.3-SNAPSHOT/openjpa-jdbc-1.2.3-SNAPSHOT-tests.jar
[INFO] [deploy:deploy {execution: default-deploy}]
[INFO] Retrieving previous build number from apache.snapshots.https
Uploading: https://repository.apache.org/content/repositories/snapshots/org/apache/openjpa/openjpa-jdbc/1.2.3-SNAPSHOT/openjpa-jdbc-1.2.3-20110210.225629-16.jar
1075K uploaded  (openjpa-jdbc-1.2.3-20110210.225629-16.jar)
[INFO] Uploading project information for openjpa-jdbc 1.2.3-20110210.225629-16
[INFO] Retrieving previous metadata from apache.snapshots.https
[INFO] Uploading repository metadata for: 'artifact org.apache.openjpa:openjpa-jdbc'
[INFO] Retrieving previous metadata from apache.snapshots.https
[INFO] Uploading repository metadata for: 'snapshot org.apache.openjpa:openjpa-jdbc:1.2.3-SNAPSHOT'
[INFO] Retrieving previous build number from apache.snapshots.https
Uploading: https://repository.apache.org/content/repositories/snapshots/org/apache/openjpa/openjpa-jdbc/1.2.3-SNAPSHOT/openjpa-jdbc-1.2.3-20110210.225629-16-tests.jar
17K uploaded  (openjpa-jdbc-1.2.3-20110210.225629-16-tests.jar)
[HUDSON] Archiving <https://hudson.apache.org/hudson/job/OpenJPA-12x/ws/1.2.x/openjpa-jdbc/pom.xml>
to /home/hudson/hudson/jobs/OpenJPA-12x/modules/org.apache.openjpa$openjpa-jdbc/builds/2011-02-10_22-55-46/archive/org.apache.openjpa/openjpa-jdbc/1.2.3-SNAPSHOT/pom.xml
[HUDSON] Archiving <https://hudson.apache.org/hudson/job/OpenJPA-12x/ws/1.2.x/openjpa-jdbc/target/openjpa-jdbc-1.2.3-SNAPSHOT.jar>
to /home/hudson/hudson/jobs/OpenJPA-12x/modules/org.apache.openjpa$openjpa-jdbc/builds/2011-02-10_22-55-46/archive/org.apache.openjpa/openjpa-jdbc/1.2.3-20110210.225629-16/openjpa-jdbc-1.2.3-SNAPSHOT.jar
[HUDSON] Archiving <https://hudson.apache.org/hudson/job/OpenJPA-12x/ws/1.2.x/openjpa-jdbc/target/openjpa-jdbc-1.2.3-SNAPSHOT-tests.jar>
to /home/hudson/hudson/jobs/OpenJPA-12x/modules/org.apache.openjpa$openjpa-jdbc/builds/2011-02-10_22-55-46/archive/org.apache.openjpa/openjpa-jdbc/1.2.3-20110210.225629-16/openjpa-jdbc-1.2.3-SNAPSHOT-tests.jar
[INFO] ------------------------------------------------------------------------
[INFO] Building OpenJPA Persistence
[INFO]    task-segment: [clean, deploy]
[INFO] ------------------------------------------------------------------------
[INFO] [clean:clean {execution: default-clean}]
[INFO] [buildnumber:create {execution: default}]
[INFO] [enforcer:enforce {execution: default}]
[INFO] [remote-resources:process {execution: default}]
[INFO] [resources:resources {execution: default-resources}]
[INFO] Using 'UTF-8' encoding to copy filtered resources.
[INFO] Copying 5 resources
[INFO] Copying 3 resources
[INFO] [compiler:compile {execution: default-compile}]
[INFO] Compiling 80 source files to <https://hudson.apache.org/hudson/job/OpenJPA-12x/ws/1.2.x/openjpa-persistence/target/classes>
[INFO] [resources:testResources {execution: default-testResources}]
[INFO] Using 'UTF-8' encoding to copy filtered resources.
[INFO] skip non existing resourceDirectory <https://hudson.apache.org/hudson/job/OpenJPA-12x/ws/1.2.x/openjpa-persistence/src/test/resources>
[INFO] Copying 3 resources
[INFO] [compiler:testCompile {execution: default-testCompile}]
[INFO] Compiling 1 source file to <https://hudson.apache.org/hudson/job/OpenJPA-12x/ws/1.2.x/openjpa-persistence/target/test-classes>
[INFO] [surefire:test {execution: default-test}]
[INFO] Surefire report directory: <https://hudson.apache.org/hudson/job/OpenJPA-12x/ws/1.2.x/openjpa-persistence/target/surefire-reports>

-------------------------------------------------------
 T E S T S
-------------------------------------------------------
Running org.apache.openjpa.persistence.TestEnumToKernelConstantMappings
Tests run: 7, Failures: 0, Errors: 0, Skipped: 0, Time elapsed: 0.03 sec

Results :

Tests run: 7, Failures: 0, Errors: 0, Skipped: 0

[HUDSON] Recording test results
[INFO] [jar:jar {execution: default-jar}]
[INFO] Building jar: <https://hudson.apache.org/hudson/job/OpenJPA-12x/ws/1.2.x/openjpa-persistence/target/openjpa-persistence-1.2.3-SNAPSHOT.jar>
[INFO] [jar:jar {execution: default-jar}]
[INFO] [jar:test-jar {execution: attach-tests}]
[INFO] Building jar: <https://hudson.apache.org/hudson/job/OpenJPA-12x/ws/1.2.x/openjpa-persistence/target/openjpa-persistence-1.2.3-SNAPSHOT-tests.jar>
[INFO] [ianal:verify-legal-files {execution: default}]
[INFO] Checking legal files in: openjpa-persistence-1.2.3-SNAPSHOT.jar
[INFO] Checking legal files in: openjpa-persistence-1.2.3-SNAPSHOT-tests.jar
[INFO] [apache-rat:check {execution: default}]
[INFO] Exclude: **/.*/**
[INFO] Exclude: **/target/**/*
[INFO] [install:install {execution: default-install}]
[INFO] Installing <https://hudson.apache.org/hudson/job/OpenJPA-12x/ws/1.2.x/openjpa-persistence/target/openjpa-persistence-1.2.3-SNAPSHOT.jar>
to /home/hudson/.m2/repository/org/apache/openjpa/openjpa-persistence/1.2.3-SNAPSHOT/openjpa-persistence-1.2.3-SNAPSHOT.jar
[INFO] Installing <https://hudson.apache.org/hudson/job/OpenJPA-12x/ws/1.2.x/openjpa-persistence/target/openjpa-persistence-1.2.3-SNAPSHOT-tests.jar>
to /home/hudson/.m2/repository/org/apache/openjpa/openjpa-persistence/1.2.3-SNAPSHOT/openjpa-persistence-1.2.3-SNAPSHOT-tests.jar
[INFO] [deploy:deploy {execution: default-deploy}]
[INFO] Retrieving previous build number from apache.snapshots.https
Uploading: https://repository.apache.org/content/repositories/snapshots/org/apache/openjpa/openjpa-persistence/1.2.3-SNAPSHOT/openjpa-persistence-1.2.3-20110210.225629-16.jar
234K uploaded  (openjpa-persistence-1.2.3-20110210.225629-16.jar)
[INFO] Retrieving previous metadata from apache.snapshots.https
[INFO] Uploading repository metadata for: 'artifact org.apache.openjpa:openjpa-persistence'
[INFO] Uploading project information for openjpa-persistence 1.2.3-20110210.225629-16
[INFO] Retrieving previous metadata from apache.snapshots.https
[INFO] Uploading repository metadata for: 'snapshot org.apache.openjpa:openjpa-persistence:1.2.3-SNAPSHOT'
[INFO] Retrieving previous build number from apache.snapshots.https
Uploading: https://repository.apache.org/content/repositories/snapshots/org/apache/openjpa/openjpa-persistence/1.2.3-SNAPSHOT/openjpa-persistence-1.2.3-20110210.225629-16-tests.jar
9K uploaded  (openjpa-persistence-1.2.3-20110210.225629-16-tests.jar)
[HUDSON] Archiving <https://hudson.apache.org/hudson/job/OpenJPA-12x/ws/1.2.x/openjpa-persistence/pom.xml>
to /home/hudson/hudson/jobs/OpenJPA-12x/modules/org.apache.openjpa$openjpa-persistence/builds/2011-02-10_22-55-46/archive/org.apache.openjpa/openjpa-persistence/1.2.3-SNAPSHOT/pom.xml
[HUDSON] Archiving <https://hudson.apache.org/hudson/job/OpenJPA-12x/ws/1.2.x/openjpa-persistence/target/openjpa-persistence-1.2.3-SNAPSHOT.jar>
to /home/hudson/hudson/jobs/OpenJPA-12x/modules/org.apache.openjpa$openjpa-persistence/builds/2011-02-10_22-55-46/archive/org.apache.openjpa/openjpa-persistence/1.2.3-20110210.225629-16/openjpa-persistence-1.2.3-SNAPSHOT.jar
[HUDSON] Archiving <https://hudson.apache.org/hudson/job/OpenJPA-12x/ws/1.2.x/openjpa-persistence/target/openjpa-persistence-1.2.3-SNAPSHOT-tests.jar>
to /home/hudson/hudson/jobs/OpenJPA-12x/modules/org.apache.openjpa$openjpa-persistence/builds/2011-02-10_22-55-46/archive/org.apache.openjpa/openjpa-persistence/1.2.3-20110210.225629-16/openjpa-persistence-1.2.3-SNAPSHOT-tests.jar
[INFO] ------------------------------------------------------------------------
[INFO] Building OpenJPA Persistence JDBC
[INFO]    task-segment: [clean, deploy]
[INFO] ------------------------------------------------------------------------
[INFO] [clean:clean {execution: default-clean}]
[INFO] [buildnumber:create {execution: default}]
Downloading: http://repo1.maven.org/maven2/xerces/xercesImpl/2.0.2/xercesImpl-2.0.2.jar

[INFO] [enforcer:enforce {execution: default}]
[INFO] [remote-resources:process {execution: default}]
[INFO] [resources:resources {execution: default-resources}]
[INFO] Using 'UTF-8' encoding to copy filtered resources.
[INFO] Copying 2 resources
[INFO] Copying 3 resources
[INFO] [compiler:compile {execution: default-compile}]
[INFO] Compiling 65 source files to <https://hudson.apache.org/hudson/job/OpenJPA-12x/ws/1.2.x/openjpa-persistence-jdbc/target/classes>
[INFO] [resources:testResources {execution: default-testResources}]
[INFO] Using 'UTF-8' encoding to copy filtered resources.
[INFO] Copying 30 resources
[INFO] Copying 3 resources
[INFO] [compiler:testCompile {execution: default-testCompile}]
[INFO] Compiling 1422 source files to <https://hudson.apache.org/hudson/job/OpenJPA-12x/ws/1.2.x/openjpa-persistence-jdbc/target/test-classes>
[INFO] [antrun:run {execution: default}]
[INFO] Executing tasks

enhance:

enhance.all.entities:
     [echo]  running enhancer
org.apache.commons.lang.exception.NestableRuntimeException: Error extracting class information
from "<https://hudson.apache.org/hudson/job/OpenJPA-12x/ws/1.2.x/openjpa-persistence-jdbc/target/test-classes/org/apache/openjpa/persistence/relations/D.class".>
	at org.apache.openjpa.lib.meta.ClassArgParser.parseTypeNames(ClassArgParser.java:223)
	at org.apache.openjpa.lib.meta.ClassArgParser.parseTypes(ClassArgParser.java:161)
	at org.apache.openjpa.enhance.PCEnhancer.run(PCEnhancer.java:4552)
	at org.apache.openjpa.ant.PCEnhancerTask.executeOn(PCEnhancerTask.java:89)
	at org.apache.openjpa.lib.ant.AbstractTask.execute(AbstractTask.java:172)
	at org.apache.tools.ant.UnknownElement.execute(UnknownElement.java:288)
	at sun.reflect.GeneratedMethodAccessor36.invoke(Unknown Source)
	at sun.reflect.DelegatingMethodAccessorImpl.invoke(DelegatingMethodAccessorImpl.java:25)
	at java.lang.reflect.Method.invoke(Method.java:592)
	at org.apache.tools.ant.dispatch.DispatchUtils.execute(DispatchUtils.java:106)
	at org.apache.tools.ant.Task.perform(Task.java:348)
	at org.apache.tools.ant.Target.execute(Target.java:357)
	at org.apache.tools.ant.Target.performTasks(Target.java:385)
	at org.apache.tools.ant.Project.executeSortedTargets(Project.java:1337)
	at org.apache.tools.ant.helper.SingleCheckExecutor.executeTargets(SingleCheckExecutor.java:38)
	at org.apache.tools.ant.Project.executeTargets(Project.java:1189)
	at org.apache.tools.ant.taskdefs.Ant.execute(Ant.java:416)
	at org.apache.tools.ant.taskdefs.CallTarget.execute(CallTarget.java:105)
	at org.apache.tools.ant.UnknownElement.execute(UnknownElement.java:288)
	at sun.reflect.GeneratedMethodAccessor36.invoke(Unknown Source)
	at sun.reflect.DelegatingMethodAccessorImpl.invoke(DelegatingMethodAccessorImpl.java:25)
	at java.lang.reflect.Method.invoke(Method.java:592)
	at org.apache.tools.ant.dispatch.DispatchUtils.execute(DispatchUtils.java:106)
	at org.apache.tools.ant.Task.perform(Task.java:348)
	at org.apache.tools.ant.Target.execute(Target.java:357)
	at org.apache.tools.ant.Target.performTasks(Target.java:385)
	at org.apache.tools.ant.Project.executeSortedTargets(Project.java:1337)
	at org.apache.tools.ant.helper.SingleCheckExecutor.executeTargets(SingleCheckExecutor.java:38)
	at org.apache.tools.ant.Project.executeTargets(Project.java:1189)
	at org.apache.tools.ant.taskdefs.Ant.execute(Ant.java:416)
	at org.apache.tools.ant.UnknownElement.execute(UnknownElement.java:288)
	at sun.reflect.NativeMethodAccessorImpl.invoke0(Native Method)
	at sun.reflect.NativeMethodAccessorImpl.invoke(NativeMethodAccessorImpl.java:39)
	at sun.reflect.DelegatingMethodAccessorImpl.invoke(DelegatingMethodAccessorImpl.java:25)
	at java.lang.reflect.Method.invoke(Method.java:592)
	at org.apache.tools.ant.dispatch.DispatchUtils.execute(DispatchUtils.java:106)
	at org.apache.tools.ant.Task.perform(Task.java:348)
	at org.apache.tools.ant.Target.execute(Target.java:357)
	at org.apache.maven.plugin.antrun.AbstractAntMojo.executeTasks(AbstractAntMojo.java:118)
	at org.apache.maven.plugin.antrun.AntRunMojo.execute(AntRunMojo.java:98)
	at org.apache.maven.plugin.DefaultPluginManager.executeMojo(DefaultPluginManager.java:490)
	at hudson.maven.agent.PluginManagerInterceptor.executeMojo(PluginManagerInterceptor.java:182)
	at org.apache.maven.lifecycle.DefaultLifecycleExecutor.executeGoals(DefaultLifecycleExecutor.java:694)
	at org.apache.maven.lifecycle.DefaultLifecycleExecutor.executeGoalWithLifecycle(DefaultLifecycleExecutor.java:556)
	at org.apache.maven.lifecycle.DefaultLifecycleExecutor.executeGoal(DefaultLifecycleExecutor.java:535)
	at org.apache.maven.lifecycle.DefaultLifecycleExecutor.executeGoalAndHandleFailures(DefaultLifecycleExecutor.java:387)
	at org.apache.maven.lifecycle.DefaultLifecycleExecutor.executeTaskSegments(DefaultLifecycleExecutor.java:348)
	at org.apache.maven.lifecycle.DefaultLifecycleExecutor.execute(DefaultLifecycleExecutor.java:180)
	at org.apache.maven.lifecycle.LifecycleExecutorInterceptor.execute(LifecycleExecutorInterceptor.java:65)
	at org.apache.maven.DefaultMaven.doExecute(DefaultMaven.java:328)
	at org.apache.maven.DefaultMaven.execute(DefaultMaven.java:138)
	at org.apache.maven.cli.MavenCli.main(MavenCli.java:362)
	at sun.reflect.NativeMethodAccessorImpl.invoke0(Native Method)
	at sun.reflect.NativeMethodAccessorImpl.invoke(NativeMethodAccessorImpl.java:39)
	at sun.reflect.DelegatingMethodAccessorImpl.invoke(DelegatingMethodAccessorImpl.java:25)
	at java.lang.reflect.Method.invoke(Method.java:592)
	at org.codehaus.classworlds.Launcher.launchEnhanced(Launcher.java:315)
	at org.codehaus.classworlds.Launcher.launch(Launcher.java:255)
	at hudson.maven.agent.Main.launch(Main.java:173)
	at hudson.maven.MavenBuilder.call(MavenBuilder.java:164)
	at hudson.maven.MavenModuleSetBuild$Builder.call(MavenModuleSetBuild.java:868)
	at hudson.maven.MavenModuleSetBuild$Builder.call(MavenModuleSetBuild.java:799)
	at hudson.remoting.UserRequest.perform(UserRequest.java:114)
	at hudson.remoting.UserRequest.perform(UserRequest.java:48)
	at hudson.remoting.Request$2.run(Request.java:270)
	at java.util.concurrent.Executors$RunnableAdapter.call(Executors.java:417)
	at java.util.concurrent.FutureTask$Sync.innerRun(FutureTask.java:269)
	at java.util.concurrent.FutureTask.run(FutureTask.java:123)
	at java.util.concurrent.ThreadPoolExecutor$Worker.runTask(ThreadPoolExecutor.java:651)
	at java.util.concurrent.ThreadPoolExecutor$Worker.run(ThreadPoolExecutor.java:676)
	at java.lang.Thread.run(Thread.java:595)
Caused by: java.io.FileNotFoundException: <https://hudson.apache.org/hudson/job/OpenJPA-12x/ws/1.2.x/openjpa-persistence-jdbc/target/test-classes/org/apache/openjpa/persistence/relations/D.class>
(Too many open files)
	at java.io.FileInputStream.open(Native Method)
	at java.io.FileInputStream.<init>(FileInputStream.java:106)
	at org.apache.openjpa.lib.util.J2DoPrivHelper$28.run(J2DoPrivHelper.java:630)
	at java.security.AccessController.doPrivileged(Native Method)
	at org.apache.openjpa.lib.meta.ClassArgParser.getFromClassFile(ClassArgParser.java:303)
	at org.apache.openjpa.lib.meta.ClassArgParser.parseTypeNames(ClassArgParser.java:214)
	... 70 more
[INFO] ------------------------------------------------------------------------
[ERROR] BUILD FAILURE
[INFO] ------------------------------------------------------------------------
[INFO] <https://hudson.apache.org/hudson/job/OpenJPA-12x/ws/1.2.x/openjpa-persistence-jdbc/pom.xml>
(Too many open files)
[INFO] ------------------------------------------------------------------------
[INFO] For more information, run Maven with the -e switch
[INFO] ------------------------------------------------------------------------
[INFO] Total time: 1 minute 55 seconds
[INFO] Finished at: Thu Feb 10 14:58:09 GMT-08:00 2011
[INFO] Final Memory: 58M/171M
[INFO] ------------------------------------------------------------------------
channel stopped


Mime
View raw message