openjpa-commits mailing list archives

Site index · List index
Message view « Date » · « Thread »
Top « Date » · « Thread »
From Apache Jenkins Server <jenk...@builds.apache.org>
Subject Build failed in Jenkins: OpenJPA-trunk #675
Date Wed, 21 Mar 2012 21:47:43 GMT
See <https://builds.apache.org/job/OpenJPA-trunk/675/changes>

Changes:

[curtisr7] OPENJPA-2156: Add support for generating a final class.

------------------------------------------
[...truncated 21316 lines...]
1  locking-test  INFO   [main] openjpa.jdbc.JDBC - Using dictionary class "org.apache.openjpa.jdbc.sql.DerbyDictionary".
3  locking-test  INFO   [main] openjpa.Runtime - Starting OpenJPA 2.3.0-SNAPSHOT
0  locking-test  INFO   [main] openjpa.jdbc.JDBC - Using dictionary class "org.apache.openjpa.jdbc.sql.DerbyDictionary".
3  locking-test  INFO   [main] openjpa.Runtime - Starting OpenJPA 2.3.0-SNAPSHOT
1  locking-test  INFO   [main] openjpa.jdbc.JDBC - Using dictionary class "org.apache.openjpa.jdbc.sql.DerbyDictionary".
3  locking-test  INFO   [main] openjpa.Runtime - Starting OpenJPA 2.3.0-SNAPSHOT
0  locking-test  INFO   [main] openjpa.jdbc.JDBC - Using dictionary class "org.apache.openjpa.jdbc.sql.DerbyDictionary".
3  locking-test  INFO   [main] openjpa.Runtime - Starting OpenJPA 2.3.0-SNAPSHOT
0  locking-test  INFO   [main] openjpa.jdbc.JDBC - Using dictionary class "org.apache.openjpa.jdbc.sql.DerbyDictionary".
3  locking-test  INFO   [main] openjpa.Runtime - Starting OpenJPA 2.3.0-SNAPSHOT
0  locking-test  INFO   [main] openjpa.jdbc.JDBC - Using dictionary class "org.apache.openjpa.jdbc.sql.DerbyDictionary".
3  locking-test  INFO   [main] openjpa.Runtime - Starting OpenJPA 2.3.0-SNAPSHOT
0  locking-test  INFO   [main] openjpa.jdbc.JDBC - Using dictionary class "org.apache.openjpa.jdbc.sql.DerbyDictionary".
3  locking-test  INFO   [main] openjpa.Runtime - Starting OpenJPA 2.3.0-SNAPSHOT
Tests run: 7, Failures: 0, Errors: 0, Skipped: 0, Time elapsed: 0.464 sec
Running org.apache.openjpa.persistence.lockmgr.TestMixedLockManagerRefreshPermutation
0  locking-test  INFO   [main] openjpa.jdbc.JDBC - Using dictionary class "org.apache.openjpa.jdbc.sql.DerbyDictionary".
3  locking-test  INFO   [main] openjpa.Runtime - Starting OpenJPA 2.3.0-SNAPSHOT
0  locking-test  INFO   [main] openjpa.jdbc.JDBC - Using dictionary class "org.apache.openjpa.jdbc.sql.DerbyDictionary".
3  locking-test  INFO   [main] openjpa.Runtime - Starting OpenJPA 2.3.0-SNAPSHOT
0  locking-test  INFO   [main] openjpa.jdbc.JDBC - Using dictionary class "org.apache.openjpa.jdbc.sql.DerbyDictionary".
3  locking-test  INFO   [main] openjpa.Runtime - Starting OpenJPA 2.3.0-SNAPSHOT
1  locking-test  INFO   [main] openjpa.jdbc.JDBC - Using dictionary class "org.apache.openjpa.jdbc.sql.DerbyDictionary".
4  locking-test  INFO   [main] openjpa.Runtime - Starting OpenJPA 2.3.0-SNAPSHOT
0  locking-test  INFO   [main] openjpa.jdbc.JDBC - Using dictionary class "org.apache.openjpa.jdbc.sql.DerbyDictionary".
3  locking-test  INFO   [main] openjpa.Runtime - Starting OpenJPA 2.3.0-SNAPSHOT
0  locking-test  INFO   [main] openjpa.jdbc.JDBC - Using dictionary class "org.apache.openjpa.jdbc.sql.DerbyDictionary".
3  locking-test  INFO   [main] openjpa.Runtime - Starting OpenJPA 2.3.0-SNAPSHOT
1  locking-test  INFO   [main] openjpa.jdbc.JDBC - Using dictionary class "org.apache.openjpa.jdbc.sql.DerbyDictionary".
3  locking-test  INFO   [main] openjpa.Runtime - Starting OpenJPA 2.3.0-SNAPSHOT
0  locking-test  INFO   [main] openjpa.jdbc.JDBC - Using dictionary class "org.apache.openjpa.jdbc.sql.DerbyDictionary".
3  locking-test  INFO   [main] openjpa.Runtime - Starting OpenJPA 2.3.0-SNAPSHOT
0  locking-test  INFO   [main] openjpa.jdbc.JDBC - Using dictionary class "org.apache.openjpa.jdbc.sql.DerbyDictionary".
3  locking-test  INFO   [main] openjpa.Runtime - Starting OpenJPA 2.3.0-SNAPSHOT
0  locking-test  INFO   [main] openjpa.jdbc.JDBC - Using dictionary class "org.apache.openjpa.jdbc.sql.DerbyDictionary".
3  locking-test  INFO   [main] openjpa.Runtime - Starting OpenJPA 2.3.0-SNAPSHOT
0  locking-test  INFO   [main] openjpa.jdbc.JDBC - Using dictionary class "org.apache.openjpa.jdbc.sql.DerbyDictionary".
3  locking-test  INFO   [main] openjpa.Runtime - Starting OpenJPA 2.3.0-SNAPSHOT
0  locking-test  INFO   [main] openjpa.jdbc.JDBC - Using dictionary class "org.apache.openjpa.jdbc.sql.DerbyDictionary".
3  locking-test  INFO   [main] openjpa.Runtime - Starting OpenJPA 2.3.0-SNAPSHOT
1  locking-test  INFO   [main] openjpa.jdbc.JDBC - Using dictionary class "org.apache.openjpa.jdbc.sql.DerbyDictionary".
4  locking-test  INFO   [main] openjpa.Runtime - Starting OpenJPA 2.3.0-SNAPSHOT
0  locking-test  INFO   [main] openjpa.jdbc.JDBC - Using dictionary class "org.apache.openjpa.jdbc.sql.DerbyDictionary".
3  locking-test  INFO   [main] openjpa.Runtime - Starting OpenJPA 2.3.0-SNAPSHOT
0  locking-test  INFO   [main] openjpa.jdbc.JDBC - Using dictionary class "org.apache.openjpa.jdbc.sql.DerbyDictionary".
3  locking-test  INFO   [main] openjpa.Runtime - Starting OpenJPA 2.3.0-SNAPSHOT
0  locking-test  INFO   [main] openjpa.jdbc.JDBC - Using dictionary class "org.apache.openjpa.jdbc.sql.DerbyDictionary".
3  locking-test  INFO   [main] openjpa.Runtime - Starting OpenJPA 2.3.0-SNAPSHOT
0  locking-test  INFO   [main] openjpa.jdbc.JDBC - Using dictionary class "org.apache.openjpa.jdbc.sql.DerbyDictionary".
3  locking-test  INFO   [main] openjpa.Runtime - Starting OpenJPA 2.3.0-SNAPSHOT
1  locking-test  INFO   [main] openjpa.jdbc.JDBC - Using dictionary class "org.apache.openjpa.jdbc.sql.DerbyDictionary".
4  locking-test  INFO   [main] openjpa.Runtime - Starting OpenJPA 2.3.0-SNAPSHOT
0  locking-test  INFO   [main] openjpa.jdbc.JDBC - Using dictionary class "org.apache.openjpa.jdbc.sql.DerbyDictionary".
3  locking-test  INFO   [main] openjpa.Runtime - Starting OpenJPA 2.3.0-SNAPSHOT
0  locking-test  INFO   [main] openjpa.jdbc.JDBC - Using dictionary class "org.apache.openjpa.jdbc.sql.DerbyDictionary".
3  locking-test  INFO   [main] openjpa.Runtime - Starting OpenJPA 2.3.0-SNAPSHOT
0  locking-test  INFO   [main] openjpa.jdbc.JDBC - Using dictionary class "org.apache.openjpa.jdbc.sql.DerbyDictionary".
3  locking-test  INFO   [main] openjpa.Runtime - Starting OpenJPA 2.3.0-SNAPSHOT
1  locking-test  INFO   [main] openjpa.jdbc.JDBC - Using dictionary class "org.apache.openjpa.jdbc.sql.DerbyDictionary".
3  locking-test  INFO   [main] openjpa.Runtime - Starting OpenJPA 2.3.0-SNAPSHOT
1  locking-test  INFO   [main] openjpa.jdbc.JDBC - Using dictionary class "org.apache.openjpa.jdbc.sql.DerbyDictionary".
3  locking-test  INFO   [main] openjpa.Runtime - Starting OpenJPA 2.3.0-SNAPSHOT
1  locking-test  INFO   [main] openjpa.jdbc.JDBC - Using dictionary class "org.apache.openjpa.jdbc.sql.DerbyDictionary".
3  locking-test  INFO   [main] openjpa.Runtime - Starting OpenJPA 2.3.0-SNAPSHOT
0  locking-test  INFO   [main] openjpa.jdbc.JDBC - Using dictionary class "org.apache.openjpa.jdbc.sql.DerbyDictionary".
3  locking-test  INFO   [main] openjpa.Runtime - Starting OpenJPA 2.3.0-SNAPSHOT
Tests run: 25, Failures: 0, Errors: 0, Skipped: 0, Time elapsed: 288.873 sec
Running org.apache.openjpa.persistence.lockmgr.TestLocking
0  locking-test  INFO   [main] openjpa.Runtime - Starting OpenJPA 2.3.0-SNAPSHOT
0  locking-test  INFO   [main] openjpa.jdbc.JDBC - Using dictionary class "org.apache.openjpa.jdbc.sql.DerbyDictionary".
Tests run: 1, Failures: 0, Errors: 0, Skipped: 0, Time elapsed: 10.664 sec
Running org.apache.openjpa.persistence.lockmgr.TestMixedLockManagerFindPermutation
1  locking-test  INFO   [main] openjpa.jdbc.JDBC - Using dictionary class "org.apache.openjpa.jdbc.sql.DerbyDictionary".
4  locking-test  INFO   [main] openjpa.Runtime - Starting OpenJPA 2.3.0-SNAPSHOT
0  locking-test  INFO   [main] openjpa.jdbc.JDBC - Using dictionary class "org.apache.openjpa.jdbc.sql.DerbyDictionary".
3  locking-test  INFO   [main] openjpa.Runtime - Starting OpenJPA 2.3.0-SNAPSHOT
0  locking-test  INFO   [main] openjpa.jdbc.JDBC - Using dictionary class "org.apache.openjpa.jdbc.sql.DerbyDictionary".
3  locking-test  INFO   [main] openjpa.Runtime - Starting OpenJPA 2.3.0-SNAPSHOT
0  locking-test  INFO   [main] openjpa.jdbc.JDBC - Using dictionary class "org.apache.openjpa.jdbc.sql.DerbyDictionary".
3  locking-test  INFO   [main] openjpa.Runtime - Starting OpenJPA 2.3.0-SNAPSHOT
1  locking-test  INFO   [main] openjpa.jdbc.JDBC - Using dictionary class "org.apache.openjpa.jdbc.sql.DerbyDictionary".
4  locking-test  INFO   [main] openjpa.Runtime - Starting OpenJPA 2.3.0-SNAPSHOT
0  locking-test  INFO   [main] openjpa.jdbc.JDBC - Using dictionary class "org.apache.openjpa.jdbc.sql.DerbyDictionary".
3  locking-test  INFO   [main] openjpa.Runtime - Starting OpenJPA 2.3.0-SNAPSHOT
1  locking-test  INFO   [main] openjpa.jdbc.JDBC - Using dictionary class "org.apache.openjpa.jdbc.sql.DerbyDictionary".
4  locking-test  INFO   [main] openjpa.Runtime - Starting OpenJPA 2.3.0-SNAPSHOT
0  locking-test  INFO   [main] openjpa.jdbc.JDBC - Using dictionary class "org.apache.openjpa.jdbc.sql.DerbyDictionary".
3  locking-test  INFO   [main] openjpa.Runtime - Starting OpenJPA 2.3.0-SNAPSHOT
0  locking-test  INFO   [main] openjpa.jdbc.JDBC - Using dictionary class "org.apache.openjpa.jdbc.sql.DerbyDictionary".
3  locking-test  INFO   [main] openjpa.Runtime - Starting OpenJPA 2.3.0-SNAPSHOT
0  locking-test  INFO   [main] openjpa.jdbc.JDBC - Using dictionary class "org.apache.openjpa.jdbc.sql.DerbyDictionary".
3  locking-test  INFO   [main] openjpa.Runtime - Starting OpenJPA 2.3.0-SNAPSHOT
0  locking-test  INFO   [main] openjpa.jdbc.JDBC - Using dictionary class "org.apache.openjpa.jdbc.sql.DerbyDictionary".
3  locking-test  INFO   [main] openjpa.Runtime - Starting OpenJPA 2.3.0-SNAPSHOT
0  locking-test  INFO   [main] openjpa.jdbc.JDBC - Using dictionary class "org.apache.openjpa.jdbc.sql.DerbyDictionary".
3  locking-test  INFO   [main] openjpa.Runtime - Starting OpenJPA 2.3.0-SNAPSHOT
1  locking-test  INFO   [main] openjpa.jdbc.JDBC - Using dictionary class "org.apache.openjpa.jdbc.sql.DerbyDictionary".
4  locking-test  INFO   [main] openjpa.Runtime - Starting OpenJPA 2.3.0-SNAPSHOT
1  locking-test  INFO   [main] openjpa.jdbc.JDBC - Using dictionary class "org.apache.openjpa.jdbc.sql.DerbyDictionary".
4  locking-test  INFO   [main] openjpa.Runtime - Starting OpenJPA 2.3.0-SNAPSHOT
1  locking-test  INFO   [main] openjpa.jdbc.JDBC - Using dictionary class "org.apache.openjpa.jdbc.sql.DerbyDictionary".
4  locking-test  INFO   [main] openjpa.Runtime - Starting OpenJPA 2.3.0-SNAPSHOT
0  locking-test  INFO   [main] openjpa.jdbc.JDBC - Using dictionary class "org.apache.openjpa.jdbc.sql.DerbyDictionary".
3  locking-test  INFO   [main] openjpa.Runtime - Starting OpenJPA 2.3.0-SNAPSHOT
0  locking-test  INFO   [main] openjpa.jdbc.JDBC - Using dictionary class "org.apache.openjpa.jdbc.sql.DerbyDictionary".
3  locking-test  INFO   [main] openjpa.Runtime - Starting OpenJPA 2.3.0-SNAPSHOT
0  locking-test  INFO   [main] openjpa.jdbc.JDBC - Using dictionary class "org.apache.openjpa.jdbc.sql.DerbyDictionary".
3  locking-test  INFO   [main] openjpa.Runtime - Starting OpenJPA 2.3.0-SNAPSHOT
0  locking-test  INFO   [main] openjpa.jdbc.JDBC - Using dictionary class "org.apache.openjpa.jdbc.sql.DerbyDictionary".
38  locking-test  INFO   [main] openjpa.Runtime - Starting OpenJPA 2.3.0-SNAPSHOT
0  locking-test  INFO   [main] openjpa.jdbc.JDBC - Using dictionary class "org.apache.openjpa.jdbc.sql.DerbyDictionary".
3  locking-test  INFO   [main] openjpa.Runtime - Starting OpenJPA 2.3.0-SNAPSHOT
0  locking-test  INFO   [main] openjpa.jdbc.JDBC - Using dictionary class "org.apache.openjpa.jdbc.sql.DerbyDictionary".
3  locking-test  INFO   [main] openjpa.Runtime - Starting OpenJPA 2.3.0-SNAPSHOT
0  locking-test  INFO   [main] openjpa.jdbc.JDBC - Using dictionary class "org.apache.openjpa.jdbc.sql.DerbyDictionary".
3  locking-test  INFO   [main] openjpa.Runtime - Starting OpenJPA 2.3.0-SNAPSHOT
0  locking-test  INFO   [main] openjpa.jdbc.JDBC - Using dictionary class "org.apache.openjpa.jdbc.sql.DerbyDictionary".
3  locking-test  INFO   [main] openjpa.Runtime - Starting OpenJPA 2.3.0-SNAPSHOT
0  locking-test  INFO   [main] openjpa.jdbc.JDBC - Using dictionary class "org.apache.openjpa.jdbc.sql.DerbyDictionary".
5  locking-test  INFO   [main] openjpa.Runtime - Starting OpenJPA 2.3.0-SNAPSHOT
0  locking-test  INFO   [main] openjpa.jdbc.JDBC - Using dictionary class "org.apache.openjpa.jdbc.sql.DerbyDictionary".
3  locking-test  INFO   [main] openjpa.Runtime - Starting OpenJPA 2.3.0-SNAPSHOT
Tests run: 25, Failures: 0, Errors: 0, Skipped: 0, Time elapsed: 377.605 sec
Running org.apache.openjpa.persistence.lockmgr.TestMixedLockManagerLockPermutation
0  locking-test  INFO   [main] openjpa.jdbc.JDBC - Using dictionary class "org.apache.openjpa.jdbc.sql.DerbyDictionary".
3  locking-test  INFO   [main] openjpa.Runtime - Starting OpenJPA 2.3.0-SNAPSHOT
0  locking-test  INFO   [main] openjpa.jdbc.JDBC - Using dictionary class "org.apache.openjpa.jdbc.sql.DerbyDictionary".
3  locking-test  INFO   [main] openjpa.Runtime - Starting OpenJPA 2.3.0-SNAPSHOT
0  locking-test  INFO   [main] openjpa.jdbc.JDBC - Using dictionary class "org.apache.openjpa.jdbc.sql.DerbyDictionary".
3  locking-test  INFO   [main] openjpa.Runtime - Starting OpenJPA 2.3.0-SNAPSHOT
0  locking-test  INFO   [main] openjpa.jdbc.JDBC - Using dictionary class "org.apache.openjpa.jdbc.sql.DerbyDictionary".
3  locking-test  INFO   [main] openjpa.Runtime - Starting OpenJPA 2.3.0-SNAPSHOT
1  locking-test  INFO   [main] openjpa.jdbc.JDBC - Using dictionary class "org.apache.openjpa.jdbc.sql.DerbyDictionary".
3  locking-test  INFO   [main] openjpa.Runtime - Starting OpenJPA 2.3.0-SNAPSHOT
0  locking-test  INFO   [main] openjpa.jdbc.JDBC - Using dictionary class "org.apache.openjpa.jdbc.sql.DerbyDictionary".
3  locking-test  INFO   [main] openjpa.Runtime - Starting OpenJPA 2.3.0-SNAPSHOT
0  locking-test  INFO   [main] openjpa.jdbc.JDBC - Using dictionary class "org.apache.openjpa.jdbc.sql.DerbyDictionary".
3  locking-test  INFO   [main] openjpa.Runtime - Starting OpenJPA 2.3.0-SNAPSHOT
1  locking-test  INFO   [main] openjpa.jdbc.JDBC - Using dictionary class "org.apache.openjpa.jdbc.sql.DerbyDictionary".
4  locking-test  INFO   [main] openjpa.Runtime - Starting OpenJPA 2.3.0-SNAPSHOT
0  locking-test  INFO   [main] openjpa.jdbc.JDBC - Using dictionary class "org.apache.openjpa.jdbc.sql.DerbyDictionary".
3  locking-test  INFO   [main] openjpa.Runtime - Starting OpenJPA 2.3.0-SNAPSHOT
1  locking-test  INFO   [main] openjpa.jdbc.JDBC - Using dictionary class "org.apache.openjpa.jdbc.sql.DerbyDictionary".
4  locking-test  INFO   [main] openjpa.Runtime - Starting OpenJPA 2.3.0-SNAPSHOT
1  locking-test  INFO   [main] openjpa.jdbc.JDBC - Using dictionary class "org.apache.openjpa.jdbc.sql.DerbyDictionary".
4  locking-test  INFO   [main] openjpa.Runtime - Starting OpenJPA 2.3.0-SNAPSHOT
1  locking-test  INFO   [main] openjpa.jdbc.JDBC - Using dictionary class "org.apache.openjpa.jdbc.sql.DerbyDictionary".
3  locking-test  INFO   [main] openjpa.Runtime - Starting OpenJPA 2.3.0-SNAPSHOT
0  locking-test  INFO   [main] openjpa.jdbc.JDBC - Using dictionary class "org.apache.openjpa.jdbc.sql.DerbyDictionary".
3  locking-test  INFO   [main] openjpa.Runtime - Starting OpenJPA 2.3.0-SNAPSHOT
0  locking-test  INFO   [main] openjpa.jdbc.JDBC - Using dictionary class "org.apache.openjpa.jdbc.sql.DerbyDictionary".
3  locking-test  INFO   [main] openjpa.Runtime - Starting OpenJPA 2.3.0-SNAPSHOT
0  locking-test  INFO   [main] openjpa.jdbc.JDBC - Using dictionary class "org.apache.openjpa.jdbc.sql.DerbyDictionary".
3  locking-test  INFO   [main] openjpa.Runtime - Starting OpenJPA 2.3.0-SNAPSHOT
0  locking-test  INFO   [main] openjpa.jdbc.JDBC - Using dictionary class "org.apache.openjpa.jdbc.sql.DerbyDictionary".
3  locking-test  INFO   [main] openjpa.Runtime - Starting OpenJPA 2.3.0-SNAPSHOT
0  locking-test  INFO   [main] openjpa.jdbc.JDBC - Using dictionary class "org.apache.openjpa.jdbc.sql.DerbyDictionary".
3  locking-test  INFO   [main] openjpa.Runtime - Starting OpenJPA 2.3.0-SNAPSHOT
0  locking-test  INFO   [main] openjpa.jdbc.JDBC - Using dictionary class "org.apache.openjpa.jdbc.sql.DerbyDictionary".
4  locking-test  INFO   [main] openjpa.Runtime - Starting OpenJPA 2.3.0-SNAPSHOT
1  locking-test  INFO   [main] openjpa.jdbc.JDBC - Using dictionary class "org.apache.openjpa.jdbc.sql.DerbyDictionary".
4  locking-test  INFO   [main] openjpa.Runtime - Starting OpenJPA 2.3.0-SNAPSHOT
[JENKINS] Recording test results1  locking-test  INFO   [main] openjpa.jdbc.JDBC - Using dictionary
class "org.apache.openjpa.jdbc.sql.DerbyDictionary".
4  locking-test  INFO   [main] openjpa.Runtime - Starting OpenJPA 2.3.0-SNAPSHOT

0  locking-test  INFO   [main] openjpa.jdbc.JDBC - Using dictionary class "org.apache.openjpa.jdbc.sql.DerbyDictionary".
3  locking-test  INFO   [main] openjpa.Runtime - Starting OpenJPA 2.3.0-SNAPSHOT
0  locking-test  INFO   [main] openjpa.jdbc.JDBC - Using dictionary class "org.apache.openjpa.jdbc.sql.DerbyDictionary".
3  locking-test  INFO   [main] openjpa.Runtime - Starting OpenJPA 2.3.0-SNAPSHOT
1  locking-test  INFO   [main] openjpa.jdbc.JDBC - Using dictionary class "org.apache.openjpa.jdbc.sql.DerbyDictionary".
4  locking-test  INFO   [main] openjpa.Runtime - Starting OpenJPA 2.3.0-SNAPSHOT
0  locking-test  INFO   [main] openjpa.jdbc.JDBC - Using dictionary class "org.apache.openjpa.jdbc.sql.DerbyDictionary".
3  locking-test  INFO   [main] openjpa.Runtime - Starting OpenJPA 2.3.0-SNAPSHOT
Build timed out (after 162 minutes). Marking the build as failed.
0  locking-test  INFO   [main] openjpa.jdbc.JDBC - Using dictionary class "org.apache.openjpa.jdbc.sql.DerbyDictionary".
3  locking-test  INFO   [main] openjpa.Runtime - Starting OpenJPA 2.3.0-SNAPSHOT
Tests run: 25, Failures: 0, Errors: 0, Skipped: 0, Time elapsed: 378.574 sec

Results :

Tests run: 197, Failures: 0, Errors: 0, Skipped: 0

[INFO] ------------------------------------------------------------------------
[ERROR] FATAL ERROR
[INFO] ------------------------------------------------------------------------
channel stopped
[INFO] hudson.remoting.RequestAbortedException: hudson.remoting.Channel$OrderlyShutdown
[INFO] ------------------------------------------------------------------------
[INFO] Trace
hudson.remoting.RequestAbortedException: hudson.remoting.RequestAbortedException: hudson.remoting.Channel$OrderlyShutdown
	at hudson.remoting.Request.call(Request.java:149)
	at hudson.remoting.Channel.call(Channel.java:681)
	at hudson.remoting.RemoteInvocationHandler.invoke(RemoteInvocationHandler.java:158)
	at $Proxy2.isArchivingDisabled(Unknown Source)
	at hudson.maven.MavenBuildProxy$Filter.isArchivingDisabled(MavenBuildProxy.java:227)
	at hudson.maven.reporters.MavenArtifact.archive(MavenArtifact.java:223)
	at hudson.maven.reporters.MavenArtifactArchiver.postBuild(MavenArtifactArchiver.java:106)
	at hudson.maven.Maven2Builder.postModule(Maven2Builder.java:127)
	at hudson.maven.MavenBuilder$Adapter.fireLeaveModule(MavenBuilder.java:327)
	at hudson.maven.MavenBuilder$Adapter.postBuild(MavenBuilder.java:285)
	at org.apache.maven.lifecycle.LifecycleExecutorInterceptor.execute(LifecycleExecutorInterceptor.java:68)
	at org.apache.maven.DefaultMaven.doExecute(DefaultMaven.java:328)
	at org.apache.maven.DefaultMaven.execute(DefaultMaven.java:138)
	at org.apache.maven.cli.MavenCli.main(MavenCli.java:362)
	at sun.reflect.NativeMethodAccessorImpl.invoke0(Native Method)
	at sun.reflect.NativeMethodAccessorImpl.invoke(NativeMethodAccessorImpl.java:39)
	at sun.reflect.DelegatingMethodAccessorImpl.invoke(DelegatingMethodAccessorImpl.java:25)
	at java.lang.reflect.Method.invoke(Method.java:597)
	at org.codehaus.classworlds.Launcher.launchEnhanced(Launcher.java:315)
	at org.codehaus.classworlds.Launcher.launch(Launcher.java:255)
	at hudson.maven.agent.Main.launch(Main.java:185)
	at hudson.maven.MavenBuilder.call(MavenBuilder.java:151)
	at hudson.maven.Maven2Builder.call(Maven2Builder.java:77)
	at hudson.maven.Maven2Builder.call(Maven2Builder.java:53)
	at hudson.remoting.UserRequest.perform(UserRequest.java:118)
	at hudson.remoting.UserRequest.perform(UserRequest.java:48)
	at hudson.remoting.Request$2.run(Request.java:287)
	at hudson.remoting.InterceptingExecutorService$1.call(InterceptingExecutorService.java:72)
	at java.util.concurrent.FutureTask$Sync.innerRun(FutureTask.java:303)
	at java.util.concurrent.FutureTask.run(FutureTask.java:138)
	at java.util.concurrent.ThreadPoolExecutor$Worker.runTask(ThreadPoolExecutor.java:886)
	at java.util.concurrent.ThreadPoolExecutor$Worker.run(ThreadPoolExecutor.java:908)
	at java.lang.Thread.run(Thread.java:662)
Caused by: hudson.remoting.RequestAbortedException: hudson.remoting.Channel$OrderlyShutdown
	at hudson.remoting.Request.abort(Request.java:273)
	at hudson.remoting.Channel.terminate(Channel.java:732)
	at hudson.remoting.Channel$CloseCommand.execute(Channel.java:848)
	at hudson.remoting.Channel$ReaderThread.run(Channel.java:1146)
Caused by: hudson.remoting.Channel$OrderlyShutdown
	... 2 more
Caused by: Command close created at
	at hudson.remoting.Command.<init>(Command.java:51)
	at hudson.remoting.Channel$CloseCommand.<init>(Channel.java:842)
	at hudson.remoting.Channel$CloseCommand.<init>(Channel.java:840)
	at hudson.remoting.Channel.close(Channel.java:907)
	at hudson.remoting.Channel.close(Channel.java:890)
	at hudson.slaves.Channels$1.close(Channels.java:91)
	at hudson.maven.ProcessCache$MavenProcess.discard(ProcessCache.java:145)
	at hudson.maven.MavenModuleSetBuild$RunnerImpl.doRun(MavenModuleSetBuild.java:800)
	at hudson.model.AbstractBuild$AbstractRunner.run(AbstractBuild.java:473)
	at hudson.model.Run.run(Run.java:1410)
	at hudson.maven.MavenModuleSetBuild.run(MavenModuleSetBuild.java:481)
	at hudson.model.ResourceController.execute(ResourceController.java:88)
	at hudson.model.Executor.run(Executor.java:238)
[INFO] ------------------------------------------------------------------------
[INFO] Total time: 160 minutes 18 seconds
[INFO] Finished at: Wed Mar 21 21:45:49 UTC 2012
[INFO] Final Memory: 132M/547M
[INFO] ------------------------------------------------------------------------

Mime
View raw message