openjpa-commits mailing list archives

Site index · List index
Message view « Date » · « Thread »
Top « Date » · « Thread »
From Apache Jenkins Server <jenk...@builds.apache.org>
Subject Build failed in Jenkins: OpenJPA-12x #55
Date Fri, 25 May 2012 21:49:21 GMT
See <https://builds.apache.org/job/OpenJPA-12x/55/changes>

Changes:

[allee8285] OPENJPA-2095 - JUnit 4 treats Test*.class as test case. Otherwise the following
exception will be observed.
java.lang.IllegalArgumentException: Test class can only have one constructor
    at org.junit.runners.model.TestClass.<init>(TestClass.java:32)
    at org.junit.runners.ParentRunner.<init>(ParentRunner.java:54)
    
Rename entity classes prefix Test* to avoid the problem.

------------------------------------------
[...truncated 3 lines...]
U         openjpa-kernel/src/main/java/org/apache/openjpa/kernel/BrokerImpl.java
D         openjpa-persistence-jdbc/src/test/java/org/apache/openjpa/persistence/simple/TestEntityWithTimestampPK.java
A         openjpa-persistence-jdbc/src/test/java/org/apache/openjpa/persistence/simple/EntityWithTimestampPK.java
U         openjpa-persistence-jdbc/src/test/java/org/apache/openjpa/persistence/jdbc/kernel/TestBatchFlushWithMetadataException.java
D         openjpa-persistence-jdbc/src/test/java/org/apache/openjpa/persistence/jdbc/common/apps/TestItemWithFailedExternalizer.java
A         openjpa-persistence-jdbc/src/test/java/org/apache/openjpa/persistence/jdbc/common/apps/EntityWithFailedExternalizer.java
U         openjpa-persistence-jdbc/src/test/java/org/apache/openjpa/persistence/jdbc/TestTimestampPKDeletion.java
U         openjpa-persistence-jdbc/src/test/java/org/apache/openjpa/persistence/query/TestSimple.java
At revision 1342807
Parsing POMs
[1.2.x] $ /home/hudson/tools/java/latest1.5/bin/java -Xmx1024m -XX:MaxPermSize=256m -cp /home/jenkins/jenkins-slave/maven-agent.jar:/home/jenkins/jenkins-slave/classworlds.jar
hudson.maven.agent.Main /home/hudson/tools/maven/apache-maven-2.2.1 /home/jenkins/jenkins-slave/slave.jar
/home/jenkins/jenkins-slave/maven-interceptor.jar 53261 /home/jenkins/jenkins-slave/maven2.1-interceptor.jar
<===[JENKINS REMOTING CAPACITY]===>   channel started
log4j:WARN No appenders could be found for logger (org.apache.commons.beanutils.converters.BooleanConverter).
log4j:WARN Please initialize the log4j system properly.
Executing Maven:  -B -f <https://builds.apache.org/job/OpenJPA-12x/ws/1.2.x/pom.xml>
-Dmaven.repo.local=/home/jenkins/jenkins-slave/maven-repositories/0 clean deploy
[INFO] Scanning for projects...
[INFO] Reactor build order: 
[INFO]   OpenJPA Parent POM
[INFO]   OpenJPA Utilities Library
[INFO]   OpenJPA Kernel
[INFO]   OpenJPA JDBC
[INFO]   OpenJPA Persistence
[INFO]   OpenJPA Persistence JDBC
[INFO]   OpenJPA XML Store
[INFO]   OpenJPA Slice
[INFO]   OpenJPA Aggregate Jar
[INFO]   OpenJPA Project Docs and Assemblies
[INFO]   OpenJPA Examples
[INFO]   OpenJPA Integration Tests
[INFO]   OpenJPA Integration Tests - Examples
[INFO]   OpenJPA Integration Tests - JPA TCK
[INFO] ------------------------------------------------------------------------
[INFO] Building OpenJPA Parent POM
[INFO]    task-segment: [clean, deploy]
[INFO] ------------------------------------------------------------------------
[INFO] [clean:clean {execution: default-clean}]
[INFO] Deleting file set: <https://builds.apache.org/job/OpenJPA-12x/ws/1.2.x/target>
(included: [**], excluded: [])
[INFO] [buildnumber:create {execution: default}]
[INFO] Checking for local modifications: skipped.
[INFO] Updating project files from SCM: skipped.
[INFO] Executing: /bin/sh -c cd <https://builds.apache.org/job/OpenJPA-12x/ws/1.2.x>
&& svn --non-interactive info
[INFO] Working directory: <https://builds.apache.org/job/OpenJPA-12x/ws/1.2.x>
[INFO] Storing buildNumber: 1342802 at timestamp: May 25, 2012 at 9:32 PM
[INFO] Executing: /bin/sh -c cd <https://builds.apache.org/job/OpenJPA-12x/ws/1.2.x>
&& svn --non-interactive info
[INFO] Working directory: <https://builds.apache.org/job/OpenJPA-12x/ws/1.2.x>
[INFO] Storing buildScmBranch: branches/1.2.x
[INFO] [enforcer:enforce {execution: default}]
[INFO] Setting property: classpath.resource.loader.class => 'org.codehaus.plexus.velocity.ContextClassLoaderResourceLoader'.
[INFO] Setting property: velocimacro.messages.on => 'false'.
[INFO] Setting property: resource.loader => 'classpath'.
[INFO] Setting property: resource.manager.logwhenfound => 'false'.
[INFO] [remote-resources:process {execution: default}]
[INFO] [site:attach-descriptor {execution: default-attach-descriptor}]
[INFO] Parent project loaded from repository.
[INFO] [ianal:verify-legal-files {execution: default}]
[INFO] [apache-rat:check {execution: default}]
[INFO] Exclude: **/.*/**
[INFO] Exclude: **/target/**/*
[INFO] [install:install {execution: default-install}]
[INFO] Installing <https://builds.apache.org/job/OpenJPA-12x/ws/1.2.x/pom.xml> to /home/jenkins/jenkins-slave/maven-repositories/0/org/apache/openjpa/openjpa-parent/1.2.3-SNAPSHOT/openjpa-parent-1.2.3-SNAPSHOT.pom
[INFO] [deploy:deploy {execution: default-deploy}]
[INFO] Retrieving previous build number from apache.snapshots.https
[WARNING] *** CHECKSUM FAILED - Checksum failed on download: local = 'f90d0bd179b7b9cf0720fa9c8fdd7575f0f861d1';
remote = '87a2903f15d00e980d99a66250194db354cdb3a2' - RETRYING
[WARNING] *** CHECKSUM FAILED - Checksum failed on download: local = 'f90d0bd179b7b9cf0720fa9c8fdd7575f0f861d1';
remote = '87a2903f15d00e980d99a66250194db354cdb3a2' - IGNORING
Uploading: https://repository.apache.org/content/repositories/snapshots/org/apache/openjpa/openjpa-parent/1.2.3-SNAPSHOT/openjpa-parent-1.2.3-20120525.213308-49.pom
31K uploaded  (openjpa-parent-1.2.3-20120525.213308-49.pom)
[INFO] Retrieving previous metadata from apache.snapshots.https
[INFO] Uploading repository metadata for: 'artifact org.apache.openjpa:openjpa-parent'
[INFO] Retrieving previous metadata from apache.snapshots.https
[WARNING] *** CHECKSUM FAILED - Checksum failed on download: local = 'f90d0bd179b7b9cf0720fa9c8fdd7575f0f861d1';
remote = '87a2903f15d00e980d99a66250194db354cdb3a2' - RETRYING
[WARNING] *** CHECKSUM FAILED - Checksum failed on download: local = 'f90d0bd179b7b9cf0720fa9c8fdd7575f0f861d1';
remote = '87a2903f15d00e980d99a66250194db354cdb3a2' - IGNORING
[INFO] Uploading repository metadata for: 'snapshot org.apache.openjpa:openjpa-parent:1.2.3-SNAPSHOT'
[INFO] Uploading site descriptor for openjpa-parent 1.2.3-20120525.213308-49 site.xml
[JENKINS] Archiving <https://builds.apache.org/job/OpenJPA-12x/ws/1.2.x/pom.xml> to
/home/hudson/hudson/jobs/OpenJPA-12x/modules/org.apache.openjpa$openjpa-parent/builds/2012-05-25_20-49-16/archive/org.apache.openjpa/openjpa-parent/1.2.3-SNAPSHOT/openjpa-parent-1.2.3-SNAPSHOT.pom
[JENKINS] Archiving /home/jenkins/jenkins-slave/maven-repositories/0/org/apache/openjpa/openjpa-parent/1.2.3-SNAPSHOT/openjpa-parent-1.2.3-SNAPSHOT.pom
to /home/hudson/hudson/jobs/OpenJPA-12x/modules/org.apache.openjpa$openjpa-parent/builds/2012-05-25_20-49-16/archive/org.apache.openjpa/openjpa-parent/1.2.3-20120525.213308-49/openjpa-parent-1.2.3-20120525.213308-49.pom
[INFO] ------------------------------------------------------------------------
[INFO] Building OpenJPA Utilities Library
[INFO]    task-segment: [clean, deploy]
[INFO] ------------------------------------------------------------------------
[INFO] [clean:clean {execution: default-clean}]
[INFO] Deleting file set: <https://builds.apache.org/job/OpenJPA-12x/ws/1.2.x/openjpa-lib/target>
(included: [**], excluded: [])
[INFO] [buildnumber:create {execution: default}]
[INFO] [enforcer:enforce {execution: default}]
[INFO] [remote-resources:process {execution: default}]
[INFO] [resources:resources {execution: default-resources}]
[INFO] Using 'UTF-8' encoding to copy filtered resources.
[INFO] Copying 9 resources
[INFO] Copying 3 resources
[INFO] [compiler:compile {execution: default-compile}]
[INFO] Compiling 141 source files to <https://builds.apache.org/job/OpenJPA-12x/ws/1.2.x/openjpa-lib/target/classes>
[INFO] [antrun:run {execution: set subversion revision}]
[INFO] Executing tasks
     [echo] Revision: 422266:1342802
     [echo] OpenJPA version: 1.2.3-SNAPSHOT
[INFO] Executed tasks
[INFO] [antrun:run {execution: delete sun.misc.Perf}]
[INFO] Executing tasks
[INFO] Executed tasks
[INFO] [resources:testResources {execution: default-testResources}]
[INFO] Using 'UTF-8' encoding to copy filtered resources.
[INFO] Copying 8 resources
[INFO] Copying 3 resources
[INFO] [compiler:testCompile {execution: default-testCompile}]
[INFO] Compiling 37 source files to <https://builds.apache.org/job/OpenJPA-12x/ws/1.2.x/openjpa-lib/target/test-classes>
[INFO] [surefire:test {execution: default-test}]
[INFO] Surefire report directory: <https://builds.apache.org/job/OpenJPA-12x/ws/1.2.x/openjpa-lib/target/surefire-reports>

-------------------------------------------------------
 T E S T S
-------------------------------------------------------
Running org.apache.openjpa.lib.util.TestParameterTemplate
Tests run: 1, Failures: 0, Errors: 0, Skipped: 0, Time elapsed: 0.027 sec
Running org.apache.openjpa.lib.util.TestUUIDGenerator
Tests run: 6, Failures: 0, Errors: 0, Skipped: 0, Time elapsed: 0.472 sec
Running org.apache.openjpa.lib.xml.TestDocTypeReader
Tests run: 3, Failures: 0, Errors: 0, Skipped: 0, Time elapsed: 0.04 sec
Running org.apache.openjpa.lib.rop.TestWindowResultList
Tests run: 17, Failures: 0, Errors: 0, Skipped: 0, Time elapsed: 0.033 sec
Running org.apache.openjpa.lib.rop.TestEagerResultList
Tests run: 17, Failures: 0, Errors: 0, Skipped: 0, Time elapsed: 0.011 sec
Running org.apache.openjpa.lib.graph.TestDepthFirstAnalysis
Tests run: 4, Failures: 0, Errors: 0, Skipped: 0, Time elapsed: 0.007 sec
Running org.apache.openjpa.lib.util.TestSimpleRegex
Tests run: 1, Failures: 0, Errors: 0, Skipped: 0, Time elapsed: 0.003 sec
Running org.apache.openjpa.lib.conf.test.TestConfigurationImpl
Tests run: 8, Failures: 0, Errors: 0, Skipped: 0, Time elapsed: 0.07 sec
Running org.apache.openjpa.lib.conf.TestConfigurations
Tests run: 3, Failures: 0, Errors: 0, Skipped: 0, Time elapsed: 0.004 sec
Running org.apache.openjpa.lib.util.concurrent.TestNullSafeConcurrentHashMap
Tests run: 5, Failures: 0, Errors: 0, Skipped: 0, Time elapsed: 0.179 sec
Running org.apache.openjpa.lib.rop.TestSoftRandomAccessResultList
Tests run: 17, Failures: 0, Errors: 0, Skipped: 0, Time elapsed: 0.02 sec
Running org.apache.openjpa.lib.rop.TestMergedResultObjectProvider
Tests run: 17, Failures: 0, Errors: 0, Skipped: 0, Time elapsed: 0.054 sec
Running org.apache.openjpa.lib.util.TestAbstractEventManager
Tests run: 2, Failures: 0, Errors: 0, Skipped: 0, Time elapsed: 0.004 sec
Running org.apache.openjpa.lib.conf.TestConfigurationProviderPrefixes
Tests run: 7, Failures: 0, Errors: 0, Skipped: 0, Time elapsed: 0.003 sec
Running org.apache.openjpa.lib.rop.TestOrderedMergedResultObjectProvider
Tests run: 17, Failures: 0, Errors: 0, Skipped: 0, Time elapsed: 0.157 sec
Running org.apache.openjpa.lib.util.TestReferenceSet
Tests run: 4, Failures: 0, Errors: 0, Skipped: 0, Time elapsed: 0.014 sec
Running org.apache.openjpa.lib.xml.TestXMLWriter
Tests run: 1, Failures: 0, Errors: 0, Skipped: 0, Time elapsed: 0.021 sec
Running org.apache.openjpa.lib.rop.TestListResultList
Tests run: 17, Failures: 0, Errors: 0, Skipped: 0, Time elapsed: 0.004 sec
Running org.apache.openjpa.lib.util.TestTypedProperties
Tests run: 4, Failures: 0, Errors: 0, Skipped: 0, Time elapsed: 0.002 sec
Running org.apache.openjpa.lib.util.TestPropertiesParser
Tests run: 13, Failures: 0, Errors: 0, Skipped: 0, Time elapsed: 0.08 sec
Running org.apache.openjpa.lib.rop.TestLazyForwardResultList
Tests run: 17, Failures: 0, Errors: 0, Skipped: 0, Time elapsed: 0.008 sec
Running org.apache.openjpa.lib.conf.test.TestPluginValue
Tests run: 3, Failures: 0, Errors: 0, Skipped: 0, Time elapsed: 0.003 sec
Running org.apache.openjpa.lib.conf.TestXMLCaseConversions
Tests run: 1, Failures: 0, Errors: 0, Skipped: 0, Time elapsed: 0.001 sec
Running org.apache.openjpa.lib.graph.TestGraph
Tests run: 3, Failures: 0, Errors: 0, Skipped: 0, Time elapsed: 0.002 sec
Running org.apache.openjpa.lib.util.TestMultiClassLoader
Tests run: 2, Failures: 0, Errors: 0, Skipped: 0, Time elapsed: 0.003 sec
Running org.apache.openjpa.lib.util.TestLocalizer
Tests run: 7, Failures: 0, Errors: 0, Skipped: 0, Time elapsed: 0.008 sec
Running org.apache.openjpa.lib.conf.TestValue
Tests run: 1, Failures: 0, Errors: 0, Skipped: 0, Time elapsed: 0.002 sec
Running org.apache.openjpa.lib.util.TestTemporaryClassLoader
Tests run: 1, Failures: 0, Errors: 0, Skipped: 0, Time elapsed: 0.004 sec
Running org.apache.openjpa.lib.rop.TestSimpleResultList
Tests run: 17, Failures: 0, Errors: 0, Skipped: 0, Time elapsed: 0.005 sec
Running org.apache.openjpa.lib.util.concurrent.TestConcurrentMap
Tests run: 4, Failures: 0, Errors: 0, Skipped: 0, Time elapsed: 2.281 sec
Running org.apache.openjpa.lib.util.TestOptions
Tests run: 2, Failures: 0, Errors: 0, Skipped: 0, Time elapsed: 0.004 sec
Running org.apache.openjpa.lib.rop.TestRangeResultObjectProvider
Tests run: 17, Failures: 0, Errors: 0, Skipped: 0, Time elapsed: 0.015 sec
Running org.apache.openjpa.lib.rop.TestRandomAccessResultList
Tests run: 17, Failures: 0, Errors: 0, Skipped: 0, Time elapsed: 0.006 sec

Results :

Tests run: 256, Failures: 0, Errors: 0, Skipped: 0

[JENKINS] Recording test results
Build timed out (after 60 minutes). Marking the build as failed.
[INFO] ------------------------------------------------------------------------
[ERROR] FATAL ERROR
[INFO] ------------------------------------------------------------------------
channel stopped
[INFO] hudson.remoting.RequestAbortedException: hudson.remoting.Channel$OrderlyShutdown
[INFO] ------------------------------------------------------------------------
[INFO] Trace
hudson.remoting.RequestAbortedException: hudson.remoting.RequestAbortedException: hudson.remoting.Channel$OrderlyShutdown
	at hudson.remoting.Request.call(Request.java:149)
	at hudson.remoting.Channel.call(Channel.java:646)
	at hudson.remoting.RemoteInvocationHandler.invoke(RemoteInvocationHandler.java:158)
	at $Proxy2.isArchivingDisabled(Unknown Source)
	at hudson.maven.MavenBuildProxy$Filter.isArchivingDisabled(MavenBuildProxy.java:227)
	at hudson.maven.reporters.MavenArtifact.archive(MavenArtifact.java:223)
	at hudson.maven.reporters.MavenArtifactArchiver.postBuild(MavenArtifactArchiver.java:108)
	at hudson.maven.Maven2Builder.postModule(Maven2Builder.java:127)
	at hudson.maven.MavenBuilder$Adapter.fireLeaveModule(MavenBuilder.java:327)
	at hudson.maven.MavenBuilder$Adapter.postBuild(MavenBuilder.java:285)
	at org.apache.maven.lifecycle.LifecycleExecutorInterceptor.execute(LifecycleExecutorInterceptor.java:68)
	at org.apache.maven.DefaultMaven.doExecute(DefaultMaven.java:328)
	at org.apache.maven.DefaultMaven.execute(DefaultMaven.java:138)
	at org.apache.maven.cli.MavenCli.main(MavenCli.java:362)
	at sun.reflect.NativeMethodAccessorImpl.invoke0(Native Method)
	at sun.reflect.NativeMethodAccessorImpl.invoke(NativeMethodAccessorImpl.java:39)
	at sun.reflect.DelegatingMethodAccessorImpl.invoke(DelegatingMethodAccessorImpl.java:25)
	at java.lang.reflect.Method.invoke(Method.java:592)
	at org.codehaus.classworlds.Launcher.launchEnhanced(Launcher.java:315)
	at org.codehaus.classworlds.Launcher.launch(Launcher.java:255)
	at hudson.maven.agent.Main.launch(Main.java:185)
	at hudson.maven.MavenBuilder.call(MavenBuilder.java:151)
	at hudson.maven.Maven2Builder.call(Maven2Builder.java:77)
	at hudson.maven.Maven2Builder.call(Maven2Builder.java:53)
	at hudson.remoting.UserRequest.perform(UserRequest.java:118)
	at hudson.remoting.UserRequest.perform(UserRequest.java:48)
	at hudson.remoting.Request$2.run(Request.java:287)
	at hudson.remoting.InterceptingExecutorService$1.call(InterceptingExecutorService.java:72)
	at java.util.concurrent.FutureTask$Sync.innerRun(FutureTask.java:269)
	at java.util.concurrent.FutureTask.run(FutureTask.java:123)
	at java.util.concurrent.ThreadPoolExecutor$Worker.runTask(ThreadPoolExecutor.java:651)
	at java.util.concurrent.ThreadPoolExecutor$Worker.run(ThreadPoolExecutor.java:676)
	at java.lang.Thread.run(Thread.java:595)
Caused by: hudson.remoting.RequestAbortedException: hudson.remoting.Channel$OrderlyShutdown
	at hudson.remoting.Request.abort(Request.java:273)
	at hudson.remoting.Channel.terminate(Channel.java:702)
	at hudson.remoting.Channel$CloseCommand.execute(Channel.java:818)
	at hudson.remoting.Channel$1.handle(Channel.java:416)
	at hudson.remoting.SynchronousCommandTransport$ReaderThread.run(SynchronousCommandTransport.java:60)
Caused by: hudson.remoting.Channel$OrderlyShutdown
	... 3 more
Caused by: Command close created at
	at hudson.remoting.Command.<init>(Command.java:54)
	at hudson.remoting.Channel$CloseCommand.<init>(Channel.java:812)
	at hudson.remoting.Channel$CloseCommand.<init>(Channel.java:810)
	at hudson.remoting.Channel.close(Channel.java:877)
	at hudson.remoting.Channel.close(Channel.java:860)
	at hudson.slaves.Channels$1.close(Channels.java:91)
	at hudson.maven.ProcessCache$MavenProcess.discard(ProcessCache.java:145)
	at hudson.maven.MavenModuleSetBuild$RunnerImpl.doRun(MavenModuleSetBuild.java:796)
	at hudson.model.AbstractBuild$AbstractRunner.run(AbstractBuild.java:480)
	at hudson.model.Run.run(Run.java:1434)
	at hudson.maven.MavenModuleSetBuild.run(MavenModuleSetBuild.java:477)
	at hudson.model.ResourceController.execute(ResourceController.java:88)
	at hudson.model.Executor.run(Executor.java:239)
[INFO] ------------------------------------------------------------------------
[INFO] Total time: 25 minutes 45 seconds
[INFO] Finished at: Fri May 25 21:49:04 UTC 2012

Mime
View raw message