openjpa-commits mailing list archives

Site index · List index
Message view « Date » · « Thread »
Top « Date » · « Thread »
From Apache Jenkins Server <jenk...@builds.apache.org>
Subject Build failed in Jenkins: OpenJPA-trunk #808
Date Fri, 28 Dec 2012 15:03:54 GMT
See <https://builds.apache.org/job/OpenJPA-trunk/808/changes>

Changes:

[hthomann] OPENJPA-2235: Updated TestIsolationFecthHint test to fix build failure.

------------------------------------------
Started by an SCM change
Building remotely on ubuntu1 in workspace <https://builds.apache.org/job/OpenJPA-trunk/ws/>
Updating https://svn.apache.org/repos/asf/openjpa/trunk
U         openjpa-jdbc/src/main/java/org/apache/openjpa/jdbc/sql/DB2Dictionary.java
U         openjpa-lib/src/main/java/org/apache/openjpa/lib/conf/Configuration.java
U         openjpa-lib/src/main/java/org/apache/openjpa/lib/conf/ConfigurationImpl.java
U         openjpa-lib/src/main/java/org/apache/openjpa/lib/conf/Configurations.java
A         openjpa-persistence-jdbc/src/test/java/org/apache/openjpa/persistence/jdbc/TestIsolationFecthHint.java
U         openjpa-persistence/src/main/java/org/apache/openjpa/persistence/criteria/PathImpl.java
U         openjpa-persistence/src/main/java/org/apache/openjpa/persistence/criteria/PredicateImpl.java
U         openjpa-persistence/src/main/java/org/apache/openjpa/persistence/meta/AnnotationProcessor6.java
U         openjpa-persistence/src/main/java/org/apache/openjpa/persistence/meta/SourceAnnotationHandler.java
U         openjpa-persistence/src/main/java/org/apache/openjpa/persistence/meta/Members.java
U         openjpa-persistence/src/main/java/org/apache/openjpa/persistence/PersistenceProviderImpl.java
At revision 1426536
Parsing POMs
[trunk] $ /home/hudson/tools/java/latest1.6/bin/java -Xmx1280m -XX:MaxPermSize=512m -cp /home/jenkins/jenkins-slave/maven-agent.jar:/home/jenkins/jenkins-slave/classworlds.jar
hudson.maven.agent.Main /home/hudson/tools/maven/apache-maven-2.2.1 /home/jenkins/jenkins-slave/slave.jar
/home/jenkins/jenkins-slave/maven-interceptor.jar 58631 /home/jenkins/jenkins-slave/maven2.1-interceptor.jar
<===[JENKINS REMOTING CAPACITY]===>channel started
   log4j:WARN No appenders could be found for logger (org.apache.commons.beanutils.converters.BooleanConverter).
log4j:WARN Please initialize the log4j system properly.
Executing Maven:  -B -f <https://builds.apache.org/job/OpenJPA-trunk/ws/trunk/pom.xml>
-Dmaven.repo.local=/home/jenkins/jenkins-slave/maven-repositories/0 clean install
[INFO] Scanning for projects...
[INFO] Reactor build order: 
[INFO]   OpenJPA Parent POM
[INFO]   OpenJPA Utilities Library
[INFO]   OpenJPA Kernel
[INFO]   OpenJPA JDBC
[INFO]   OpenJPA Persistence
[INFO]   OpenJPA Persistence JDBC
[INFO]   OpenJPA Persistence Locking Tests
[INFO]   OpenJPA tools
[INFO]   OpenJPA Maven Plugin
[INFO]   OpenJPA XML Store
[INFO]   OpenJPA Slice
[INFO]   OpenJPA JEST
[INFO]   OpenJPA Aggregate Jar
[INFO]   OpenJPA Aggregate Jar with Dependencies
[INFO]   OpenJPA Project Docs and Assemblies
[INFO]   OpenJPA Examples
[INFO]   OpenJPA Examples - Simple
[INFO]   OpenJPA Examples - image-gallery
[INFO]   OpenJPA Examples - OpenBooks
[INFO]   OpenJPA Integration Tests
[INFO]   OpenJPA Integration Tests - Daytrader
[INFO]   OpenJPA Integration Tests - Examples
[INFO]   OpenJPA Integration Tests - SLF4JLogFactory
[INFO]   OpenJPA Integration Tests - JPA TCK
[INFO]   OpenJPA Integration Tests - Bean Validation
[INFO]   OpenJPA Integration Tests - JMX Platform MBeans
[INFO]   OpenJPA Fetching Statistic Tool
[INFO]   OpenJPA Fetching Statistic Tool -- WAS Bundle
[INFO] ------------------------------------------------------------------------
[INFO] Building OpenJPA Parent POM
[INFO]    task-segment: [clean, install]
[INFO] ------------------------------------------------------------------------
[INFO] [clean:clean {execution: default-clean}]
[INFO] Deleting file set: <https://builds.apache.org/job/OpenJPA-trunk/ws/trunk/target>
(included: [**], excluded: [])
[INFO] [buildnumber:create {execution: default}]
[INFO] Checking for local modifications: skipped.
[INFO] Updating project files from SCM: skipped.
[INFO] Executing: /bin/sh -c cd <https://builds.apache.org/job/OpenJPA-trunk/ws/trunk>
&& svn --non-interactive info
[INFO] Working directory: <https://builds.apache.org/job/OpenJPA-trunk/ws/trunk>
[INFO] Storing buildNumber: 1426530 at timestamp: December 28, 2012 at 3:03 PM
[INFO] Executing: /bin/sh -c cd <https://builds.apache.org/job/OpenJPA-trunk/ws/trunk>
&& svn --non-interactive info
[INFO] Working directory: <https://builds.apache.org/job/OpenJPA-trunk/ws/trunk>
[INFO] Storing buildScmBranch: trunk
[INFO] [enforcer:enforce {execution: default}]
[INFO] Setting property: classpath.resource.loader.class => 'org.codehaus.plexus.velocity.ContextClassLoaderResourceLoader'.
[INFO] Setting property: velocimacro.messages.on => 'false'.
[INFO] Setting property: resource.loader => 'classpath'.
[INFO] Setting property: resource.manager.logwhenfound => 'false'.
[INFO] [checkstyle:checkstyle {execution: default}]
[INFO] Source directory does not exist - skipping report.
[INFO] Setting property: classpath.resource.loader.class => 'org.codehaus.plexus.velocity.ContextClassLoaderResourceLoader'.
[INFO] Setting property: velocimacro.messages.on => 'false'.
[INFO] Setting property: resource.loader => 'classpath'.
[INFO] Setting property: resource.manager.logwhenfound => 'false'.
[INFO] [remote-resources:process {execution: default}]
[INFO] [compiler:testCompile {execution: test-source-compile}]
[INFO] No sources to compile
[INFO] [site:attach-descriptor {execution: default-attach-descriptor}]
[INFO] Unable to load parent project from a relative path: Could not find the model file '<https://builds.apache.org/job/OpenJPA-trunk/ws/pom.xml'.>
for project unknown
[INFO] Parent project loaded from repository.
[INFO] [ianal:verify-legal-files {execution: default}]
[INFO] [apache-rat:check {execution: default}]
[INFO] Exclude: **/.*/**
[INFO] Exclude: **/target/**/*
[INFO] [install:install {execution: default-install}]
[INFO] Installing <https://builds.apache.org/job/OpenJPA-trunk/ws/trunk/pom.xml> to
/home/jenkins/jenkins-slave/maven-repositories/0/org/apache/openjpa/openjpa-parent/2.3.0-SNAPSHOT/openjpa-parent-2.3.0-SNAPSHOT.pom
[JENKINS] Archiving <https://builds.apache.org/job/OpenJPA-trunk/ws/trunk/pom.xml> to
/home/hudson/hudson/jobs/OpenJPA-trunk/modules/org.apache.openjpa$openjpa-parent/builds/2012-12-28_15-02-29/archive/org.apache.openjpa/openjpa-parent/2.3.0-SNAPSHOT/openjpa-parent-2.3.0-SNAPSHOT.pom
[INFO] ------------------------------------------------------------------------
[INFO] Building OpenJPA Utilities Library
[INFO]    task-segment: [clean, install]
[INFO] ------------------------------------------------------------------------
[INFO] [clean:clean {execution: default-clean}]
[INFO] Deleting file set: <https://builds.apache.org/job/OpenJPA-trunk/ws/trunk/openjpa-lib/target>
(included: [**], excluded: [])
[INFO] [buildnumber:create {execution: default}]
[INFO] [enforcer:enforce {execution: default}]
[INFO] [checkstyle:checkstyle {execution: default}]
[INFO] Starting audit...
Audit done.

[WARNING] Unable to locate Source XRef to link to - DISABLED
[INFO] [remote-resources:process {execution: default}]
[INFO] [resources:resources {execution: default-resources}]
[INFO] Using 'UTF-8' encoding to copy filtered resources.
[INFO] Copying 9 resources
[INFO] Copying 3 resources
[INFO] [compiler:compile {execution: default-compile}]
[INFO] Compiling 161 source files to <https://builds.apache.org/job/OpenJPA-trunk/ws/trunk/openjpa-lib/target/classes>
[INFO] -------------------------------------------------------------
[ERROR] COMPILATION ERROR : 
[INFO] -------------------------------------------------------------
[ERROR] <https://builds.apache.org/job/OpenJPA-trunk/ws/trunk/openjpa-lib/src/main/java/org/apache/openjpa/lib/conf/Configuration.java>:[32,37]
package org.apache.openjpa.persistence does not exist
[INFO] 1 error
[INFO] -------------------------------------------------------------
[JENKINS] Archiving <https://builds.apache.org/job/OpenJPA-trunk/ws/trunk/openjpa-lib/pom.xml>
to /home/hudson/hudson/jobs/OpenJPA-trunk/modules/org.apache.openjpa$openjpa-lib/builds/2012-12-28_15-02-29/archive/org.apache.openjpa/openjpa-lib/2.3.0-SNAPSHOT/openjpa-lib-2.3.0-SNAPSHOT.pom
[INFO] ------------------------------------------------------------------------
[ERROR] BUILD FAILURE
[INFO] ------------------------------------------------------------------------
[INFO] Compilation failure
<https://builds.apache.org/job/OpenJPA-trunk/ws/trunk/openjpa-lib/src/main/java/org/apache/openjpa/lib/conf/Configuration.java>:[32,37]
package org.apache.openjpa.persistence does not exist

[INFO] ------------------------------------------------------------------------
[INFO] For more information, run Maven with the -e switch
[INFO] ------------------------------------------------------------------------
[INFO] Total time: 57 seconds
[INFO] Finished at: Fri Dec 28 15:03:52 UTC 2012
[INFO] Final Memory: 61M/478M
[INFO] ------------------------------------------------------------------------
Sending e-mails to: commits@openjpa.apache.org
channel stopped

Mime
View raw message