openjpa-commits mailing list archives

Site index · List index
Message view « Date » · « Thread »
Top « Date » · « Thread »
From Apache Jenkins Server <jenk...@builds.apache.org>
Subject Build failed in Jenkins: OpenJPA-trunk #809
Date Fri, 28 Dec 2012 17:09:29 GMT
See <https://builds.apache.org/job/OpenJPA-trunk/809/changes>

Changes:

[ppoddar] OPENJPA-2057:remove wrong import

------------------------------------------
[...truncated 6248 lines...]
[INFO] Checking legal files in: openjpa-lib-2.3.0-SNAPSHOT-tests.jar
[INFO] [apache-rat:check {execution: default}]
[INFO] Exclude: **/.*/**
[INFO] Exclude: **/target/**/*
[INFO] [install:install {execution: default-install}]
[INFO] Installing <https://builds.apache.org/job/OpenJPA-trunk/ws/trunk/openjpa-lib/target/openjpa-lib-2.3.0-SNAPSHOT.jar>
to /home/jenkins/jenkins-slave/maven-repositories/1/org/apache/openjpa/openjpa-lib/2.3.0-SNAPSHOT/openjpa-lib-2.3.0-SNAPSHOT.jar
[INFO] Installing <https://builds.apache.org/job/OpenJPA-trunk/ws/trunk/openjpa-lib/target/openjpa-lib-2.3.0-SNAPSHOT-tests.jar>
to /home/jenkins/jenkins-slave/maven-repositories/1/org/apache/openjpa/openjpa-lib/2.3.0-SNAPSHOT/openjpa-lib-2.3.0-SNAPSHOT-tests.jar
[JENKINS] Archiving <https://builds.apache.org/job/OpenJPA-trunk/ws/trunk/openjpa-lib/pom.xml>
to /home/hudson/hudson/jobs/OpenJPA-trunk/modules/org.apache.openjpa$openjpa-lib/builds/2012-12-28_17-06-56/archive/org.apache.openjpa/openjpa-lib/2.3.0-SNAPSHOT/openjpa-lib-2.3.0-SNAPSHOT.pom
[JENKINS] Archiving <https://builds.apache.org/job/OpenJPA-trunk/ws/trunk/openjpa-lib/target/openjpa-lib-2.3.0-SNAPSHOT.jar>
to /home/hudson/hudson/jobs/OpenJPA-trunk/modules/org.apache.openjpa$openjpa-lib/builds/2012-12-28_17-06-56/archive/org.apache.openjpa/openjpa-lib/2.3.0-SNAPSHOT/openjpa-lib-2.3.0-SNAPSHOT.jar
[JENKINS] Archiving <https://builds.apache.org/job/OpenJPA-trunk/ws/trunk/openjpa-lib/target/openjpa-lib-2.3.0-SNAPSHOT-tests.jar>
to /home/hudson/hudson/jobs/OpenJPA-trunk/modules/org.apache.openjpa$openjpa-lib/builds/2012-12-28_17-06-56/archive/org.apache.openjpa/openjpa-lib/2.3.0-SNAPSHOT/openjpa-lib-2.3.0-SNAPSHOT-tests.jar
[INFO] ------------------------------------------------------------------------
[INFO] Building OpenJPA Kernel
[INFO]    task-segment: [clean, install]
[INFO] ------------------------------------------------------------------------
[INFO] [clean:clean {execution: default-clean}]
[INFO] [buildnumber:create {execution: default}]
[INFO] [enforcer:enforce {execution: default}]
[INFO] [javacc:jjtree-javacc {execution: jjtree-javacc-jpql}]
Java Compiler Compiler Version 4.0 (Tree Builder)
(type "jjtree" with no arguments for help)
Reading from file <https://builds.apache.org/job/OpenJPA-trunk/ws/trunk/openjpa-kernel/src/main/jjtree/org/apache/openjpa/kernel/jpql/JPQL.jjt>
. . .
File "<https://builds.apache.org/job/OpenJPA-trunk/ws/trunk/openjpa-kernel/target/generated-sources/jjtree/org/apache/openjpa/kernel/jpql/Node.java">
does not exist.  Will create one.
Annotated grammar generated successfully in <https://builds.apache.org/job/OpenJPA-trunk/ws/trunk/openjpa-kernel/target/generated-sources/jjtree/org/apache/openjpa/kernel/jpql/JPQL.jj>
Java Compiler Compiler Version 4.0 (Parser Generator)
(type "javacc" with no arguments for help)
Reading from file <https://builds.apache.org/job/OpenJPA-trunk/ws/trunk/openjpa-kernel/target/generated-sources/jjtree/org/apache/openjpa/kernel/jpql/JPQL.jj>
. . .
Warning: Choice conflict in (...)* construct at line 939, column 17.
         Expansion nested within construct and expansion following construct
         have common prefixes, one of which is: "+"
         Consider using a lookahead of 2 or more for nested expansion.
Warning: Choice conflict in (...)* construct at line 948, column 17.
         Expansion nested within construct and expansion following construct
         have common prefixes, one of which is: "*"
         Consider using a lookahead of 2 or more for nested expansion.
File "TokenMgrError.java" does not exist.  Will create one.
Warning: ParseException.java: File is obsolete.  Please rename or delete this file so that
a new one can be generated for you.
File "Token.java" does not exist.  Will create one.
File "JavaCharStream.java" does not exist.  Will create one.
Parser generated with 0 errors and 3 warnings.
[INFO] Processed 1 grammar
[INFO] [checkstyle:checkstyle {execution: default}]
[INFO] Starting audit...
Audit done.

[WARNING] Unable to locate Source XRef to link to - DISABLED
[INFO] [remote-resources:process {execution: default}]
[INFO] [resources:resources {execution: default-resources}]
[INFO] Using 'UTF-8' encoding to copy filtered resources.
[INFO] Copying 15 resources
[INFO] Copying 3 resources
[INFO] [compiler:compile {execution: default-compile}]
[INFO] Compiling 505 source files to <https://builds.apache.org/job/OpenJPA-trunk/ws/trunk/openjpa-kernel/target/classes>
[INFO] [antrun:run {execution: add-was-interfaces}]
[INFO] Executing tasks
[INFO] Executed tasks
[INFO] [antrun:run {execution: generate-standard-sco-proxies}]
[INFO] Executing tasks
org.apache.openjpa.util.java$sql$Date$proxy
org.apache.openjpa.util.java$sql$Time$proxy
org.apache.openjpa.util.java$sql$Timestamp$proxy
org.apache.openjpa.util.java$util$ArrayList$proxy
org.apache.openjpa.util.java$util$Date$proxy
org.apache.openjpa.util.java$util$GregorianCalendar$proxy
org.apache.openjpa.util.java$util$HashMap$proxy
org.apache.openjpa.util.java$util$HashSet$proxy
org.apache.openjpa.util.java$util$Hashtable$proxy
org.apache.openjpa.util.java$util$LinkedList$proxy
org.apache.openjpa.util.java$util$Properties$proxy
org.apache.openjpa.util.java$util$TreeMap$proxy
org.apache.openjpa.util.java$util$TreeSet$proxy
org.apache.openjpa.util.java$util$Vector$proxy
org.apache.openjpa.util.java$util$EnumMap$proxy
org.apache.openjpa.util.java$util$IdentityHashMap$proxy
org.apache.openjpa.util.java$util$LinkedHashMap$proxy
org.apache.openjpa.util.java$util$LinkedHashSet$proxy
org.apache.openjpa.util.java$util$PriorityQueue$proxy
[INFO] Executed tasks
[INFO] [compiler:testCompile {execution: test-source-compile}]
[INFO] Compiling 12 source files to <https://builds.apache.org/job/OpenJPA-trunk/ws/trunk/openjpa-kernel/target/test-classes>
[INFO] [resources:testResources {execution: default-testResources}]
[INFO] Using 'UTF-8' encoding to copy filtered resources.
[INFO] skip non existing resourceDirectory <https://builds.apache.org/job/OpenJPA-trunk/ws/trunk/openjpa-kernel/src/test/resources>
[INFO] Copying 3 resources
[INFO] [compiler:testCompile {execution: default-testCompile}]
[INFO] Nothing to compile - all classes are up to date
[WARNING] DEPRECATED [systemProperties]: Use systemPropertyVariables instead.
[INFO] [surefire:test {execution: default-test}]
[INFO] Surefire report directory: <https://builds.apache.org/job/OpenJPA-trunk/ws/trunk/openjpa-kernel/target/surefire-reports>

-------------------------------------------------------
 T E S T S
-------------------------------------------------------
Running org.apache.openjpa.meta.TestMemberProvider
Tests run: 2, Failures: 0, Errors: 0, Skipped: 0, Time elapsed: 0.044 sec
Running org.apache.openjpa.enhance.TestPCSubclassNameConversion
Tests run: 1, Failures: 0, Errors: 0, Skipped: 0, Time elapsed: 0.037 sec
Running org.apache.openjpa.conf.TestSpecification
Tests run: 3, Failures: 0, Errors: 0, Skipped: 0, Time elapsed: 0.006 sec
Running org.apache.openjpa.meta.TestJavaTypes
Tests run: 1, Failures: 0, Errors: 0, Skipped: 0, Time elapsed: 0.011 sec
Running org.apache.openjpa.meta.TestAccessCode
Tests run: 8, Failures: 0, Errors: 0, Skipped: 0, Time elapsed: 0.013 sec
Running org.apache.openjpa.enhance.TestGetDeclaredMethod
Tests run: 3, Failures: 0, Errors: 0, Skipped: 0, Time elapsed: 0.015 sec
Running org.apache.openjpa.util.TestProxyManager
Tests run: 43, Failures: 0, Errors: 0, Skipped: 0, Time elapsed: 0.267 sec
Running org.apache.openjpa.ee.TestOSGiManagedRuntime
Tests run: 4, Failures: 0, Errors: 0, Skipped: 0, Time elapsed: 0.01 sec
Running org.apache.openjpa.util.TestResultShape
Tests run: 8, Failures: 0, Errors: 0, Skipped: 0, Time elapsed: 0.011 sec
Running org.apache.openjpa.ee.TestWASManagedRuntime
Tests run: 1, Failures: 0, Errors: 0, Skipped: 0, Time elapsed: 0.031 sec

Results :

Tests run: 74, Failures: 0, Errors: 0, Skipped: 0

[JENKINS] Recording test results
[INFO] [jar:jar {execution: default-jar}]
[INFO] Building jar: <https://builds.apache.org/job/OpenJPA-trunk/ws/trunk/openjpa-kernel/target/openjpa-kernel-2.3.0-SNAPSHOT.jar>
[INFO] [jar:jar {execution: default-jar}]
[INFO] [jar:test-jar {execution: attach-tests}]
[INFO] Building jar: <https://builds.apache.org/job/OpenJPA-trunk/ws/trunk/openjpa-kernel/target/openjpa-kernel-2.3.0-SNAPSHOT-tests.jar>
[INFO] [ianal:verify-legal-files {execution: default}]
[INFO] Checking legal files in: openjpa-kernel-2.3.0-SNAPSHOT.jar
[INFO] Checking legal files in: openjpa-kernel-2.3.0-SNAPSHOT-tests.jar
[INFO] [apache-rat:check {execution: default}]
[INFO] Exclude: **/.*/**
[INFO] Exclude: **/target/**/*
[INFO] [install:install {execution: default-install}]
[INFO] Installing <https://builds.apache.org/job/OpenJPA-trunk/ws/trunk/openjpa-kernel/target/openjpa-kernel-2.3.0-SNAPSHOT.jar>
to /home/jenkins/jenkins-slave/maven-repositories/1/org/apache/openjpa/openjpa-kernel/2.3.0-SNAPSHOT/openjpa-kernel-2.3.0-SNAPSHOT.jar
[INFO] Installing <https://builds.apache.org/job/OpenJPA-trunk/ws/trunk/openjpa-kernel/target/openjpa-kernel-2.3.0-SNAPSHOT-tests.jar>
to /home/jenkins/jenkins-slave/maven-repositories/1/org/apache/openjpa/openjpa-kernel/2.3.0-SNAPSHOT/openjpa-kernel-2.3.0-SNAPSHOT-tests.jar
[JENKINS] Archiving <https://builds.apache.org/job/OpenJPA-trunk/ws/trunk/openjpa-kernel/pom.xml>
to /home/hudson/hudson/jobs/OpenJPA-trunk/modules/org.apache.openjpa$openjpa-kernel/builds/2012-12-28_17-06-56/archive/org.apache.openjpa/openjpa-kernel/2.3.0-SNAPSHOT/openjpa-kernel-2.3.0-SNAPSHOT.pom
[JENKINS] Archiving <https://builds.apache.org/job/OpenJPA-trunk/ws/trunk/openjpa-kernel/target/openjpa-kernel-2.3.0-SNAPSHOT.jar>
to /home/hudson/hudson/jobs/OpenJPA-trunk/modules/org.apache.openjpa$openjpa-kernel/builds/2012-12-28_17-06-56/archive/org.apache.openjpa/openjpa-kernel/2.3.0-SNAPSHOT/openjpa-kernel-2.3.0-SNAPSHOT.jar
[JENKINS] Archiving <https://builds.apache.org/job/OpenJPA-trunk/ws/trunk/openjpa-kernel/target/openjpa-kernel-2.3.0-SNAPSHOT-tests.jar>
to /home/hudson/hudson/jobs/OpenJPA-trunk/modules/org.apache.openjpa$openjpa-kernel/builds/2012-12-28_17-06-56/archive/org.apache.openjpa/openjpa-kernel/2.3.0-SNAPSHOT/openjpa-kernel-2.3.0-SNAPSHOT-tests.jar
[INFO] ------------------------------------------------------------------------
[INFO] Building OpenJPA JDBC
[INFO]    task-segment: [clean, install]
[INFO] ------------------------------------------------------------------------
[INFO] [clean:clean {execution: default-clean}]
[INFO] [buildnumber:create {execution: default}]
[INFO] [enforcer:enforce {execution: default}]
[INFO] [checkstyle:checkstyle {execution: default}]
[INFO] Starting audit...
Audit done.

[WARNING] Unable to locate Source XRef to link to - DISABLED
[INFO] [remote-resources:process {execution: default}]
[INFO] [resources:resources {execution: default-resources}]
[INFO] Using 'UTF-8' encoding to copy filtered resources.
[INFO] Copying 14 resources
[INFO] Copying 3 resources
[INFO] [compiler:compile {execution: default-compile}]
[INFO] Compiling 357 source files to <https://builds.apache.org/job/OpenJPA-trunk/ws/trunk/openjpa-jdbc/target/classes>
[INFO] [compiler:testCompile {execution: test-source-compile}]
[INFO] Compiling 7 source files to <https://builds.apache.org/job/OpenJPA-trunk/ws/trunk/openjpa-jdbc/target/test-classes>
[INFO] [resources:testResources {execution: default-testResources}]
[INFO] Using 'UTF-8' encoding to copy filtered resources.
[INFO] skip non existing resourceDirectory <https://builds.apache.org/job/OpenJPA-trunk/ws/trunk/openjpa-jdbc/src/test/resources>
[INFO] Copying 3 resources
[INFO] [compiler:testCompile {execution: default-testCompile}]
[INFO] Nothing to compile - all classes are up to date
[WARNING] DEPRECATED [systemProperties]: Use systemPropertyVariables instead.
[INFO] [surefire:test {execution: default-test}]
[INFO] Surefire report directory: <https://builds.apache.org/job/OpenJPA-trunk/ws/trunk/openjpa-jdbc/target/surefire-reports>

-------------------------------------------------------
 T E S T S
-------------------------------------------------------
Running org.apache.openjpa.jdbc.sql.identifier.TestDBIdentifiers
Tests run: 5, Failures: 0, Errors: 0, Skipped: 0, Time elapsed: 0.052 sec
Running org.apache.openjpa.jdbc.sql.TestDBDictionaryGeneratedSQL
Tests run: 5, Failures: 0, Errors: 0, Skipped: 0, Time elapsed: 0.254 sec
Running org.apache.openjpa.jdbc.meta.TestMappingDefaultsImpl
4  INFO   [main] openjpa.jdbc.JDBC - Using dictionary class "org.apache.openjpa.jdbc.sql.OracleDictionary".
Tests run: 1, Failures: 0, Errors: 0, Skipped: 0, Time elapsed: 0.146 sec
Running org.apache.openjpa.jdbc.sql.TestDB2Dictionary
Tests run: 5, Failures: 0, Errors: 0, Skipped: 0, Time elapsed: 0.136 sec
Running org.apache.openjpa.jdbc.sql.TestMySQLDictionary
Tests run: 3, Failures: 0, Errors: 0, Skipped: 0, Time elapsed: 0.096 sec
Running org.apache.openjpa.jdbc.kernel.TestUpdateManagerFlushException
Tests run: 1, Failures: 0, Errors: 0, Skipped: 0, Time elapsed: 0.006 sec
Running org.apache.openjpa.jdbc.sql.TestDictionaryFactory
Tests run: 1, Failures: 0, Errors: 0, Skipped: 0, Time elapsed: 0.005 sec

Results :

Tests run: 21, Failures: 0, Errors: 0, Skipped: 0

[JENKINS] Recording test results
[INFO] [jar:jar {execution: default-jar}]
[INFO] Building jar: <https://builds.apache.org/job/OpenJPA-trunk/ws/trunk/openjpa-jdbc/target/openjpa-jdbc-2.3.0-SNAPSHOT.jar>
[INFO] [jar:jar {execution: default-jar}]
[INFO] [jar:test-jar {execution: attach-tests}]
[INFO] Building jar: <https://builds.apache.org/job/OpenJPA-trunk/ws/trunk/openjpa-jdbc/target/openjpa-jdbc-2.3.0-SNAPSHOT-tests.jar>
[INFO] [ianal:verify-legal-files {execution: default}]
[INFO] Checking legal files in: openjpa-jdbc-2.3.0-SNAPSHOT.jar
[INFO] Checking legal files in: openjpa-jdbc-2.3.0-SNAPSHOT-tests.jar
[INFO] [apache-rat:check {execution: default}]
[INFO] Exclude: **/.*/**
[INFO] Exclude: **/target/**/*
[INFO] [install:install {execution: default-install}]
[INFO] Installing <https://builds.apache.org/job/OpenJPA-trunk/ws/trunk/openjpa-jdbc/target/openjpa-jdbc-2.3.0-SNAPSHOT.jar>
to /home/jenkins/jenkins-slave/maven-repositories/1/org/apache/openjpa/openjpa-jdbc/2.3.0-SNAPSHOT/openjpa-jdbc-2.3.0-SNAPSHOT.jar
[INFO] Installing <https://builds.apache.org/job/OpenJPA-trunk/ws/trunk/openjpa-jdbc/target/openjpa-jdbc-2.3.0-SNAPSHOT-tests.jar>
to /home/jenkins/jenkins-slave/maven-repositories/1/org/apache/openjpa/openjpa-jdbc/2.3.0-SNAPSHOT/openjpa-jdbc-2.3.0-SNAPSHOT-tests.jar
[JENKINS] Archiving <https://builds.apache.org/job/OpenJPA-trunk/ws/trunk/openjpa-jdbc/pom.xml>
to /home/hudson/hudson/jobs/OpenJPA-trunk/modules/org.apache.openjpa$openjpa-jdbc/builds/2012-12-28_17-06-56/archive/org.apache.openjpa/openjpa-jdbc/2.3.0-SNAPSHOT/openjpa-jdbc-2.3.0-SNAPSHOT.pom
[JENKINS] Archiving <https://builds.apache.org/job/OpenJPA-trunk/ws/trunk/openjpa-jdbc/target/openjpa-jdbc-2.3.0-SNAPSHOT.jar>
to /home/hudson/hudson/jobs/OpenJPA-trunk/modules/org.apache.openjpa$openjpa-jdbc/builds/2012-12-28_17-06-56/archive/org.apache.openjpa/openjpa-jdbc/2.3.0-SNAPSHOT/openjpa-jdbc-2.3.0-SNAPSHOT.jar
[JENKINS] Archiving <https://builds.apache.org/job/OpenJPA-trunk/ws/trunk/openjpa-jdbc/target/openjpa-jdbc-2.3.0-SNAPSHOT-tests.jar>
to /home/hudson/hudson/jobs/OpenJPA-trunk/modules/org.apache.openjpa$openjpa-jdbc/builds/2012-12-28_17-06-56/archive/org.apache.openjpa/openjpa-jdbc/2.3.0-SNAPSHOT/openjpa-jdbc-2.3.0-SNAPSHOT-tests.jar
[INFO] ------------------------------------------------------------------------
[INFO] Building OpenJPA Persistence
[INFO]    task-segment: [clean, install]
[INFO] ------------------------------------------------------------------------
[INFO] [clean:clean {execution: default-clean}]
[INFO] [buildnumber:create {execution: default}]
[INFO] [enforcer:enforce {execution: default}]
[INFO] [checkstyle:checkstyle {execution: default}]
[INFO] Starting audit...
Audit done.

[WARNING] Unable to locate Source XRef to link to - DISABLED
[INFO] [remote-resources:process {execution: default}]
[INFO] [resources:resources {execution: default-resources}]
[INFO] Using 'UTF-8' encoding to copy filtered resources.
[INFO] Copying 14 resources
[INFO] Copying 3 resources
[INFO] [compiler:compile {execution: default-compile}]
[INFO] Compiling 233 source files to <https://builds.apache.org/job/OpenJPA-trunk/ws/trunk/openjpa-persistence/target/classes>
[INFO] -------------------------------------------------------------
[ERROR] COMPILATION ERROR : 
[INFO] -------------------------------------------------------------
[ERROR] <https://builds.apache.org/job/OpenJPA-trunk/ws/trunk/openjpa-persistence/src/main/java/org/apache/openjpa/persistence/criteria/PathImpl.java>:[36,35]
package org.apache.openjpa.jdbc.meta does not exist
[INFO] 1 error
[INFO] -------------------------------------------------------------
[JENKINS] Archiving <https://builds.apache.org/job/OpenJPA-trunk/ws/trunk/openjpa-persistence/pom.xml>
to /home/hudson/hudson/jobs/OpenJPA-trunk/modules/org.apache.openjpa$openjpa-persistence/builds/2012-12-28_17-06-56/archive/org.apache.openjpa/openjpa-persistence/2.3.0-SNAPSHOT/openjpa-persistence-2.3.0-SNAPSHOT.pom
[INFO] ------------------------------------------------------------------------
[ERROR] BUILD FAILURE
[INFO] ------------------------------------------------------------------------
[INFO] Compilation failure
<https://builds.apache.org/job/OpenJPA-trunk/ws/trunk/openjpa-persistence/src/main/java/org/apache/openjpa/persistence/criteria/PathImpl.java>:[36,35]
package org.apache.openjpa.jdbc.meta does not exist

[INFO] ------------------------------------------------------------------------
[INFO] For more information, run Maven with the -e switch
[INFO] ------------------------------------------------------------------------
[INFO] Total time: 1 minute 59 seconds
[INFO] Finished at: Fri Dec 28 17:09:26 UTC 2012
[INFO] Final Memory: 89M/533M
[INFO] ------------------------------------------------------------------------
Sending e-mails to: commits@openjpa.apache.org
Sending e-mails to: commits@openjpa.apache.org
channel stopped

Mime
View raw message