openjpa-commits mailing list archives

Site index · List index
Message view « Date » · « Thread »
Top « Date » · « Thread »
From Apache Jenkins Server <jenk...@builds.apache.org>
Subject Build failed in Jenkins: OpenJPA-13x #54
Date Thu, 10 Jan 2013 16:51:25 GMT
See <https://builds.apache.org/job/OpenJPA-13x/54/changes>

Changes:

[allee8285] Switch to use www.apache.org/dist/openjpa/nightly.builds.

------------------------------------------
[...truncated 3443 lines...]
AU        openjpa-persistence/src/main/java/org/apache/openjpa/persistence/TransactionRequiredException.java
AU        openjpa-persistence/src/main/java/org/apache/openjpa/persistence/EntityNotFoundException.java
AU        openjpa-persistence/src/main/java/org/apache/openjpa/persistence/GeneratorImpl.java
AU        openjpa-persistence/src/main/java/org/apache/openjpa/persistence/QueryResultCacheImpl.java
AU        openjpa-persistence/src/main/java/org/apache/openjpa/persistence/AnnotationPersistenceMetaDataSerializer.java
AU        openjpa-persistence/src/main/java/org/apache/openjpa/persistence/KeyDependent.java
AU        openjpa-persistence/src/main/java/org/apache/openjpa/persistence/UpdateAction.java
AU        openjpa-persistence/src/main/java/org/apache/openjpa/persistence/StoreCache.java
AU        openjpa-persistence/src/main/java/org/apache/openjpa/persistence/AnnotationBuilder.java
AU        openjpa-persistence/src/main/java/org/apache/openjpa/persistence/AutoClearType.java
AU        openjpa-persistence/src/main/java/org/apache/openjpa/persistence/PersistenceProviderImpl.java
AU        openjpa-persistence/src/main/java/org/apache/openjpa/persistence/XMLPersistenceMetaDataParser.java
AU        openjpa-persistence/src/main/java/org/apache/openjpa/persistence/AutoDetachType.java
AU        openjpa-persistence/src/main/java/org/apache/openjpa/persistence/OpenJPAEntityManager.java
AU        openjpa-persistence/src/main/java/org/apache/openjpa/persistence/PersistenceExceptions.java
AU        openjpa-persistence/src/main/java/org/apache/openjpa/persistence/Generator.java
AU        openjpa-persistence/src/main/java/org/apache/openjpa/persistence/QueryResultCache.java
AU        openjpa-persistence/src/main/java/org/apache/openjpa/persistence/KeyType.java
AU        openjpa-persistence/src/main/java/org/apache/openjpa/persistence/PersistenceListenerAdapter.java
AU        openjpa-persistence/src/main/java/org/apache/openjpa/persistence/ElementType.java
AU        openjpa-persistence/src/main/java/org/apache/openjpa/persistence/OpenJPAEntityTransaction.java
AU        openjpa-persistence/src/main/java/org/apache/openjpa/persistence/OpenJPAEntityManagerSPI.java
AU        openjpa-persistence/src/main/java/org/apache/openjpa/persistence/LRS.java
AU        openjpa-persistence/src/main/java/org/apache/openjpa/persistence/LoadFetchGroup.java
AU        openjpa-persistence/src/main/java/org/apache/openjpa/persistence/InverseLogical.java
AU        openjpa-persistence/src/main/java/org/apache/openjpa/persistence/OptimisticLockException.java
AU        openjpa-persistence/src/main/java/org/apache/openjpa/persistence/Externalizer.java
AU        openjpa-persistence/src/main/java/org/apache/openjpa/persistence/PersistentCollection.java
AU        openjpa-persistence/src/main/java/org/apache/openjpa/persistence/PersistenceMetaDataDefaults.java
AU        openjpa-persistence/src/main/java/org/apache/openjpa/persistence/ElementDependent.java
AU        openjpa-persistence/src/main/java/org/apache/openjpa/persistence/OpenJPAQuery.java
AU        openjpa-persistence/src/main/java/org/apache/openjpa/persistence/FetchPlanImpl.java
AU        openjpa-persistence/src/main/java/org/apache/openjpa/persistence/NoResultException.java
A         openjpa-persistence/src/main/appended-resources
A         openjpa-persistence/src/main/appended-resources/META-INF
AU        openjpa-persistence/src/main/appended-resources/META-INF/NOTICE.vm
AU        openjpa-persistence/src/main/appended-resources/META-INF/LICENSE.vm
A         openjpa-persistence/src/main/resources
A         openjpa-persistence/src/main/resources/META-INF
A         openjpa-persistence/src/main/resources/META-INF/services
A         openjpa-persistence/src/main/resources/META-INF/services/org.apache.openjpa.lib.conf.ProductDerivation
A         openjpa-persistence/src/main/resources/META-INF/services/javax.persistence.spi.PersistenceProvider
A         openjpa-persistence/src/main/resources/org
A         openjpa-persistence/src/main/resources/org/apache
A         openjpa-persistence/src/main/resources/org/apache/openjpa
A         openjpa-persistence/src/main/resources/org/apache/openjpa/persistence
AU        openjpa-persistence/src/main/resources/org/apache/openjpa/persistence/localizer.properties
A         openjpa-persistence/src/main/resources/org/apache/openjpa/persistence/orm-xsd.rsrc
A         openjpa-persistence/src/main/resources/org/apache/openjpa/persistence/persistence-xsd.rsrc
AU        openjpa-persistence/pom.xml
 U        .
At revision 1431492
Parsing POMs
Modules changed, recalculating dependency graph
[1.3.x] $ /home/hudson/tools/java/latest1.5/bin/java -Xmx1024m -XX:MaxPermSize=256m -cp /home/jenkins/jenkins-slave/maven-agent.jar:/home/jenkins/jenkins-slave/classworlds.jar
hudson.maven.agent.Main /home/hudson/tools/maven/apache-maven-2.2.1 /home/jenkins/jenkins-slave/slave.jar
/home/jenkins/jenkins-slave/maven-interceptor.jar 34801 /home/jenkins/jenkins-slave/maven2.1-interceptor.jar
<===[JENKINS REMOTING CAPACITY]===>channel started
   log4j:WARN No appenders could be found for logger (org.apache.commons.beanutils.converters.BooleanConverter).
log4j:WARN Please initialize the log4j system properly.
Executing Maven:  -B -f <https://builds.apache.org/job/OpenJPA-13x/ws/1.3.x/pom.xml>
-Dmaven.repo.local=/home/jenkins/jenkins-slave/maven-repositories/1 clean deploy
[INFO] Scanning for projects...
[INFO] Reactor build order: 
[INFO]   OpenJPA Parent POM
[INFO]   OpenJPA Utilities Library
[INFO]   OpenJPA Kernel
[INFO]   OpenJPA JDBC
[INFO]   OpenJPA Persistence
[INFO]   OpenJPA Persistence JDBC
[INFO]   OpenJPA XML Store
[INFO]   OpenJPA Slice
[INFO]   OpenJPA Aggregate Jar
[INFO]   OpenJPA Aggregate Jar with Dependencies
[INFO]   OpenJPA Project Docs and Assemblies
[INFO]   OpenJPA Examples
[INFO]   OpenJPA Integration Tests
[INFO]   OpenJPA Integration Tests - Examples
[INFO]   OpenJPA Integration Tests - JPA TCK
[INFO] ------------------------------------------------------------------------
[INFO] Building OpenJPA Parent POM
[INFO]    task-segment: [clean, deploy]
[INFO] ------------------------------------------------------------------------
[INFO] [clean:clean {execution: default-clean}]
[INFO] [buildnumber:create {execution: default}]
[INFO] Checking for local modifications: skipped.
[INFO] Updating project files from SCM: skipped.
[INFO] Executing: /bin/sh -c cd <https://builds.apache.org/job/OpenJPA-13x/ws/1.3.x>
&& svn --non-interactive info
[INFO] Working directory: <https://builds.apache.org/job/OpenJPA-13x/ws/1.3.x>
[INFO] Storing buildNumber: 1431467 at timestamp: January 10, 2013 at 4:50 PM
[INFO] Executing: /bin/sh -c cd <https://builds.apache.org/job/OpenJPA-13x/ws/1.3.x>
&& svn --non-interactive info
[INFO] Working directory: <https://builds.apache.org/job/OpenJPA-13x/ws/1.3.x>
[INFO] Storing buildScmBranch: branches/1.3.x
[INFO] [enforcer:enforce {execution: default}]
[INFO] Setting property: classpath.resource.loader.class => 'org.codehaus.plexus.velocity.ContextClassLoaderResourceLoader'.
[INFO] Setting property: velocimacro.messages.on => 'false'.
[INFO] Setting property: resource.loader => 'classpath'.
[INFO] Setting property: resource.manager.logwhenfound => 'false'.
[INFO] [checkstyle:checkstyle {execution: default}]
[INFO] Source directory does not exist - skipping report.
[INFO] Setting property: classpath.resource.loader.class => 'org.codehaus.plexus.velocity.ContextClassLoaderResourceLoader'.
[INFO] Setting property: velocimacro.messages.on => 'false'.
[INFO] Setting property: resource.loader => 'classpath'.
[INFO] Setting property: resource.manager.logwhenfound => 'false'.
[INFO] [remote-resources:process {execution: default}]
[INFO] [site:attach-descriptor {execution: default-attach-descriptor}]
[INFO] Parent project loaded from repository.
[INFO] [ianal:verify-legal-files {execution: default}]
[INFO] [apache-rat:check {execution: default}]
[INFO] Exclude: **/.*/**
[INFO] Exclude: **/target/**/*
[INFO] [install:install {execution: default-install}]
[INFO] Installing <https://builds.apache.org/job/OpenJPA-13x/ws/1.3.x/pom.xml> to /home/jenkins/jenkins-slave/maven-repositories/1/org/apache/openjpa/openjpa-parent/1.3.0-SNAPSHOT/openjpa-parent-1.3.0-SNAPSHOT.pom
[INFO] [deploy:deploy {execution: default-deploy}]
[INFO] Retrieving previous build number from apache.snapshots.https
[WARNING] *** CHECKSUM FAILED - Checksum failed on download: local = '0c370bde1a6d705a5396e277885b858c6cfa8e2d';
remote = '7cf3c71db7db7f7f945701dabdeeb672166bcd3e' - RETRYING
[WARNING] *** CHECKSUM FAILED - Checksum failed on download: local = '0c370bde1a6d705a5396e277885b858c6cfa8e2d';
remote = '7cf3c71db7db7f7f945701dabdeeb672166bcd3e' - IGNORING
Uploading: https://repository.apache.org/content/repositories/snapshots/org/apache/openjpa/openjpa-parent/1.3.0-SNAPSHOT/openjpa-parent-1.3.0-20130110.165047-34.pom
34K uploaded  (openjpa-parent-1.3.0-20130110.165047-34.pom)
[INFO] Retrieving previous metadata from apache.snapshots.https
[INFO] Uploading repository metadata for: 'artifact org.apache.openjpa:openjpa-parent'
[INFO] Retrieving previous metadata from apache.snapshots.https
[WARNING] *** CHECKSUM FAILED - Checksum failed on download: local = '0c370bde1a6d705a5396e277885b858c6cfa8e2d';
remote = '7cf3c71db7db7f7f945701dabdeeb672166bcd3e' - RETRYING
[WARNING] *** CHECKSUM FAILED - Checksum failed on download: local = '0c370bde1a6d705a5396e277885b858c6cfa8e2d';
remote = '7cf3c71db7db7f7f945701dabdeeb672166bcd3e' - IGNORING
[INFO] Uploading repository metadata for: 'snapshot org.apache.openjpa:openjpa-parent:1.3.0-SNAPSHOT'
[INFO] Uploading site descriptor for openjpa-parent 1.3.0-20130110.165047-34 site.xml
[JENKINS] Archiving <https://builds.apache.org/job/OpenJPA-13x/ws/1.3.x/pom.xml> to
/home/hudson/hudson/jobs/OpenJPA-13x/modules/org.apache.openjpa$openjpa-parent/builds/2013-01-10_16-49-48/archive/org.apache.openjpa/openjpa-parent/1.3.0-SNAPSHOT/openjpa-parent-1.3.0-SNAPSHOT.pom
[JENKINS] Archiving /home/jenkins/jenkins-slave/maven-repositories/1/org/apache/openjpa/openjpa-parent/1.3.0-SNAPSHOT/openjpa-parent-1.3.0-SNAPSHOT.pom
to /home/hudson/hudson/jobs/OpenJPA-13x/modules/org.apache.openjpa$openjpa-parent/builds/2013-01-10_16-49-48/archive/org.apache.openjpa/openjpa-parent/1.3.0-20130110.165047-34/openjpa-parent-1.3.0-20130110.165047-34.pom
[INFO] ------------------------------------------------------------------------
[INFO] Building OpenJPA Utilities Library
[INFO]    task-segment: [clean, deploy]
[INFO] ------------------------------------------------------------------------
[INFO] [clean:clean {execution: default-clean}]
[INFO] [buildnumber:create {execution: default}]
[INFO] [enforcer:enforce {execution: default}]
[INFO] [checkstyle:checkstyle {execution: default}]
[INFO] Starting audit...
Audit done.

[WARNING] Unable to locate Source XRef to link to - DISABLED
[INFO] [remote-resources:process {execution: default}]
[INFO] [resources:resources {execution: default-resources}]
[INFO] Using 'UTF-8' encoding to copy filtered resources.
[INFO] Copying 9 resources
[INFO] Copying 3 resources
[INFO] [compiler:compile {execution: default-compile}]
[INFO] Compiling 142 source files to <https://builds.apache.org/job/OpenJPA-13x/ws/1.3.x/openjpa-lib/target/classes>
[INFO] [antrun:run {execution: set subversion revision}]
[INFO] Executing tasks
     [echo] Revision: 422266:1431467
     [echo] OpenJPA version: 1.3.0-SNAPSHOT
[INFO] Executed tasks
[INFO] [resources:testResources {execution: default-testResources}]
[INFO] Using 'UTF-8' encoding to copy filtered resources.
[INFO] Copying 8 resources
[INFO] Copying 3 resources
[INFO] [compiler:testCompile {execution: default-testCompile}]
[INFO] Compiling 37 source files to <https://builds.apache.org/job/OpenJPA-13x/ws/1.3.x/openjpa-lib/target/test-classes>
[INFO] [surefire:test {execution: default-test}]
[INFO] Surefire report directory: <https://builds.apache.org/job/OpenJPA-13x/ws/1.3.x/openjpa-lib/target/surefire-reports>

-------------------------------------------------------
 T E S T S
-------------------------------------------------------
Running org.apache.openjpa.lib.util.TestParameterTemplate
Tests run: 1, Failures: 0, Errors: 0, Skipped: 0, Time elapsed: 0.027 sec
Running org.apache.openjpa.lib.util.TestUUIDGenerator
Tests run: 7, Failures: 0, Errors: 0, Skipped: 0, Time elapsed: 0.445 sec
Running org.apache.openjpa.lib.rop.TestWindowResultList
Tests run: 17, Failures: 0, Errors: 0, Skipped: 0, Time elapsed: 0.034 sec
Running org.apache.openjpa.lib.xml.TestDocTypeReader
Tests run: 3, Failures: 0, Errors: 0, Skipped: 0, Time elapsed: 0.037 sec
Running org.apache.openjpa.lib.rop.TestEagerResultList
Tests run: 17, Failures: 0, Errors: 0, Skipped: 0, Time elapsed: 0.012 sec
Running org.apache.openjpa.lib.util.TestSimpleRegex
Tests run: 1, Failures: 0, Errors: 0, Skipped: 0, Time elapsed: 0.003 sec
Running org.apache.openjpa.lib.graph.TestDepthFirstAnalysis
Tests run: 4, Failures: 0, Errors: 0, Skipped: 0, Time elapsed: 0.007 sec
Running org.apache.openjpa.lib.conf.test.TestConfigurationImpl
Tests run: 8, Failures: 0, Errors: 0, Skipped: 0, Time elapsed: 0.069 sec
Running org.apache.openjpa.lib.conf.TestConfigurations
Tests run: 3, Failures: 0, Errors: 0, Skipped: 0, Time elapsed: 0.004 sec
Running org.apache.openjpa.lib.util.concurrent.TestNullSafeConcurrentHashMap
Tests run: 5, Failures: 0, Errors: 0, Skipped: 0, Time elapsed: 0.171 sec
Running org.apache.openjpa.lib.rop.TestSoftRandomAccessResultList
Tests run: 17, Failures: 0, Errors: 0, Skipped: 0, Time elapsed: 0.023 sec
Running org.apache.openjpa.lib.rop.TestMergedResultObjectProvider
Tests run: 17, Failures: 0, Errors: 0, Skipped: 0, Time elapsed: 0.051 sec
Running org.apache.openjpa.lib.util.TestAbstractEventManager
Tests run: 2, Failures: 0, Errors: 0, Skipped: 0, Time elapsed: 0.003 sec
Running org.apache.openjpa.lib.conf.TestConfigurationProviderPrefixes
Tests run: 7, Failures: 0, Errors: 0, Skipped: 0, Time elapsed: 0.003 sec
Running org.apache.openjpa.lib.rop.TestOrderedMergedResultObjectProvider
Tests run: 17, Failures: 0, Errors: 0, Skipped: 0, Time elapsed: 0.181 sec
Running org.apache.openjpa.lib.util.TestReferenceSet
Tests run: 4, Failures: 0, Errors: 0, Skipped: 0, Time elapsed: 0.013 sec
Running org.apache.openjpa.lib.xml.TestXMLWriter
Tests run: 1, Failures: 0, Errors: 0, Skipped: 0, Time elapsed: 0.021 sec
Running org.apache.openjpa.lib.rop.TestListResultList
Tests run: 17, Failures: 0, Errors: 0, Skipped: 0, Time elapsed: 0.005 sec
Running org.apache.openjpa.lib.util.TestTypedProperties
Tests run: 4, Failures: 0, Errors: 0, Skipped: 0, Time elapsed: 0.003 sec
Running org.apache.openjpa.lib.util.TestPropertiesParser
Tests run: 13, Failures: 0, Errors: 0, Skipped: 0, Time elapsed: 0.078 sec
Running org.apache.openjpa.lib.rop.TestLazyForwardResultList
Tests run: 17, Failures: 0, Errors: 0, Skipped: 0, Time elapsed: 0.008 sec
Running org.apache.openjpa.lib.conf.test.TestPluginValue
Tests run: 3, Failures: 0, Errors: 0, Skipped: 0, Time elapsed: 0.004 sec
Running org.apache.openjpa.lib.conf.TestXMLCaseConversions
Tests run: 1, Failures: 0, Errors: 0, Skipped: 0, Time elapsed: 0.002 sec
Running org.apache.openjpa.lib.graph.TestGraph
Tests run: 3, Failures: 0, Errors: 0, Skipped: 0, Time elapsed: 0.003 sec
Running org.apache.openjpa.lib.util.TestMultiClassLoader
Tests run: 2, Failures: 0, Errors: 0, Skipped: 0, Time elapsed: 0.003 sec
Running org.apache.openjpa.lib.util.TestLocalizer
Tests run: 7, Failures: 0, Errors: 0, Skipped: 0, Time elapsed: 0.009 sec
Running org.apache.openjpa.lib.conf.TestValue
Tests run: 1, Failures: 0, Errors: 0, Skipped: 0, Time elapsed: 0.002 sec
Running org.apache.openjpa.lib.util.TestTemporaryClassLoader
Tests run: 1, Failures: 0, Errors: 0, Skipped: 0, Time elapsed: 0.004 sec
Running org.apache.openjpa.lib.rop.TestSimpleResultList
Tests run: 17, Failures: 0, Errors: 0, Skipped: 0, Time elapsed: 0.005 sec
Running org.apache.openjpa.lib.util.concurrent.TestConcurrentMap
Tests run: 4, Failures: 0, Errors: 0, Skipped: 0, Time elapsed: 2.355 sec
Running org.apache.openjpa.lib.util.TestOptions
Tests run: 2, Failures: 0, Errors: 0, Skipped: 0, Time elapsed: 0.004 sec
Running org.apache.openjpa.lib.rop.TestRangeResultObjectProvider
Tests run: 17, Failures: 0, Errors: 0, Skipped: 0, Time elapsed: 0.014 sec
Running org.apache.openjpa.lib.rop.TestRandomAccessResultList
Tests run: 17, Failures: 0, Errors: 0, Skipped: 0, Time elapsed: 0.005 sec

Results :

Tests run: 257, Failures: 0, Errors: 0, Skipped: 0

[JENKINS] Recording test results
[INFO] [jar:jar {execution: default-jar}]
[INFO] Building jar: <https://builds.apache.org/job/OpenJPA-13x/ws/1.3.x/openjpa-lib/target/openjpa-lib-1.3.0-SNAPSHOT.jar>
Jan 10, 2013 4:51:23 PM hudson.remoting.SynchronousCommandTransport$ReaderThread run
SEVERE: I/O error in channel channel
java.io.StreamCorruptedException
	at java.io.ObjectInputStream.readObject0(ObjectInputStream.java:1332)
	at java.io.ObjectInputStream.readObject(ObjectInputStream.java:348)
	at hudson.remoting.Command.readFrom(Command.java:92)
	at hudson.remoting.ClassicCommandTransport.read(ClassicCommandTransport.java:59)
	at hudson.remoting.SynchronousCommandTransport$ReaderThread.run(SynchronousCommandTransport.java:48)
channel stopped
[INFO] ------------------------------------------------------------------------
[ERROR] FATAL ERROR
[INFO] ------------------------------------------------------------------------
ERROR: Maven JVM terminated unexpectedly with exit code 0


Mime
View raw message