openjpa-commits mailing list archives

Site index · List index
Message view « Date » · « Thread »
Top « Date » · « Thread »
From Apache Jenkins Server <jenk...@builds.apache.org>
Subject Build failed in Jenkins: OpenJPA-22x-deploy #29
Date Wed, 22 May 2013 12:42:50 GMT
See <https://builds.apache.org/job/OpenJPA-22x-deploy/29/changes>

Changes:

[hthomann] OPENJPA-2373: Made a test case update given identity auto generated ids do not
work so well for some databases.

------------------------------------------
[...truncated 23021 lines...]
0  test  INFO   [main] openjpa.jdbc.JDBC - Using dictionary class "org.apache.openjpa.jdbc.sql.DerbyDictionary".
3  test  INFO   [main] openjpa.Runtime - Starting OpenJPA 2.2.3-SNAPSHOT
1  test  WARN   [main] openjpa.Runtime - The persistence unit "test" was found multiple times
in the following resources "[<https://builds.apache.org/job/OpenJPA-22x-deploy/ws/2.2.x/openjpa-persistence-locking/target/test-classes/META-INF/persistence.xml,>
jar:<https://builds.apache.org/job/OpenJPA-22x-deploy/ws/2.2.x/openjpa-persistence-jdbc/target/openjpa-persistence-jdbc-2.2.3-SNAPSHOT-tests.jar!/META-INF/persistence.xml]",>
but persistence unit names should be unique. The first persistence unit matching the provided
name in "<https://builds.apache.org/job/OpenJPA-22x-deploy/ws/2.2.x/openjpa-persistence-locking/target/test-classes/META-INF/persistence.xml">
is being used.
1  test  INFO   [main] openjpa.jdbc.JDBC - Using dictionary class "org.apache.openjpa.jdbc.sql.DerbyDictionary".
4  test  INFO   [main] openjpa.Runtime - Starting OpenJPA 2.2.3-SNAPSHOT
0  test  WARN   [main] openjpa.Runtime - The persistence unit "test" was found multiple times
in the following resources "[<https://builds.apache.org/job/OpenJPA-22x-deploy/ws/2.2.x/openjpa-persistence-locking/target/test-classes/META-INF/persistence.xml,>
jar:<https://builds.apache.org/job/OpenJPA-22x-deploy/ws/2.2.x/openjpa-persistence-jdbc/target/openjpa-persistence-jdbc-2.2.3-SNAPSHOT-tests.jar!/META-INF/persistence.xml]",>
but persistence unit names should be unique. The first persistence unit matching the provided
name in "<https://builds.apache.org/job/OpenJPA-22x-deploy/ws/2.2.x/openjpa-persistence-locking/target/test-classes/META-INF/persistence.xml">
is being used.
0  test  INFO   [main] openjpa.jdbc.JDBC - Using dictionary class "org.apache.openjpa.jdbc.sql.DerbyDictionary".
3  test  INFO   [main] openjpa.Runtime - Starting OpenJPA 2.2.3-SNAPSHOT
0  test  WARN   [main] openjpa.Runtime - The persistence unit "test" was found multiple times
in the following resources "[<https://builds.apache.org/job/OpenJPA-22x-deploy/ws/2.2.x/openjpa-persistence-locking/target/test-classes/META-INF/persistence.xml,>
jar:<https://builds.apache.org/job/OpenJPA-22x-deploy/ws/2.2.x/openjpa-persistence-jdbc/target/openjpa-persistence-jdbc-2.2.3-SNAPSHOT-tests.jar!/META-INF/persistence.xml]",>
but persistence unit names should be unique. The first persistence unit matching the provided
name in "<https://builds.apache.org/job/OpenJPA-22x-deploy/ws/2.2.x/openjpa-persistence-locking/target/test-classes/META-INF/persistence.xml">
is being used.
0  test  INFO   [main] openjpa.jdbc.JDBC - Using dictionary class "org.apache.openjpa.jdbc.sql.DerbyDictionary".
3  test  INFO   [main] openjpa.Runtime - Starting OpenJPA 2.2.3-SNAPSHOT
Tests run: 25, Failures: 0, Errors: 0, Skipped: 0, Time elapsed: 380.818 sec

Results :

Tests run: 197, Failures: 0, Errors: 0, Skipped: 0

[JENKINS] Recording test results
[INFO] [jar:jar {execution: default-jar}]
[INFO] Building jar: <https://builds.apache.org/job/OpenJPA-22x-deploy/ws/2.2.x/openjpa-persistence-locking/target/openjpa-persistence-locking-2.2.3-SNAPSHOT.jar>
[INFO] [javadoc:jar {execution: attach-javadoc}]
[INFO] Skipping javadoc generation
[INFO] [jar:jar {execution: default-jar}]
[INFO] [jar:test-jar {execution: attach-tests}]
[INFO] Building jar: <https://builds.apache.org/job/OpenJPA-22x-deploy/ws/2.2.x/openjpa-persistence-locking/target/openjpa-persistence-locking-2.2.3-SNAPSHOT-tests.jar>
[INFO] [ianal:verify-legal-files {execution: default}]
[INFO] Checking legal files in: openjpa-persistence-locking-2.2.3-SNAPSHOT.jar
[INFO] Checking legal files in: openjpa-persistence-locking-2.2.3-SNAPSHOT-tests.jar
[INFO] [apache-rat:check {execution: default}]
[INFO] Exclude: **/.*/**
[INFO] Exclude: **/target/**/*
[INFO] [install:install {execution: default-install}]
[INFO] Installing <https://builds.apache.org/job/OpenJPA-22x-deploy/ws/2.2.x/openjpa-persistence-locking/target/openjpa-persistence-locking-2.2.3-SNAPSHOT.jar>
to /home/jenkins/jenkins-slave/maven-repositories/0/org/apache/openjpa/openjpa-persistence-locking/2.2.3-SNAPSHOT/openjpa-persistence-locking-2.2.3-SNAPSHOT.jar
[INFO] Installing <https://builds.apache.org/job/OpenJPA-22x-deploy/ws/2.2.x/openjpa-persistence-locking/target/openjpa-persistence-locking-2.2.3-SNAPSHOT-tests.jar>
to /home/jenkins/jenkins-slave/maven-repositories/0/org/apache/openjpa/openjpa-persistence-locking/2.2.3-SNAPSHOT/openjpa-persistence-locking-2.2.3-SNAPSHOT-tests.jar
[INFO] [deploy:deploy {execution: default-deploy}]
[INFO] Retrieving previous build number from apache.snapshots.https
[WARNING] *** CHECKSUM FAILED - Checksum failed on download: local = 'f6390ce1d028cee8764ee526319f3015726525ef';
remote = 'db985d1b0daad946b9395604e1401e80b0cc6fa1' - RETRYING
[WARNING] *** CHECKSUM FAILED - Checksum failed on download: local = 'f6390ce1d028cee8764ee526319f3015726525ef';
remote = 'db985d1b0daad946b9395604e1401e80b0cc6fa1' - IGNORING
Uploading: https://repository.apache.org/content/repositories/snapshots/org/apache/openjpa/openjpa-persistence-locking/2.2.3-SNAPSHOT/openjpa-persistence-locking-2.2.3-20130522.113348-9.jar
11K uploaded  (openjpa-persistence-locking-2.2.3-20130522.113348-9.jar)
[INFO] Retrieving previous metadata from apache.snapshots.https
[INFO] Uploading repository metadata for: 'artifact org.apache.openjpa:openjpa-persistence-locking'
[INFO] Uploading project information for openjpa-persistence-locking 2.2.3-20130522.113348-9
[INFO] Retrieving previous metadata from apache.snapshots.https
[WARNING] *** CHECKSUM FAILED - Checksum failed on download: local = 'f6390ce1d028cee8764ee526319f3015726525ef';
remote = 'db985d1b0daad946b9395604e1401e80b0cc6fa1' - RETRYING
[WARNING] *** CHECKSUM FAILED - Checksum failed on download: local = 'f6390ce1d028cee8764ee526319f3015726525ef';
remote = 'db985d1b0daad946b9395604e1401e80b0cc6fa1' - IGNORING
[INFO] Uploading repository metadata for: 'snapshot org.apache.openjpa:openjpa-persistence-locking:2.2.3-SNAPSHOT'
[INFO] Retrieving previous build number from apache.snapshots.https
Uploading: https://repository.apache.org/content/repositories/snapshots/org/apache/openjpa/openjpa-persistence-locking/2.2.3-SNAPSHOT/openjpa-persistence-locking-2.2.3-20130522.113348-9-tests.jar
292K uploaded  (openjpa-persistence-locking-2.2.3-20130522.113348-9-tests.jar)
[JENKINS] Archiving <https://builds.apache.org/job/OpenJPA-22x-deploy/ws/2.2.x/openjpa-persistence-locking/target/openjpa-persistence-locking-2.2.3-SNAPSHOT.jar>
to /home/hudson/hudson/jobs/OpenJPA-22x-deploy/modules/org.apache.openjpa$openjpa-persistence-locking/builds/2013-05-22_11-32-32/archive/org.apache.openjpa/openjpa-persistence-locking/2.2.3-20130522.113348-9/openjpa-persistence-locking-2.2.3-20130522.113348-9.jar
[JENKINS] Archiving <https://builds.apache.org/job/OpenJPA-22x-deploy/ws/2.2.x/openjpa-persistence-locking/target/openjpa-persistence-locking-2.2.3-SNAPSHOT-tests.jar>
to /home/hudson/hudson/jobs/OpenJPA-22x-deploy/modules/org.apache.openjpa$openjpa-persistence-locking/builds/2013-05-22_11-32-32/archive/org.apache.openjpa/openjpa-persistence-locking/2.2.3-20130522.113348-9/openjpa-persistence-locking-2.2.3-20130522.113348-9-tests.jar
[INFO] ------------------------------------------------------------------------
[INFO] Building OpenJPA tools
[INFO]    task-segment: [clean, deploy]
[INFO] ------------------------------------------------------------------------
[INFO] [clean:clean {execution: default-clean}]
[INFO] Deleting file set: <https://builds.apache.org/job/OpenJPA-22x-deploy/ws/2.2.x/openjpa-tools/target>
(included: [**], excluded: [])
[INFO] [buildnumber:create {execution: default}]
[INFO] [enforcer:enforce {execution: default}]
[INFO] [checkstyle:checkstyle {execution: default}]
[INFO] Source directory does not exist - skipping report.
[INFO] [remote-resources:process {execution: default}]
[INFO] [compiler:testCompile {execution: test-source-compile}]
[INFO] No sources to compile
[INFO] [site:attach-descriptor {execution: default-attach-descriptor}]
[INFO] [ianal:verify-legal-files {execution: default}]
[INFO] [apache-rat:check {execution: default}]
[INFO] Exclude: **/.*/**
[INFO] Exclude: **/target/**/*
[INFO] [install:install {execution: default-install}]
[INFO] Installing <https://builds.apache.org/job/OpenJPA-22x-deploy/ws/2.2.x/openjpa-tools/pom.xml>
to /home/jenkins/jenkins-slave/maven-repositories/0/org/apache/openjpa/openjpa-tools/2.2.3-SNAPSHOT/openjpa-tools-2.2.3-SNAPSHOT.pom
[INFO] [deploy:deploy {execution: default-deploy}]
[INFO] Retrieving previous build number from apache.snapshots.https
[WARNING] *** CHECKSUM FAILED - Checksum failed on download: local = '640872e9b0ae1dfd423363346aadbbbab69acf97';
remote = 'd9c2a3956eab58b070858cd31b1b33a941e1c86a' - RETRYING
[WARNING] *** CHECKSUM FAILED - Checksum failed on download: local = '640872e9b0ae1dfd423363346aadbbbab69acf97';
remote = 'd9c2a3956eab58b070858cd31b1b33a941e1c86a' - IGNORING
Uploading: https://repository.apache.org/content/repositories/snapshots/org/apache/openjpa/openjpa-tools/2.2.3-SNAPSHOT/openjpa-tools-2.2.3-20130522.113348-9.pom
1K uploaded  (openjpa-tools-2.2.3-20130522.113348-9.pom)
[INFO] Retrieving previous metadata from apache.snapshots.https
[WARNING] *** CHECKSUM FAILED - Checksum failed on download: local = '640872e9b0ae1dfd423363346aadbbbab69acf97';
remote = 'd9c2a3956eab58b070858cd31b1b33a941e1c86a' - RETRYING
[WARNING] *** CHECKSUM FAILED - Checksum failed on download: local = '640872e9b0ae1dfd423363346aadbbbab69acf97';
remote = 'd9c2a3956eab58b070858cd31b1b33a941e1c86a' - IGNORING
[INFO] Uploading repository metadata for: 'snapshot org.apache.openjpa:openjpa-tools:2.2.3-SNAPSHOT'
[INFO] Retrieving previous metadata from apache.snapshots.https
[INFO] Uploading repository metadata for: 'artifact org.apache.openjpa:openjpa-tools'
[JENKINS] Archiving <https://builds.apache.org/job/OpenJPA-22x-deploy/ws/2.2.x/openjpa-tools/pom.xml>
to /home/hudson/hudson/jobs/OpenJPA-22x-deploy/modules/org.apache.openjpa$openjpa-tools/builds/2013-05-22_11-32-33/archive/org.apache.openjpa/openjpa-tools/2.2.3-SNAPSHOT/openjpa-tools-2.2.3-SNAPSHOT.pom
[JENKINS] Archiving /home/jenkins/jenkins-slave/maven-repositories/0/org/apache/openjpa/openjpa-tools/2.2.3-SNAPSHOT/openjpa-tools-2.2.3-SNAPSHOT.pom
to /home/hudson/hudson/jobs/OpenJPA-22x-deploy/modules/org.apache.openjpa$openjpa-tools/builds/2013-05-22_11-32-33/archive/org.apache.openjpa/openjpa-tools/2.2.3-20130522.113348-9/openjpa-tools-2.2.3-20130522.113348-9.pom
[INFO] ------------------------------------------------------------------------
[INFO] Building OpenJPA Maven Plugin
[INFO]    task-segment: [clean, deploy]
[INFO] ------------------------------------------------------------------------
[INFO] [clean:clean {execution: default-clean}]
[INFO] Deleting file set: <https://builds.apache.org/job/OpenJPA-22x-deploy/ws/2.2.x/openjpa-tools/openjpa-maven-plugin/target>
(included: [**], excluded: [])
[INFO] [buildnumber:create {execution: default}]
[INFO] [enforcer:enforce {execution: default}]
[INFO] [checkstyle:checkstyle {execution: default}]
[INFO] Starting audit...
Audit done.

[WARNING] Unable to locate Source XRef to link to - DISABLED
[INFO] [plugin:descriptor {execution: default-descriptor}]
[INFO] Using 'UTF-8' encoding to read mojo metadata.
[INFO] Applying mojo extractor for language: java
[INFO] Mojo extractor for language: java found 4 mojo descriptors.
[INFO] Applying mojo extractor for language: bsh
[INFO] Mojo extractor for language: bsh found 0 mojo descriptors.
[INFO] [remote-resources:process {execution: default}]
[INFO] [resources:resources {execution: default-resources}]
[INFO] Using 'UTF-8' encoding to copy filtered resources.
[INFO] skip non existing resourceDirectory <https://builds.apache.org/job/OpenJPA-22x-deploy/ws/2.2.x/openjpa-tools/openjpa-maven-plugin/src/main/resources>
[INFO] Copying 3 resources
[INFO] [compiler:compile {execution: default-compile}]
[INFO] Compiling 7 source files to <https://builds.apache.org/job/OpenJPA-22x-deploy/ws/2.2.x/openjpa-tools/openjpa-maven-plugin/target/classes>
[INFO] [compiler:testCompile {execution: test-source-compile}]
[INFO] Compiling 3 source files to <https://builds.apache.org/job/OpenJPA-22x-deploy/ws/2.2.x/openjpa-tools/openjpa-maven-plugin/target/test-classes>
[INFO] [resources:testResources {execution: default-testResources}]
[INFO] Using 'UTF-8' encoding to copy filtered resources.
[INFO] Copying 4 resources
[INFO] Copying 3 resources
[INFO] [compiler:testCompile {execution: default-testCompile}]
[INFO] Nothing to compile - all classes are up to date
[WARNING] DEPRECATED [systemProperties]: Use systemPropertyVariables instead.
[INFO] [surefire:test {execution: default-test}]
[INFO] Surefire report directory: <https://builds.apache.org/job/OpenJPA-22x-deploy/ws/2.2.x/openjpa-tools/openjpa-maven-plugin/target/surefire-reports>

-------------------------------------------------------
 T E S T S
-------------------------------------------------------
Running org.apache.openjpa.tools.maven.testentity.TestEntity
Tests run: 0, Failures: 0, Errors: 0, Skipped: 0, Time elapsed: 0.013 sec
Running org.apache.openjpa.tools.maven.OpenJpaEnhancerMojoTest
5  TestUnit  TRACE  [main] openjpa.Runtime - Setting the following properties from "<https://builds.apache.org/job/OpenJPA-22x-deploy/ws/2.2.x/openjpa-tools/openjpa-maven-plugin/target/test-classes/META-INF/persistence.xml">
into configuration: {openjpa.jdbc.SynchronizeMappings=buildSchema(ForeignKeys=true), openjpa.ConnectionPassword=,
openjpa.ConnectionDriverName=org.hsqldb.jdbcDriver, openjpa.MetaDataFactory=jpa(Types=org.apache.openjpa.tools.maven.testentity.TestEntity),
openjpa.jdbc.DBDictionary=hsql, openjpa.Log=DefaultLevel=TRACE, PersistenceVersion=1.0, openjpa.ConnectionUserName=sa,
openjpa.ConnectionURL=jdbc:hsqldb:file:target/db, openjpa.Id=TestUnit}
16  TestUnit  TRACE  [main] openjpa.Runtime - No cache marshaller found for id org.apache.openjpa.conf.MetaDataCacheMaintenance.
57  TestUnit  TRACE  [main] openjpa.Runtime - No cache marshaller found for id org.apache.openjpa.conf.MetaDataCacheMaintenance.
71  TestUnit  INFO   [main] openjpa.Tool - Enhancer running on type "class org.apache.openjpa.tools.maven.testentity.TestEntity".
115  TestUnit  TRACE  [main] openjpa.MetaData - Loading metadata for "class org.apache.openjpa.tools.maven.testentity.TestEntity"
under mode "[META]".
116  TestUnit  TRACE  [main] openjpa.MetaData - Scanning resource "META-INF/orm.xml" for persistent
types.
117  TestUnit  TRACE  [main] openjpa.MetaData - The persistent unit root url is "null"
117  TestUnit  TRACE  [main] openjpa.MetaData - parsePersistentTypeNames() found [org.apache.openjpa.tools.maven.testentity.TestEntity].
117  TestUnit  TRACE  [main] openjpa.MetaData - Found 1 classes with metadata in 1 milliseconds.
130  TestUnit  TRACE  [main] openjpa.MetaData - Parsing class "org.apache.openjpa.tools.maven.testentity.TestEntity".
130  TestUnit  TRACE  [main] openjpa.MetaData - Parsing package "org.apache.openjpa.tools.maven.testentity.TestEntity".
153  TestUnit  TRACE  [main] openjpa.MetaData - Generating default metadata for type "org.apache.openjpa.tools.maven.testentity.TestEntity".
155  TestUnit  TRACE  [main] openjpa.MetaData - Using reflection for metadata generation.
166  TestUnit  TRACE  [main] openjpa.MetaData - Set persistence-capable superclass of "org.apache.openjpa.tools.maven.testentity.TestEntity"
to "null".
168  TestUnit  TRACE  [main] openjpa.MetaData - Resolving metadata for "org.apache.openjpa.tools.maven.testentity.TestEntity@31952022".
168  TestUnit  TRACE  [main] openjpa.MetaData - 	Resolving field "org.apache.openjpa.tools.maven.testentity.TestEntity@31952022.string1".
175  TestUnit  TRACE  [main] openjpa.MetaData - 	Resolving field "org.apache.openjpa.tools.maven.testentity.TestEntity@31952022.xint1".
176  TestUnit  TRACE  [main] openjpa.MetaData - Preparing mapping for "org.apache.openjpa.tools.maven.testentity.TestEntity".
176  TestUnit  TRACE  [main] openjpa.MetaData - Resolving mapping for "org.apache.openjpa.tools.maven.testentity.TestEntity@31952022".
176  TestUnit  TRACE  [main] openjpa.Enhance - Enhancing type "class org.apache.openjpa.tools.maven.testentity.TestEntity"
loaded by sun.misc.Launcher$AppClassLoader@f6a746.
216  TestUnit  INFO   [main] openjpa.Tool - Enhancer running on type "class org.apache.openjpa.tools.maven.testentity.Person".
219  TestUnit  TRACE  [main] openjpa.MetaData - Loading metadata for "class org.apache.openjpa.tools.maven.testentity.Person"
under mode "[META]".
219  TestUnit  TRACE  [main] openjpa.MetaData - Parsing class "org.apache.openjpa.tools.maven.testentity.Person".
220  TestUnit  TRACE  [main] openjpa.Runtime - Access style for "org.apache.openjpa.tools.maven.testentity.Person"
can not be determined.  The default "implicit field access" will be used. If this access style
is not correct, specify the correct style explicitly on the persistent type or within the
mapping file.
220  TestUnit  TRACE  [main] openjpa.MetaData - Generating default metadata for type "org.apache.openjpa.tools.maven.testentity.Person".
220  TestUnit  TRACE  [main] openjpa.MetaData - Using reflection for metadata generation.
220  TestUnit  TRACE  [main] openjpa.MetaData - Set persistence-capable superclass of "org.apache.openjpa.tools.maven.testentity.Person"
to "null".
221  TestUnit  TRACE  [main] openjpa.MetaData - Resolving metadata for "org.apache.openjpa.tools.maven.testentity.Person@13594894".
221  TestUnit  TRACE  [main] openjpa.MetaData - 	Resolving field "org.apache.openjpa.tools.maven.testentity.Person@13594894.age".
221  TestUnit  TRACE  [main] openjpa.MetaData - 	Resolving field "org.apache.openjpa.tools.maven.testentity.Person@13594894.id".
221  TestUnit  TRACE  [main] openjpa.MetaData - 	Resolving field "org.apache.openjpa.tools.maven.testentity.Person@13594894.name".
221  TestUnit  TRACE  [main] openjpa.MetaData - Preparing mapping for "org.apache.openjpa.tools.maven.testentity.Person".
221  TestUnit  TRACE  [main] openjpa.MetaData - Resolving mapping for "org.apache.openjpa.tools.maven.testentity.Person@13594894".
221  TestUnit  TRACE  [main] openjpa.Enhance - Enhancing type "class org.apache.openjpa.tools.maven.testentity.Person"
loaded by sun.misc.Launcher$AppClassLoader@f6a746.
242  TestUnit  INFO   [main] openjpa.Tool - Enhancer running on type "class org.apache.openjpa.tools.maven.OpenJpaEnhancerMojoTest".
244  TestUnit  TRACE  [main] openjpa.MetaData - Loading metadata for "class org.apache.openjpa.tools.maven.OpenJpaEnhancerMojoTest"
under mode "[META]".
244  TestUnit  TRACE  [main] openjpa.MetaData - Parsing class "org.apache.openjpa.tools.maven.OpenJpaEnhancerMojoTest".
244  TestUnit  TRACE  [main] openjpa.MetaData - Parsing package "org.apache.openjpa.tools.maven.OpenJpaEnhancerMojoTest".
244  TestUnit  TRACE  [main] openjpa.Enhance - Enhancing type "class org.apache.openjpa.tools.maven.OpenJpaEnhancerMojoTest"
loaded by sun.misc.Launcher$AppClassLoader@f6a746.
247  TestUnit  TRACE  [main] openjpa.MetaData - Loading metadata for "class org.apache.openjpa.tools.maven.AbstractOpenJpaMojo"
under mode "[META]".
247  TestUnit  TRACE  [main] openjpa.MetaData - Parsing class "org.apache.openjpa.tools.maven.AbstractOpenJpaMojo".
249  TestUnit  INFO   [main] openjpa.Tool - No metadata was found for 1 classes; they have
been enhanced as persistence-aware. If you intended for any of these classes to be persistence-capable,
then this means that OpenJPA could not find any metadata for those classes. This can happen
if the directory containing your metadata is not in your CLASSPATH, or if your metadata files
are not named properly. See the documentation on metadata placement for more information.
Persistence-aware classes: [class org.apache.openjpa.tools.maven.OpenJpaEnhancerMojoTest]
249  TestUnit  TRACE  [main] openjpa.MetaData - Clearing metadata repository "org.apache.openjpa.meta.MetaDataRepository@19e215b".
Tests run: 1, Failures: 0, Errors: 0, Skipped: 0, Time elapsed: 0.843 sec

Results :

Tests run: 1, Failures: 0, Errors: 0, Skipped: 0

[JENKINS] Recording test results
[INFO] [jar:jar {execution: default-jar}]
[INFO] Building jar: <https://builds.apache.org/job/OpenJPA-22x-deploy/ws/2.2.x/openjpa-tools/openjpa-maven-plugin/target/openjpa-maven-plugin-2.2.3-SNAPSHOT.jar>
[INFO] [plugin:addPluginArtifactMetadata {execution: default-addPluginArtifactMetadata}]
[INFO] [jar:jar {execution: default-jar}]
[INFO] [jar:test-jar {execution: attach-tests}]
[INFO] Building jar: <https://builds.apache.org/job/OpenJPA-22x-deploy/ws/2.2.x/openjpa-tools/openjpa-maven-plugin/target/openjpa-maven-plugin-2.2.3-SNAPSHOT-tests.jar>
[INFO] [invoker:install {execution: integration-test}]
[INFO] Installing <https://builds.apache.org/job/OpenJPA-22x-deploy/ws/2.2.x/openjpa-kernel/pom.xml>
to <https://builds.apache.org/job/OpenJPA-22x-deploy/ws/2.2.x/openjpa-tools/openjpa-maven-plugin/target/local-repo/org/apache/openjpa/openjpa-kernel/2.2.3-SNAPSHOT/openjpa-kernel-2.2.3-SNAPSHOT.pom>
[INFO] Installing <https://builds.apache.org/job/OpenJPA-22x-deploy/ws/2.2.x/openjpa-kernel/target/openjpa-kernel-2.2.3-SNAPSHOT.jar>
to <https://builds.apache.org/job/OpenJPA-22x-deploy/ws/2.2.x/openjpa-tools/openjpa-maven-plugin/target/local-repo/org/apache/openjpa/openjpa-kernel/2.2.3-SNAPSHOT/openjpa-kernel-2.2.3-20130522.113348-9.jar>
[INFO] Installing <https://builds.apache.org/job/OpenJPA-22x-deploy/ws/2.2.x/openjpa-kernel/target/openjpa-kernel-2.2.3-SNAPSHOT-tests.jar>
to <https://builds.apache.org/job/OpenJPA-22x-deploy/ws/2.2.x/openjpa-tools/openjpa-maven-plugin/target/local-repo/org/apache/openjpa/openjpa-kernel/2.2.3-SNAPSHOT/openjpa-kernel-2.2.3-20130522.113348-9-tests.jar>
[INFO] Installing <https://builds.apache.org/job/OpenJPA-22x-deploy/ws/2.2.x/pom.xml>
to <https://builds.apache.org/job/OpenJPA-22x-deploy/ws/2.2.x/openjpa-tools/openjpa-maven-plugin/target/local-repo/org/apache/openjpa/openjpa-parent/2.2.3-SNAPSHOT/openjpa-parent-2.2.3-20130522.113348-9.pom>
[INFO] Installing <https://builds.apache.org/job/OpenJPA-22x-deploy/ws/2.2.x/openjpa-lib/pom.xml>
to <https://builds.apache.org/job/OpenJPA-22x-deploy/ws/2.2.x/openjpa-tools/openjpa-maven-plugin/target/local-repo/org/apache/openjpa/openjpa-lib/2.2.3-SNAPSHOT/openjpa-lib-2.2.3-SNAPSHOT.pom>
[INFO] Installing <https://builds.apache.org/job/OpenJPA-22x-deploy/ws/2.2.x/openjpa-lib/target/openjpa-lib-2.2.3-SNAPSHOT.jar>
to <https://builds.apache.org/job/OpenJPA-22x-deploy/ws/2.2.x/openjpa-tools/openjpa-maven-plugin/target/local-repo/org/apache/openjpa/openjpa-lib/2.2.3-SNAPSHOT/openjpa-lib-2.2.3-20130522.113348-9.jar>
[INFO] Installing <https://builds.apache.org/job/OpenJPA-22x-deploy/ws/2.2.x/openjpa-lib/target/openjpa-lib-2.2.3-SNAPSHOT-tests.jar>
to <https://builds.apache.org/job/OpenJPA-22x-deploy/ws/2.2.x/openjpa-tools/openjpa-maven-plugin/target/local-repo/org/apache/openjpa/openjpa-lib/2.2.3-SNAPSHOT/openjpa-lib-2.2.3-20130522.113348-9-tests.jar>
[INFO] Installing <https://builds.apache.org/job/OpenJPA-22x-deploy/ws/2.2.x/openjpa-jdbc/pom.xml>
to <https://builds.apache.org/job/OpenJPA-22x-deploy/ws/2.2.x/openjpa-tools/openjpa-maven-plugin/target/local-repo/org/apache/openjpa/openjpa-jdbc/2.2.3-SNAPSHOT/openjpa-jdbc-2.2.3-SNAPSHOT.pom>
[INFO] Installing <https://builds.apache.org/job/OpenJPA-22x-deploy/ws/2.2.x/openjpa-jdbc/target/openjpa-jdbc-2.2.3-SNAPSHOT.jar>
to <https://builds.apache.org/job/OpenJPA-22x-deploy/ws/2.2.x/openjpa-tools/openjpa-maven-plugin/target/local-repo/org/apache/openjpa/openjpa-jdbc/2.2.3-SNAPSHOT/openjpa-jdbc-2.2.3-20130522.113348-9.jar>
[INFO] Installing <https://builds.apache.org/job/OpenJPA-22x-deploy/ws/2.2.x/openjpa-jdbc/target/openjpa-jdbc-2.2.3-SNAPSHOT-tests.jar>
to <https://builds.apache.org/job/OpenJPA-22x-deploy/ws/2.2.x/openjpa-tools/openjpa-maven-plugin/target/local-repo/org/apache/openjpa/openjpa-jdbc/2.2.3-SNAPSHOT/openjpa-jdbc-2.2.3-20130522.113348-9-tests.jar>
[INFO] Installing <https://builds.apache.org/job/OpenJPA-22x-deploy/ws/2.2.x/openjpa-persistence/pom.xml>
to <https://builds.apache.org/job/OpenJPA-22x-deploy/ws/2.2.x/openjpa-tools/openjpa-maven-plugin/target/local-repo/org/apache/openjpa/openjpa-persistence/2.2.3-SNAPSHOT/openjpa-persistence-2.2.3-SNAPSHOT.pom>
[INFO] Installing <https://builds.apache.org/job/OpenJPA-22x-deploy/ws/2.2.x/openjpa-persistence/target/openjpa-persistence-2.2.3-SNAPSHOT.jar>
to <https://builds.apache.org/job/OpenJPA-22x-deploy/ws/2.2.x/openjpa-tools/openjpa-maven-plugin/target/local-repo/org/apache/openjpa/openjpa-persistence/2.2.3-SNAPSHOT/openjpa-persistence-2.2.3-20130522.113348-9.jar>
[INFO] Installing <https://builds.apache.org/job/OpenJPA-22x-deploy/ws/2.2.x/openjpa-persistence/target/openjpa-persistence-2.2.3-SNAPSHOT-tests.jar>
to <https://builds.apache.org/job/OpenJPA-22x-deploy/ws/2.2.x/openjpa-tools/openjpa-maven-plugin/target/local-repo/org/apache/openjpa/openjpa-persistence/2.2.3-SNAPSHOT/openjpa-persistence-2.2.3-20130522.113348-9-tests.jar>
[INFO] Installing <https://builds.apache.org/job/OpenJPA-22x-deploy/ws/2.2.x/openjpa-persistence-jdbc/pom.xml>
to <https://builds.apache.org/job/OpenJPA-22x-deploy/ws/2.2.x/openjpa-tools/openjpa-maven-plugin/target/local-repo/org/apache/openjpa/openjpa-persistence-jdbc/2.2.3-SNAPSHOT/openjpa-persistence-jdbc-2.2.3-SNAPSHOT.pom>
[INFO] Installing <https://builds.apache.org/job/OpenJPA-22x-deploy/ws/2.2.x/openjpa-persistence-jdbc/target/openjpa-persistence-jdbc-2.2.3-SNAPSHOT.jar>
to <https://builds.apache.org/job/OpenJPA-22x-deploy/ws/2.2.x/openjpa-tools/openjpa-maven-plugin/target/local-repo/org/apache/openjpa/openjpa-persistence-jdbc/2.2.3-SNAPSHOT/openjpa-persistence-jdbc-2.2.3-20130522.113348-9.jar>
[INFO] Installing <https://builds.apache.org/job/OpenJPA-22x-deploy/ws/2.2.x/openjpa-persistence-jdbc/target/openjpa-persistence-jdbc-2.2.3-SNAPSHOT-tests.jar>
to <https://builds.apache.org/job/OpenJPA-22x-deploy/ws/2.2.x/openjpa-tools/openjpa-maven-plugin/target/local-repo/org/apache/openjpa/openjpa-persistence-jdbc/2.2.3-SNAPSHOT/openjpa-persistence-jdbc-2.2.3-20130522.113348-9-tests.jar>
[INFO] Installing <https://builds.apache.org/job/OpenJPA-22x-deploy/ws/2.2.x/openjpa-tools/pom.xml>
to <https://builds.apache.org/job/OpenJPA-22x-deploy/ws/2.2.x/openjpa-tools/openjpa-maven-plugin/target/local-repo/org/apache/openjpa/openjpa-tools/2.2.3-SNAPSHOT/openjpa-tools-2.2.3-20130522.113348-9.pom>
[INFO] Installing <https://builds.apache.org/job/OpenJPA-22x-deploy/ws/2.2.x/openjpa-tools/openjpa-maven-plugin/pom.xml>
to <https://builds.apache.org/job/OpenJPA-22x-deploy/ws/2.2.x/openjpa-tools/openjpa-maven-plugin/target/local-repo/org/apache/openjpa/openjpa-maven-plugin/2.2.3-SNAPSHOT/openjpa-maven-plugin-2.2.3-SNAPSHOT.pom>
[INFO] Installing <https://builds.apache.org/job/OpenJPA-22x-deploy/ws/2.2.x/openjpa-tools/openjpa-maven-plugin/target/openjpa-maven-plugin-2.2.3-SNAPSHOT.jar>
to <https://builds.apache.org/job/OpenJPA-22x-deploy/ws/2.2.x/openjpa-tools/openjpa-maven-plugin/target/local-repo/org/apache/openjpa/openjpa-maven-plugin/2.2.3-SNAPSHOT/openjpa-maven-plugin-2.2.3-SNAPSHOT.jar>
[INFO] Installing <https://builds.apache.org/job/OpenJPA-22x-deploy/ws/2.2.x/openjpa-tools/openjpa-maven-plugin/target/openjpa-maven-plugin-2.2.3-SNAPSHOT-tests.jar>
to <https://builds.apache.org/job/OpenJPA-22x-deploy/ws/2.2.x/openjpa-tools/openjpa-maven-plugin/target/local-repo/org/apache/openjpa/openjpa-maven-plugin/2.2.3-SNAPSHOT/openjpa-maven-plugin-2.2.3-SNAPSHOT-tests.jar>
[INFO] [invoker:run {execution: integration-test}]
[INFO] Building: nonDefaultPersistenceXml/pom.xml
[INFO] ..SUCCESS (25.0 s)
[INFO] Building: dependingArtifact/pom.xml
[INFO] ..SUCCESS (11.9 s)
[INFO] Building: default_settings/pom.xml
[INFO] ..SUCCESS (9.4 s)
[INFO] Building: testDependencies/pom.xml
[INFO] ..SUCCESS (10.1 s)
[INFO] -------------------------------------------------
[INFO] Build Summary:
[INFO]   Passed: 4, Failed: 0, Errors: 0, Skipped: 0
[INFO] -------------------------------------------------
[INFO] [ianal:verify-legal-files {execution: default}]
[INFO] Checking legal files in: openjpa-maven-plugin-2.2.3-SNAPSHOT.jar
[INFO] Checking legal files in: openjpa-maven-plugin-2.2.3-SNAPSHOT-tests.jar
[INFO] [apache-rat:check {execution: default}]
[INFO] Exclude: **/.*/**
[INFO] Exclude: **/target/**/*
[INFO] [install:install {execution: default-install}]
[INFO] Installing <https://builds.apache.org/job/OpenJPA-22x-deploy/ws/2.2.x/openjpa-tools/openjpa-maven-plugin/target/openjpa-maven-plugin-2.2.3-SNAPSHOT.jar>
to /home/jenkins/jenkins-slave/maven-repositories/0/org/apache/openjpa/openjpa-maven-plugin/2.2.3-SNAPSHOT/openjpa-maven-plugin-2.2.3-SNAPSHOT.jar
[INFO] Installing <https://builds.apache.org/job/OpenJPA-22x-deploy/ws/2.2.x/openjpa-tools/openjpa-maven-plugin/target/openjpa-maven-plugin-2.2.3-SNAPSHOT-tests.jar>
to /home/jenkins/jenkins-slave/maven-repositories/0/org/apache/openjpa/openjpa-maven-plugin/2.2.3-SNAPSHOT/openjpa-maven-plugin-2.2.3-SNAPSHOT-tests.jar
[INFO] [deploy:deploy {execution: default-deploy}]
[INFO] Retrieving previous build number from apache.snapshots.https
[WARNING] *** CHECKSUM FAILED - Checksum failed on download: local = 'd4617cf910a990562685d1a3e7128b0dd61b39de';
remote = 'f0206cfe6fa5f5e6d86f3f07e0aa0cfb4dcf3406' - RETRYING
[WARNING] *** CHECKSUM FAILED - Checksum failed on download: local = 'd4617cf910a990562685d1a3e7128b0dd61b39de';
remote = 'f0206cfe6fa5f5e6d86f3f07e0aa0cfb4dcf3406' - IGNORING
Uploading: https://repository.apache.org/content/repositories/snapshots/org/apache/openjpa/openjpa-maven-plugin/2.2.3-SNAPSHOT/openjpa-maven-plugin-2.2.3-20130522.113348-9.jar
23K uploaded  (openjpa-maven-plugin-2.2.3-20130522.113348-9.jar)
[INFO] Retrieving previous metadata from apache.snapshots.https
[INFO] Uploading repository metadata for: 'artifact org.apache.openjpa:openjpa-maven-plugin'
[INFO] Retrieving previous metadata from apache.snapshots.https
[WARNING] *** CHECKSUM FAILED - Checksum failed on download: local = 'd4617cf910a990562685d1a3e7128b0dd61b39de';
remote = 'f0206cfe6fa5f5e6d86f3f07e0aa0cfb4dcf3406' - RETRYING
[WARNING] *** CHECKSUM FAILED - Checksum failed on download: local = 'd4617cf910a990562685d1a3e7128b0dd61b39de';
remote = 'f0206cfe6fa5f5e6d86f3f07e0aa0cfb4dcf3406' - IGNORING
[INFO] Uploading repository metadata for: 'snapshot org.apache.openjpa:openjpa-maven-plugin:2.2.3-SNAPSHOT'
[INFO] Retrieving previous metadata from apache.snapshots.https
[INFO] Uploading repository metadata for: 'org.apache.openjpa'
[INFO] Uploading project information for openjpa-maven-plugin 2.2.3-20130522.113348-9
[INFO] Retrieving previous build number from apache.snapshots.https
Uploading: https://repository.apache.org/content/repositories/snapshots/org/apache/openjpa/openjpa-maven-plugin/2.2.3-SNAPSHOT/openjpa-maven-plugin-2.2.3-20130522.113348-9-tests.jar
21K uploaded  (openjpa-maven-plugin-2.2.3-20130522.113348-9-tests.jar)
ERROR: Maven JVM terminated unexpectedly with exit code 143


Mime
View raw message