openjpa-commits mailing list archives

Site index · List index
Message view « Date » · « Thread »
Top « Date » · « Thread »
From Apache Jenkins Server <jenk...@builds.apache.org>
Subject Build failed in Jenkins: OpenJPA-trunk-deploy #401
Date Fri, 19 Jul 2013 06:49:35 GMT
See <https://builds.apache.org/job/OpenJPA-trunk-deploy/401/changes>

Changes:

[hthomann] OPENJPA-2387: Fix to exclude schema name when checking the length of a sequence
name.

[curtisr7] OPENJPA-2410 : Detect SystemOut/Err in code at build time. Patch submitted by Di
Wu Lau.

------------------------------------------
[...truncated 6459 lines...]
[INFO] Installing <https://builds.apache.org/job/OpenJPA-trunk-deploy/ws/trunk/openjpa-kernel/target/openjpa-kernel-2.3.0-SNAPSHOT.jar>
to /home/jenkins/jenkins-slave/maven-repositories/1/org/apache/openjpa/openjpa-kernel/2.3.0-SNAPSHOT/openjpa-kernel-2.3.0-SNAPSHOT.jar
[INFO] Installing <https://builds.apache.org/job/OpenJPA-trunk-deploy/ws/trunk/openjpa-kernel/target/openjpa-kernel-2.3.0-SNAPSHOT-tests.jar>
to /home/jenkins/jenkins-slave/maven-repositories/1/org/apache/openjpa/openjpa-kernel/2.3.0-SNAPSHOT/openjpa-kernel-2.3.0-SNAPSHOT-tests.jar
[INFO] [deploy:deploy {execution: default-deploy}]
[INFO] Retrieving previous build number from apache.snapshots.https
[WARNING] *** CHECKSUM FAILED - Checksum failed on download: local = '0ee94bd6394ac8473835d61a3fe5ad59a91c4501';
remote = '93c65668a34f3b37e1d3db286f5da35eeeda1c90' - RETRYING
[WARNING] *** CHECKSUM FAILED - Checksum failed on download: local = '0ee94bd6394ac8473835d61a3fe5ad59a91c4501';
remote = '93c65668a34f3b37e1d3db286f5da35eeeda1c90' - IGNORING
Uploading: https://repository.apache.org/content/repositories/snapshots/org/apache/openjpa/openjpa-kernel/2.3.0-SNAPSHOT/openjpa-kernel-2.3.0-20130719.064805-147.jar
1423K uploaded  (openjpa-kernel-2.3.0-20130719.064805-147.jar)
[INFO] Retrieving previous metadata from apache.snapshots.https
[WARNING] *** CHECKSUM FAILED - Checksum failed on download: local = '0ee94bd6394ac8473835d61a3fe5ad59a91c4501';
remote = '93c65668a34f3b37e1d3db286f5da35eeeda1c90' - RETRYING
[WARNING] *** CHECKSUM FAILED - Checksum failed on download: local = '0ee94bd6394ac8473835d61a3fe5ad59a91c4501';
remote = '93c65668a34f3b37e1d3db286f5da35eeeda1c90' - IGNORING
[INFO] Uploading repository metadata for: 'snapshot org.apache.openjpa:openjpa-kernel:2.3.0-SNAPSHOT'
[INFO] Retrieving previous metadata from apache.snapshots.https
[INFO] Uploading repository metadata for: 'artifact org.apache.openjpa:openjpa-kernel'
[INFO] Uploading project information for openjpa-kernel 2.3.0-20130719.064805-147
[INFO] Retrieving previous build number from apache.snapshots.https
Uploading: https://repository.apache.org/content/repositories/snapshots/org/apache/openjpa/openjpa-kernel/2.3.0-SNAPSHOT/openjpa-kernel-2.3.0-20130719.064805-147-tests.jar
50K uploaded  (openjpa-kernel-2.3.0-20130719.064805-147-tests.jar)
[JENKINS] Archiving <https://builds.apache.org/job/OpenJPA-trunk-deploy/ws/trunk/openjpa-kernel/pom.xml>
to /home/hudson/hudson/jobs/OpenJPA-trunk-deploy/modules/org.apache.openjpa$openjpa-kernel/builds/2013-07-19_06-47-38/archive/org.apache.openjpa/openjpa-kernel/2.3.0-SNAPSHOT/openjpa-kernel-2.3.0-SNAPSHOT.pom
[JENKINS] Archiving <https://builds.apache.org/job/OpenJPA-trunk-deploy/ws/trunk/openjpa-kernel/target/openjpa-kernel-2.3.0-SNAPSHOT.jar>
to /home/hudson/hudson/jobs/OpenJPA-trunk-deploy/modules/org.apache.openjpa$openjpa-kernel/builds/2013-07-19_06-47-38/archive/org.apache.openjpa/openjpa-kernel/2.3.0-20130719.064805-147/openjpa-kernel-2.3.0-20130719.064805-147.jar
[JENKINS] Archiving <https://builds.apache.org/job/OpenJPA-trunk-deploy/ws/trunk/openjpa-kernel/target/openjpa-kernel-2.3.0-SNAPSHOT-tests.jar>
to /home/hudson/hudson/jobs/OpenJPA-trunk-deploy/modules/org.apache.openjpa$openjpa-kernel/builds/2013-07-19_06-47-38/archive/org.apache.openjpa/openjpa-kernel/2.3.0-20130719.064805-147/openjpa-kernel-2.3.0-20130719.064805-147-tests.jar
[INFO] ------------------------------------------------------------------------
[INFO] Building OpenJPA JDBC
[INFO]    task-segment: [clean, deploy]
[INFO] ------------------------------------------------------------------------
[INFO] [clean:clean {execution: default-clean}]
[INFO] [buildnumber:create {execution: default}]
[INFO] [enforcer:enforce {execution: default}]
[INFO] [checkstyle:checkstyle {execution: default}]
[INFO] Starting audit...
Audit done.

[WARNING] Unable to locate Source XRef to link to - DISABLED
[INFO] [remote-resources:process {execution: default}]
[INFO] [resources:resources {execution: default-resources}]
[INFO] Using 'UTF-8' encoding to copy filtered resources.
[INFO] Copying 14 resources
[INFO] Copying 3 resources
[INFO] [compiler:compile {execution: default-compile}]
[INFO] Compiling 358 source files to <https://builds.apache.org/job/OpenJPA-trunk-deploy/ws/trunk/openjpa-jdbc/target/classes>
[INFO] [compiler:testCompile {execution: test-source-compile}]
[INFO] Compiling 7 source files to <https://builds.apache.org/job/OpenJPA-trunk-deploy/ws/trunk/openjpa-jdbc/target/test-classes>
[INFO] [resources:testResources {execution: default-testResources}]
[INFO] Using 'UTF-8' encoding to copy filtered resources.
[INFO] skip non existing resourceDirectory <https://builds.apache.org/job/OpenJPA-trunk-deploy/ws/trunk/openjpa-jdbc/src/test/resources>
[INFO] Copying 3 resources
[INFO] [compiler:testCompile {execution: default-testCompile}]
[INFO] Nothing to compile - all classes are up to date
[WARNING] DEPRECATED [systemProperties]: Use systemPropertyVariables instead.
[INFO] [surefire:test {execution: default-test}]
[INFO] Surefire report directory: <https://builds.apache.org/job/OpenJPA-trunk-deploy/ws/trunk/openjpa-jdbc/target/surefire-reports>

-------------------------------------------------------
 T E S T S
-------------------------------------------------------
Running org.apache.openjpa.jdbc.sql.identifier.TestDBIdentifiers
Tests run: 5, Failures: 0, Errors: 0, Skipped: 0, Time elapsed: 0.047 sec
Running org.apache.openjpa.jdbc.meta.TestMappingDefaultsImpl
8  INFO   [main] openjpa.jdbc.JDBC - Using dictionary class "org.apache.openjpa.jdbc.sql.OracleDictionary".
Tests run: 1, Failures: 0, Errors: 0, Skipped: 0, Time elapsed: 0.183 sec
Running org.apache.openjpa.jdbc.sql.TestDBDictionaryGeneratedSQL
Tests run: 5, Failures: 0, Errors: 0, Skipped: 0, Time elapsed: 0.162 sec
Running org.apache.openjpa.jdbc.sql.TestDB2Dictionary
Tests run: 5, Failures: 0, Errors: 0, Skipped: 0, Time elapsed: 0.109 sec
Running org.apache.openjpa.jdbc.sql.TestMySQLDictionary
Tests run: 3, Failures: 0, Errors: 0, Skipped: 0, Time elapsed: 0.073 sec
Running org.apache.openjpa.jdbc.kernel.TestUpdateManagerFlushException
Tests run: 1, Failures: 0, Errors: 0, Skipped: 0, Time elapsed: 0.006 sec
Running org.apache.openjpa.jdbc.sql.TestDictionaryFactory
Tests run: 1, Failures: 0, Errors: 0, Skipped: 0, Time elapsed: 0.004 sec

Results :

Tests run: 21, Failures: 0, Errors: 0, Skipped: 0

[JENKINS] Recording test results
[INFO] [jar:jar {execution: default-jar}]
[INFO] Building jar: <https://builds.apache.org/job/OpenJPA-trunk-deploy/ws/trunk/openjpa-jdbc/target/openjpa-jdbc-2.3.0-SNAPSHOT.jar>
[INFO] [jar:jar {execution: default-jar}]
[INFO] [jar:test-jar {execution: attach-tests}]
[INFO] Building jar: <https://builds.apache.org/job/OpenJPA-trunk-deploy/ws/trunk/openjpa-jdbc/target/openjpa-jdbc-2.3.0-SNAPSHOT-tests.jar>
[INFO] [ianal:verify-legal-files {execution: default}]
[INFO] Checking legal files in: openjpa-jdbc-2.3.0-SNAPSHOT.jar
[INFO] Checking legal files in: openjpa-jdbc-2.3.0-SNAPSHOT-tests.jar
[INFO] [apache-rat:check {execution: default}]
[INFO] Exclude: **/.*/**
[INFO] Exclude: **/target/**/*
[INFO] [install:install {execution: default-install}]
[INFO] Installing <https://builds.apache.org/job/OpenJPA-trunk-deploy/ws/trunk/openjpa-jdbc/target/openjpa-jdbc-2.3.0-SNAPSHOT.jar>
to /home/jenkins/jenkins-slave/maven-repositories/1/org/apache/openjpa/openjpa-jdbc/2.3.0-SNAPSHOT/openjpa-jdbc-2.3.0-SNAPSHOT.jar
[INFO] Installing <https://builds.apache.org/job/OpenJPA-trunk-deploy/ws/trunk/openjpa-jdbc/target/openjpa-jdbc-2.3.0-SNAPSHOT-tests.jar>
to /home/jenkins/jenkins-slave/maven-repositories/1/org/apache/openjpa/openjpa-jdbc/2.3.0-SNAPSHOT/openjpa-jdbc-2.3.0-SNAPSHOT-tests.jar
[INFO] [deploy:deploy {execution: default-deploy}]
[INFO] Retrieving previous build number from apache.snapshots.https
[WARNING] *** CHECKSUM FAILED - Checksum failed on download: local = 'd2db25744ecbf117cf444b35aba6d4050a0beac5';
remote = 'b67effa3d45ee2befbb51f8cc16f0ded543ab31a' - RETRYING
[WARNING] *** CHECKSUM FAILED - Checksum failed on download: local = 'd2db25744ecbf117cf444b35aba6d4050a0beac5';
remote = 'b67effa3d45ee2befbb51f8cc16f0ded543ab31a' - IGNORING
Uploading: https://repository.apache.org/content/repositories/snapshots/org/apache/openjpa/openjpa-jdbc/2.3.0-SNAPSHOT/openjpa-jdbc-2.3.0-20130719.064805-147.jar
1400K uploaded  (openjpa-jdbc-2.3.0-20130719.064805-147.jar)
[INFO] Uploading project information for openjpa-jdbc 2.3.0-20130719.064805-147
[INFO] Retrieving previous metadata from apache.snapshots.https
[INFO] Uploading repository metadata for: 'artifact org.apache.openjpa:openjpa-jdbc'
[INFO] Retrieving previous metadata from apache.snapshots.https
[WARNING] *** CHECKSUM FAILED - Checksum failed on download: local = 'd2db25744ecbf117cf444b35aba6d4050a0beac5';
remote = 'b67effa3d45ee2befbb51f8cc16f0ded543ab31a' - RETRYING
[WARNING] *** CHECKSUM FAILED - Checksum failed on download: local = 'd2db25744ecbf117cf444b35aba6d4050a0beac5';
remote = 'b67effa3d45ee2befbb51f8cc16f0ded543ab31a' - IGNORING
[INFO] Uploading repository metadata for: 'snapshot org.apache.openjpa:openjpa-jdbc:2.3.0-SNAPSHOT'
[INFO] Retrieving previous build number from apache.snapshots.https
Uploading: https://repository.apache.org/content/repositories/snapshots/org/apache/openjpa/openjpa-jdbc/2.3.0-SNAPSHOT/openjpa-jdbc-2.3.0-20130719.064805-147-tests.jar
41K uploaded  (openjpa-jdbc-2.3.0-20130719.064805-147-tests.jar)
[JENKINS] Archiving <https://builds.apache.org/job/OpenJPA-trunk-deploy/ws/trunk/openjpa-jdbc/pom.xml>
to /home/hudson/hudson/jobs/OpenJPA-trunk-deploy/modules/org.apache.openjpa$openjpa-jdbc/builds/2013-07-19_06-47-38/archive/org.apache.openjpa/openjpa-jdbc/2.3.0-SNAPSHOT/openjpa-jdbc-2.3.0-SNAPSHOT.pom
[JENKINS] Archiving <https://builds.apache.org/job/OpenJPA-trunk-deploy/ws/trunk/openjpa-jdbc/target/openjpa-jdbc-2.3.0-SNAPSHOT.jar>
to /home/hudson/hudson/jobs/OpenJPA-trunk-deploy/modules/org.apache.openjpa$openjpa-jdbc/builds/2013-07-19_06-47-38/archive/org.apache.openjpa/openjpa-jdbc/2.3.0-20130719.064805-147/openjpa-jdbc-2.3.0-20130719.064805-147.jar
[JENKINS] Archiving <https://builds.apache.org/job/OpenJPA-trunk-deploy/ws/trunk/openjpa-jdbc/target/openjpa-jdbc-2.3.0-SNAPSHOT-tests.jar>
to /home/hudson/hudson/jobs/OpenJPA-trunk-deploy/modules/org.apache.openjpa$openjpa-jdbc/builds/2013-07-19_06-47-38/archive/org.apache.openjpa/openjpa-jdbc/2.3.0-20130719.064805-147/openjpa-jdbc-2.3.0-20130719.064805-147-tests.jar
[INFO] ------------------------------------------------------------------------
[INFO] Building OpenJPA Persistence
[INFO]    task-segment: [clean, deploy]
[INFO] ------------------------------------------------------------------------
[INFO] [clean:clean {execution: default-clean}]
[INFO] [buildnumber:create {execution: default}]
[INFO] [enforcer:enforce {execution: default}]
[INFO] [checkstyle:checkstyle {execution: default}]
[INFO] Starting audit...
Audit done.

[WARNING] Unable to locate Source XRef to link to - DISABLED
[INFO] [remote-resources:process {execution: default}]
[INFO] [resources:resources {execution: default-resources}]
[INFO] Using 'UTF-8' encoding to copy filtered resources.
[INFO] Copying 14 resources
[INFO] Copying 3 resources
[INFO] [compiler:compile {execution: default-compile}]
[INFO] Compiling 233 source files to <https://builds.apache.org/job/OpenJPA-trunk-deploy/ws/trunk/openjpa-persistence/target/classes>
[INFO] [compiler:testCompile {execution: test-source-compile}]
[INFO] Compiling 2 source files to <https://builds.apache.org/job/OpenJPA-trunk-deploy/ws/trunk/openjpa-persistence/target/test-classes>
[INFO] [resources:testResources {execution: default-testResources}]
[INFO] Using 'UTF-8' encoding to copy filtered resources.
[INFO] Copying 3 resources
[INFO] Copying 3 resources
[INFO] [compiler:testCompile {execution: default-testCompile}]
[INFO] Nothing to compile - all classes are up to date
[WARNING] DEPRECATED [systemProperties]: Use systemPropertyVariables instead.
[INFO] [surefire:test {execution: default-test}]
[INFO] Surefire report directory: <https://builds.apache.org/job/OpenJPA-trunk-deploy/ws/trunk/openjpa-persistence/target/surefire-reports>

-------------------------------------------------------
 T E S T S
-------------------------------------------------------
Running org.apache.openjpa.persistence.TestEnumToKernelConstantMappings
Tests run: 7, Failures: 0, Errors: 0, Skipped: 0, Time elapsed: 0.028 sec
Running org.apache.openjpa.persistence.TestPersistenceProductDerivation
Tests run: 5, Failures: 0, Errors: 0, Skipped: 0, Time elapsed: 0.237 sec

Results :

Tests run: 12, Failures: 0, Errors: 0, Skipped: 0

[JENKINS] Recording test results
[INFO] [jar:jar {execution: default-jar}]
[INFO] Building jar: <https://builds.apache.org/job/OpenJPA-trunk-deploy/ws/trunk/openjpa-persistence/target/openjpa-persistence-2.3.0-SNAPSHOT.jar>
[INFO] [jar:jar {execution: default-jar}]
[INFO] [jar:test-jar {execution: attach-tests}]
[INFO] Building jar: <https://builds.apache.org/job/OpenJPA-trunk-deploy/ws/trunk/openjpa-persistence/target/openjpa-persistence-2.3.0-SNAPSHOT-tests.jar>
[INFO] [ianal:verify-legal-files {execution: default}]
[INFO] Checking legal files in: openjpa-persistence-2.3.0-SNAPSHOT.jar
[INFO] Checking legal files in: openjpa-persistence-2.3.0-SNAPSHOT-tests.jar
[INFO] [apache-rat:check {execution: default}]
[INFO] Exclude: **/.*/**
[INFO] Exclude: **/target/**/*
[INFO] [install:install {execution: default-install}]
[INFO] Installing <https://builds.apache.org/job/OpenJPA-trunk-deploy/ws/trunk/openjpa-persistence/target/openjpa-persistence-2.3.0-SNAPSHOT.jar>
to /home/jenkins/jenkins-slave/maven-repositories/1/org/apache/openjpa/openjpa-persistence/2.3.0-SNAPSHOT/openjpa-persistence-2.3.0-SNAPSHOT.jar
[INFO] Installing <https://builds.apache.org/job/OpenJPA-trunk-deploy/ws/trunk/openjpa-persistence/target/openjpa-persistence-2.3.0-SNAPSHOT-tests.jar>
to /home/jenkins/jenkins-slave/maven-repositories/1/org/apache/openjpa/openjpa-persistence/2.3.0-SNAPSHOT/openjpa-persistence-2.3.0-SNAPSHOT-tests.jar
[INFO] [deploy:deploy {execution: default-deploy}]
[INFO] Retrieving previous build number from apache.snapshots.https
[WARNING] *** CHECKSUM FAILED - Checksum failed on download: local = '834997346652b5c9e1cb8a9c4431ef528544c20b';
remote = '515bd7476622deda123bf8ad47eae01397810e0e' - RETRYING
[WARNING] *** CHECKSUM FAILED - Checksum failed on download: local = '834997346652b5c9e1cb8a9c4431ef528544c20b';
remote = '515bd7476622deda123bf8ad47eae01397810e0e' - IGNORING
Uploading: https://repository.apache.org/content/repositories/snapshots/org/apache/openjpa/openjpa-persistence/2.3.0-SNAPSHOT/openjpa-persistence-2.3.0-20130719.064805-145.jar
810K uploaded  (openjpa-persistence-2.3.0-20130719.064805-145.jar)
[INFO] Uploading project information for openjpa-persistence 2.3.0-20130719.064805-145
[INFO] Retrieving previous metadata from apache.snapshots.https
[WARNING] *** CHECKSUM FAILED - Checksum failed on download: local = '834997346652b5c9e1cb8a9c4431ef528544c20b';
remote = '515bd7476622deda123bf8ad47eae01397810e0e' - RETRYING
[WARNING] *** CHECKSUM FAILED - Checksum failed on download: local = '834997346652b5c9e1cb8a9c4431ef528544c20b';
remote = '515bd7476622deda123bf8ad47eae01397810e0e' - IGNORING
[INFO] Uploading repository metadata for: 'snapshot org.apache.openjpa:openjpa-persistence:2.3.0-SNAPSHOT'
[INFO] Retrieving previous metadata from apache.snapshots.https
[INFO] Uploading repository metadata for: 'artifact org.apache.openjpa:openjpa-persistence'
[INFO] Retrieving previous build number from apache.snapshots.https
Uploading: https://repository.apache.org/content/repositories/snapshots/org/apache/openjpa/openjpa-persistence/2.3.0-SNAPSHOT/openjpa-persistence-2.3.0-20130719.064805-145-tests.jar
29K uploaded  (openjpa-persistence-2.3.0-20130719.064805-145-tests.jar)
[JENKINS] Archiving <https://builds.apache.org/job/OpenJPA-trunk-deploy/ws/trunk/openjpa-persistence/pom.xml>
to /home/hudson/hudson/jobs/OpenJPA-trunk-deploy/modules/org.apache.openjpa$openjpa-persistence/builds/2013-07-19_06-47-38/archive/org.apache.openjpa/openjpa-persistence/2.3.0-SNAPSHOT/openjpa-persistence-2.3.0-SNAPSHOT.pom
[JENKINS] Archiving <https://builds.apache.org/job/OpenJPA-trunk-deploy/ws/trunk/openjpa-persistence/target/openjpa-persistence-2.3.0-SNAPSHOT.jar>
to /home/hudson/hudson/jobs/OpenJPA-trunk-deploy/modules/org.apache.openjpa$openjpa-persistence/builds/2013-07-19_06-47-38/archive/org.apache.openjpa/openjpa-persistence/2.3.0-20130719.064805-145/openjpa-persistence-2.3.0-20130719.064805-145.jar
[JENKINS] Archiving <https://builds.apache.org/job/OpenJPA-trunk-deploy/ws/trunk/openjpa-persistence/target/openjpa-persistence-2.3.0-SNAPSHOT-tests.jar>
to /home/hudson/hudson/jobs/OpenJPA-trunk-deploy/modules/org.apache.openjpa$openjpa-persistence/builds/2013-07-19_06-47-38/archive/org.apache.openjpa/openjpa-persistence/2.3.0-20130719.064805-145/openjpa-persistence-2.3.0-20130719.064805-145-tests.jar
[INFO] ------------------------------------------------------------------------
[INFO] Building OpenJPA Persistence JDBC
[INFO]    task-segment: [clean, deploy]
[INFO] ------------------------------------------------------------------------
[INFO] [clean:clean {execution: default-clean}]
[INFO] [buildnumber:create {execution: default}]
[INFO] [enforcer:enforce {execution: default}]
[INFO] [checkstyle:checkstyle {execution: default}]
[INFO] Starting audit...
<https://builds.apache.org/job/OpenJPA-trunk-deploy/ws/trunk/openjpa-persistence-jdbc/src/test/java/org/apache/openjpa/persistence/datacache/common/apps/M2MEntityF.java>:48:
Line matches the illegal pattern 'System\.(out|err)\.print(ln)?\('.
<https://builds.apache.org/job/OpenJPA-trunk-deploy/ws/trunk/openjpa-persistence-jdbc/src/test/java/org/apache/openjpa/persistence/datacache/common/apps/M2MEntityE.java>:50:
Line matches the illegal pattern 'System\.(out|err)\.print(ln)?\('.
<https://builds.apache.org/job/OpenJPA-trunk-deploy/ws/trunk/openjpa-persistence-jdbc/src/test/java/org/apache/openjpa/persistence/criteria/StringComparison.java>:87:
Line matches the illegal pattern 'System\.(out|err)\.print(ln)?\('.
<https://builds.apache.org/job/OpenJPA-trunk-deploy/ws/trunk/openjpa-persistence-jdbc/src/test/java/org/apache/openjpa/persistence/criteria/StringComparison.java>:97:
Line matches the illegal pattern 'System\.(out|err)\.print(ln)?\('.
<https://builds.apache.org/job/OpenJPA-trunk-deploy/ws/trunk/openjpa-persistence-jdbc/src/test/java/org/apache/openjpa/persistence/criteria/StringComparison.java>:117:
Line matches the illegal pattern 'System\.(out|err)\.print(ln)?\('.
<https://builds.apache.org/job/OpenJPA-trunk-deploy/ws/trunk/openjpa-persistence-jdbc/src/test/java/org/apache/openjpa/persistence/criteria/StringComparison.java>:118:
Line matches the illegal pattern 'System\.(out|err)\.print(ln)?\('.
<https://builds.apache.org/job/OpenJPA-trunk-deploy/ws/trunk/openjpa-persistence-jdbc/src/test/java/org/apache/openjpa/persistence/criteria/StringComparison.java>:119:
Line matches the illegal pattern 'System\.(out|err)\.print(ln)?\('.
<https://builds.apache.org/job/OpenJPA-trunk-deploy/ws/trunk/openjpa-persistence-jdbc/src/test/java/org/apache/openjpa/persistence/criteria/StringComparison.java>:120:
Line matches the illegal pattern 'System\.(out|err)\.print(ln)?\('.
<https://builds.apache.org/job/OpenJPA-trunk-deploy/ws/trunk/openjpa-persistence-jdbc/src/test/java/org/apache/openjpa/persistence/annotations/common/apps/annotApp/annotype/LongNameValidator.java>:29:
Line matches the illegal pattern 'System\.(out|err)\.print(ln)?\('.
<https://builds.apache.org/job/OpenJPA-trunk-deploy/ws/trunk/openjpa-persistence-jdbc/src/test/java/org/apache/openjpa/persistence/annotations/common/apps/annotApp/annotype/ContractEmployee.java>:44:
Line matches the illegal pattern 'System\.(out|err)\.print(ln)?\('.
<https://builds.apache.org/job/OpenJPA-trunk-deploy/ws/trunk/openjpa-persistence-jdbc/src/test/java/org/apache/openjpa/persistence/annotations/common/apps/annotApp/annotype/StringValidator.java>:36:
Line matches the illegal pattern 'System\.(out|err)\.print(ln)?\('.
<https://builds.apache.org/job/OpenJPA-trunk-deploy/ws/trunk/openjpa-persistence-jdbc/src/test/java/org/apache/openjpa/persistence/annotations/common/apps/annotApp/annotype/Employee.java>:73:
Line matches the illegal pattern 'System\.(out|err)\.print(ln)?\('.
<https://builds.apache.org/job/OpenJPA-trunk-deploy/ws/trunk/openjpa-persistence-jdbc/src/test/java/org/apache/openjpa/persistence/annotations/common/apps/annotApp/annotype/DateValidator.java>:31:
Line matches the illegal pattern 'System\.(out|err)\.print(ln)?\('.
<https://builds.apache.org/job/OpenJPA-trunk-deploy/ws/trunk/openjpa-persistence-jdbc/src/test/java/org/apache/openjpa/persistence/annotations/common/apps/annotApp/annotype/DateValidator.java>:39:
Line matches the illegal pattern 'System\.(out|err)\.print(ln)?\('.
<https://builds.apache.org/job/OpenJPA-trunk-deploy/ws/trunk/openjpa-persistence-jdbc/src/test/java/org/apache/openjpa/persistence/annotations/common/apps/annotApp/annotype/NameValidator.java>:29:
Line matches the illegal pattern 'System\.(out|err)\.print(ln)?\('.
<https://builds.apache.org/job/OpenJPA-trunk-deploy/ws/trunk/openjpa-persistence-jdbc/src/test/java/org/apache/openjpa/persistence/annotations/common/apps/annotApp/annotype/NameValidator.java>:47:
Line matches the illegal pattern 'System\.(out|err)\.print(ln)?\('.
<https://builds.apache.org/job/OpenJPA-trunk-deploy/ws/trunk/openjpa-persistence-jdbc/src/test/java/org/apache/openjpa/persistence/annotations/common/apps/annotApp/annotype/NameValidator.java>:56:
Line matches the illegal pattern 'System\.(out|err)\.print(ln)?\('.
<https://builds.apache.org/job/OpenJPA-trunk-deploy/ws/trunk/openjpa-persistence-jdbc/src/test/java/org/apache/openjpa/persistence/annotations/common/apps/annotApp/ddtype/LongNameValidator.java>:28:
Line matches the illegal pattern 'System\.(out|err)\.print(ln)?\('.
<https://builds.apache.org/job/OpenJPA-trunk-deploy/ws/trunk/openjpa-persistence-jdbc/src/test/java/org/apache/openjpa/persistence/annotations/common/apps/annotApp/ddtype/ContractEmployee.java>:43:
Line matches the illegal pattern 'System\.(out|err)\.print(ln)?\('.
<https://builds.apache.org/job/OpenJPA-trunk-deploy/ws/trunk/openjpa-persistence-jdbc/src/test/java/org/apache/openjpa/persistence/annotations/common/apps/annotApp/ddtype/StringValidator.java>:35:
Line matches the illegal pattern 'System\.(out|err)\.print(ln)?\('.
<https://builds.apache.org/job/OpenJPA-trunk-deploy/ws/trunk/openjpa-persistence-jdbc/src/test/java/org/apache/openjpa/persistence/annotations/common/apps/annotApp/ddtype/Employee.java>:72:
Line matches the illegal pattern 'System\.(out|err)\.print(ln)?\('.
<https://builds.apache.org/job/OpenJPA-trunk-deploy/ws/trunk/openjpa-persistence-jdbc/src/test/java/org/apache/openjpa/persistence/annotations/common/apps/annotApp/ddtype/DateValidator.java>:30:
Line matches the illegal pattern 'System\.(out|err)\.print(ln)?\('.
<https://builds.apache.org/job/OpenJPA-trunk-deploy/ws/trunk/openjpa-persistence-jdbc/src/test/java/org/apache/openjpa/persistence/annotations/common/apps/annotApp/ddtype/DateValidator.java>:38:
Line matches the illegal pattern 'System\.(out|err)\.print(ln)?\('.
<https://builds.apache.org/job/OpenJPA-trunk-deploy/ws/trunk/openjpa-persistence-jdbc/src/test/java/org/apache/openjpa/persistence/annotations/common/apps/annotApp/ddtype/NameValidator.java>:28:
Line matches the illegal pattern 'System\.(out|err)\.print(ln)?\('.
<https://builds.apache.org/job/OpenJPA-trunk-deploy/ws/trunk/openjpa-persistence-jdbc/src/test/java/org/apache/openjpa/persistence/annotations/common/apps/annotApp/ddtype/NameValidator.java>:46:
Line matches the illegal pattern 'System\.(out|err)\.print(ln)?\('.
<https://builds.apache.org/job/OpenJPA-trunk-deploy/ws/trunk/openjpa-persistence-jdbc/src/test/java/org/apache/openjpa/persistence/annotations/common/apps/annotApp/ddtype/NameValidator.java>:55:
Line matches the illegal pattern 'System\.(out|err)\.print(ln)?\('.
<https://builds.apache.org/job/OpenJPA-trunk-deploy/ws/trunk/openjpa-persistence-jdbc/src/test/java/org/apache/openjpa/persistence/detach/IntVersionEntity.java>:79:
Line matches the illegal pattern 'System\.(out|err)\.print(ln)?\('.
<https://builds.apache.org/job/OpenJPA-trunk-deploy/ws/trunk/openjpa-persistence-jdbc/src/test/java/org/apache/openjpa/persistence/distinctjoin/LocalizedText.java>:38:
Line matches the illegal pattern 'System\.(out|err)\.print(ln)?\('.
<https://builds.apache.org/job/OpenJPA-trunk-deploy/ws/trunk/openjpa-persistence-jdbc/src/test/java/org/apache/openjpa/persistence/test/ClassSelector.java>:70:
Line matches the illegal pattern 'System\.(out|err)\.print(ln)?\('.
<https://builds.apache.org/job/OpenJPA-trunk-deploy/ws/trunk/openjpa-persistence-jdbc/src/test/java/org/apache/openjpa/persistence/test/ClassSelector.java>:72:
Line matches the illegal pattern 'System\.(out|err)\.print(ln)?\('.
<https://builds.apache.org/job/OpenJPA-trunk-deploy/ws/trunk/openjpa-persistence-jdbc/src/test/java/org/apache/openjpa/persistence/test/ClassSelector.java>:74:
Line matches the illegal pattern 'System\.(out|err)\.print(ln)?\('.
<https://builds.apache.org/job/OpenJPA-trunk-deploy/ws/trunk/openjpa-persistence-jdbc/src/test/java/org/apache/openjpa/persistence/test/ClassSelector.java>:147:
Line matches the illegal pattern 'System\.(out|err)\.print(ln)?\('.
<https://builds.apache.org/job/OpenJPA-trunk-deploy/ws/trunk/openjpa-persistence-jdbc/src/test/java/org/apache/openjpa/persistence/jdbc/common/apps/mappingApp/SQLMapAddress.java>:173:
Line matches the illegal pattern 'System\.(out|err)\.print(ln)?\('.
<https://builds.apache.org/job/OpenJPA-trunk-deploy/ws/trunk/openjpa-persistence-jdbc/src/test/java/org/apache/openjpa/persistence/jdbc/common/apps/mappingApp/SQLMapOrder.java>:87:
Line matches the illegal pattern 'System\.(out|err)\.print(ln)?\('.
<https://builds.apache.org/job/OpenJPA-trunk-deploy/ws/trunk/openjpa-persistence-jdbc/src/test/java/org/apache/openjpa/persistence/jdbc/common/apps/mappingApp/SQLMapItem.java>:128:
Line matches the illegal pattern 'System\.(out|err)\.print(ln)?\('.
<https://builds.apache.org/job/OpenJPA-trunk-deploy/ws/trunk/openjpa-persistence-jdbc/src/test/java/org/apache/openjpa/persistence/jdbc/common/apps/mappingApp/SQLMapItem.java>:141:
Line matches the illegal pattern 'System\.(out|err)\.print(ln)?\('.
Audit done.

[JENKINS] Archiving <https://builds.apache.org/job/OpenJPA-trunk-deploy/ws/trunk/openjpa-persistence-jdbc/pom.xml>
to /home/hudson/hudson/jobs/OpenJPA-trunk-deploy/modules/org.apache.openjpa$openjpa-persistence-jdbc/builds/2013-07-19_06-47-38/archive/org.apache.openjpa/openjpa-persistence-jdbc/2.3.0-SNAPSHOT/openjpa-persistence-jdbc-2.3.0-SNAPSHOT.pom
[INFO] ------------------------------------------------------------------------
[ERROR] BUILD ERROR
[INFO] ------------------------------------------------------------------------
[INFO] An error has occurred in Checkstyle report generation.

Embedded error: There are 36 checkstyle errors.
[INFO] ------------------------------------------------------------------------
[INFO] For more information, run Maven with the -e switch
[INFO] ------------------------------------------------------------------------
[INFO] Total time: 1 minute 29 seconds
[INFO] Finished at: Fri Jul 19 06:49:16 UTC 2013
[INFO] Final Memory: 101M/480M
[INFO] ------------------------------------------------------------------------
Sending e-mails to: commits@openjpa.apache.org
channel stopped

Mime
View raw message