openjpa-commits mailing list archives

Site index · List index
Message view « Date » · « Thread »
Top « Date » · « Thread »
From Apache Jenkins Server <jenk...@builds.apache.org>
Subject Build failed in Jenkins: OpenJPA-trunk-deploy #402
Date Sat, 20 Jul 2013 07:55:17 GMT
See <https://builds.apache.org/job/OpenJPA-trunk-deploy/402/changes>

Changes:

[curtisr7] OPENJPA-2410 : Yet another checkstyle update. Should fix nix issues.

[jgrassel] OPENJPA-2400: MariaDB DBDictionaryFactory update

[curtisr7] OPENJPA-2410 : Yet another checkstyle update.

[curtisr7] OPENJPA-2410 : Another minor change to checkstyle.xml

[curtisr7] OPENJPA-2410 : Minor change to checkstyle suppressions.xml

------------------------------------------
[...truncated 36771 lines...]
2K uploaded  (openjpa-examples-2.3.0-20130720.065149-124.pom)
[INFO] Retrieving previous metadata from apache.snapshots.https
[WARNING] *** CHECKSUM FAILED - Checksum failed on download: local = '68947cbfa7d9fc9299bc501407453025e49c6f86';
remote = '42ae4e49a9abd8a6dbd5cb14e0441a629c01c773' - RETRYING
[WARNING] *** CHECKSUM FAILED - Checksum failed on download: local = '68947cbfa7d9fc9299bc501407453025e49c6f86';
remote = '42ae4e49a9abd8a6dbd5cb14e0441a629c01c773' - IGNORING
[INFO] Uploading repository metadata for: 'snapshot org.apache.openjpa:openjpa-examples:2.3.0-SNAPSHOT'
[INFO] Retrieving previous metadata from apache.snapshots.https
[INFO] Uploading repository metadata for: 'artifact org.apache.openjpa:openjpa-examples'
[JENKINS] Archiving <https://builds.apache.org/job/OpenJPA-trunk-deploy/ws/trunk/openjpa-examples/pom.xml>
to /home/hudson/hudson/jobs/OpenJPA-trunk-deploy/modules/org.apache.openjpa$openjpa-examples/builds/2013-07-20_06-50-57/archive/org.apache.openjpa/openjpa-examples/2.3.0-SNAPSHOT/openjpa-examples-2.3.0-SNAPSHOT.pom
[JENKINS] Archiving /home/jenkins/jenkins-slave/maven-repositories/1/org/apache/openjpa/openjpa-examples/2.3.0-SNAPSHOT/openjpa-examples-2.3.0-SNAPSHOT.pom
to /home/hudson/hudson/jobs/OpenJPA-trunk-deploy/modules/org.apache.openjpa$openjpa-examples/builds/2013-07-20_06-50-57/archive/org.apache.openjpa/openjpa-examples/2.3.0-20130720.065149-124/openjpa-examples-2.3.0-20130720.065149-124.pom
[INFO] ------------------------------------------------------------------------
[INFO] Building OpenJPA Examples - Simple
[INFO]    task-segment: [clean, deploy]
[INFO] ------------------------------------------------------------------------
[INFO] [clean:clean {execution: default-clean}]
[INFO] [buildnumber:create {execution: default}]
[INFO] [enforcer:enforce {execution: default}]
[INFO] [checkstyle:checkstyle {execution: default}]
[INFO] Starting audit...
Audit done.

[WARNING] Unable to locate Source XRef to link to - DISABLED
[INFO] [remote-resources:process {execution: default}]
[INFO] [resources:resources {execution: default-resources}]
[INFO] Using 'UTF-8' encoding to copy filtered resources.
[INFO] skip non existing resourceDirectory <https://builds.apache.org/job/OpenJPA-trunk-deploy/ws/trunk/openjpa-examples/simple/src/main/resources>
[INFO] Copying 3 resources
[INFO] [compiler:compile {execution: default-compile}]
[INFO] Compiling 12 source files to <https://builds.apache.org/job/OpenJPA-trunk-deploy/ws/trunk/openjpa-examples/simple/target/classes>
[INFO] [compiler:testCompile {execution: test-source-compile}]
[INFO] Nothing to compile - all classes are up to date
[INFO] [resources:testResources {execution: default-testResources}]
[INFO] Using 'UTF-8' encoding to copy filtered resources.
[INFO] skip non existing resourceDirectory <https://builds.apache.org/job/OpenJPA-trunk-deploy/ws/trunk/openjpa-examples/simple/src/test/resources>
[INFO] Copying 3 resources
[INFO] [compiler:testCompile {execution: default-testCompile}]
[INFO] Nothing to compile - all classes are up to date
[WARNING] DEPRECATED [systemProperties]: Use systemPropertyVariables instead.
[INFO] [surefire:test {execution: default-test}]
[INFO] Surefire report directory: <https://builds.apache.org/job/OpenJPA-trunk-deploy/ws/trunk/openjpa-examples/simple/target/surefire-reports>

-------------------------------------------------------
 T E S T S
-------------------------------------------------------
There are no tests to run.

Results :

Tests run: 0, Failures: 0, Errors: 0, Skipped: 0

[JENKINS] Recording test results
[INFO] [jar:jar {execution: default-jar}]
[INFO] Building jar: <https://builds.apache.org/job/OpenJPA-trunk-deploy/ws/trunk/openjpa-examples/simple/target/simple-2.3.0-SNAPSHOT.jar>
[INFO] [jar:jar {execution: default-jar}]
[INFO] [jar:test-jar {execution: attach-tests}]
[INFO] Building jar: <https://builds.apache.org/job/OpenJPA-trunk-deploy/ws/trunk/openjpa-examples/simple/target/simple-2.3.0-SNAPSHOT-tests.jar>
[INFO] [ianal:verify-legal-files {execution: default}]
[INFO] Checking legal files in: simple-2.3.0-SNAPSHOT.jar
[INFO] Checking legal files in: simple-2.3.0-SNAPSHOT-tests.jar
[INFO] [apache-rat:check {execution: default}]
[INFO] Exclude: **/.*/**
[INFO] Exclude: **/target/**/*
[INFO] [install:install {execution: default-install}]
[INFO] Installing <https://builds.apache.org/job/OpenJPA-trunk-deploy/ws/trunk/openjpa-examples/simple/target/simple-2.3.0-SNAPSHOT.jar>
to /home/jenkins/jenkins-slave/maven-repositories/1/org/apache/openjpa/openjpa-examples/simple/2.3.0-SNAPSHOT/simple-2.3.0-SNAPSHOT.jar
[INFO] Installing <https://builds.apache.org/job/OpenJPA-trunk-deploy/ws/trunk/openjpa-examples/simple/target/simple-2.3.0-SNAPSHOT-tests.jar>
to /home/jenkins/jenkins-slave/maven-repositories/1/org/apache/openjpa/openjpa-examples/simple/2.3.0-SNAPSHOT/simple-2.3.0-SNAPSHOT-tests.jar
[INFO] [deploy:deploy {execution: default-deploy}]
[INFO] Retrieving previous build number from apache.snapshots.https
[WARNING] *** CHECKSUM FAILED - Checksum failed on download: local = '91e687f681d2dedf10a1d6ebf7ce51ca9bad3297';
remote = '8375e4700b2ef7e806ddfba893f1749a91a23472' - RETRYING
[WARNING] *** CHECKSUM FAILED - Checksum failed on download: local = '91e687f681d2dedf10a1d6ebf7ce51ca9bad3297';
remote = '8375e4700b2ef7e806ddfba893f1749a91a23472' - IGNORING
Uploading: https://repository.apache.org/content/repositories/snapshots/org/apache/openjpa/openjpa-examples/simple/2.3.0-SNAPSHOT/simple-2.3.0-20130720.065149-124.jar
21K uploaded  (simple-2.3.0-20130720.065149-124.jar)
[INFO] Uploading project information for simple 2.3.0-20130720.065149-124
[INFO] Retrieving previous metadata from apache.snapshots.https
[WARNING] *** CHECKSUM FAILED - Checksum failed on download: local = '91e687f681d2dedf10a1d6ebf7ce51ca9bad3297';
remote = '8375e4700b2ef7e806ddfba893f1749a91a23472' - RETRYING
[WARNING] *** CHECKSUM FAILED - Checksum failed on download: local = '91e687f681d2dedf10a1d6ebf7ce51ca9bad3297';
remote = '8375e4700b2ef7e806ddfba893f1749a91a23472' - IGNORING
[INFO] Uploading repository metadata for: 'snapshot org.apache.openjpa.openjpa-examples:simple:2.3.0-SNAPSHOT'
[INFO] Retrieving previous metadata from apache.snapshots.https
[INFO] Uploading repository metadata for: 'artifact org.apache.openjpa.openjpa-examples:simple'
[INFO] Retrieving previous build number from apache.snapshots.https
Uploading: https://repository.apache.org/content/repositories/snapshots/org/apache/openjpa/openjpa-examples/simple/2.3.0-SNAPSHOT/simple-2.3.0-20130720.065149-124-tests.jar
7K uploaded  (simple-2.3.0-20130720.065149-124-tests.jar)
[JENKINS] Archiving <https://builds.apache.org/job/OpenJPA-trunk-deploy/ws/trunk/openjpa-examples/simple/pom.xml>
to /home/hudson/hudson/jobs/OpenJPA-trunk-deploy/modules/org.apache.openjpa.openjpa-examples$simple/builds/2013-07-20_06-50-57/archive/org.apache.openjpa.openjpa-examples/simple/2.3.0-SNAPSHOT/simple-2.3.0-SNAPSHOT.pom
[JENKINS] Archiving <https://builds.apache.org/job/OpenJPA-trunk-deploy/ws/trunk/openjpa-examples/simple/target/simple-2.3.0-SNAPSHOT.jar>
to /home/hudson/hudson/jobs/OpenJPA-trunk-deploy/modules/org.apache.openjpa.openjpa-examples$simple/builds/2013-07-20_06-50-57/archive/org.apache.openjpa.openjpa-examples/simple/2.3.0-20130720.065149-124/simple-2.3.0-20130720.065149-124.jar
[JENKINS] Archiving <https://builds.apache.org/job/OpenJPA-trunk-deploy/ws/trunk/openjpa-examples/simple/target/simple-2.3.0-SNAPSHOT-tests.jar>
to /home/hudson/hudson/jobs/OpenJPA-trunk-deploy/modules/org.apache.openjpa.openjpa-examples$simple/builds/2013-07-20_06-50-57/archive/org.apache.openjpa.openjpa-examples/simple/2.3.0-20130720.065149-124/simple-2.3.0-20130720.065149-124-tests.jar
[INFO] ------------------------------------------------------------------------
[INFO] Building OpenJPA Examples - image-gallery
[INFO]    task-segment: [clean, deploy]
[INFO] ------------------------------------------------------------------------
[INFO] [clean:clean {execution: default-clean}]
[INFO] [buildnumber:create {execution: default}]
[INFO] [enforcer:enforce {execution: default}]
[INFO] [checkstyle:checkstyle {execution: default}]
[INFO] Starting audit...
Audit done.

[WARNING] Unable to locate Source XRef to link to - DISABLED
[INFO] [remote-resources:process {execution: default}]
[INFO] [resources:resources {execution: default-resources}]
[INFO] Using 'UTF-8' encoding to copy filtered resources.
[INFO] skip non existing resourceDirectory <https://builds.apache.org/job/OpenJPA-trunk-deploy/ws/trunk/openjpa-examples/image-gallery/src/main/resources>
[INFO] Copying 3 resources
[INFO] [compiler:compile {execution: default-compile}]
[INFO] Nothing to compile - all classes are up to date
[INFO] [compiler:testCompile {execution: test-source-compile}]
[INFO] Compiling 12 source files to <https://builds.apache.org/job/OpenJPA-trunk-deploy/ws/trunk/openjpa-examples/image-gallery/target/test-classes>
[INFO] [resources:testResources {execution: default-testResources}]
[INFO] Using 'UTF-8' encoding to copy filtered resources.
[INFO] Copying 1 resource
[INFO] Copying 3 resources
[INFO] [compiler:testCompile {execution: default-testCompile}]
[INFO] Nothing to compile - all classes are up to date
[INFO] [openjpa:test-enhance {execution: enhancer}]
13  BeanValidation  INFO   [pool-1-thread-1] openjpa.Tool - Enhancer running on type "org.apache.openjpa.example.gallery.model.Location".
41  BeanValidation  INFO   [pool-1-thread-1] openjpa.Tool - Enhancer running on type "org.apache.openjpa.example.gallery.model.Album".
79  BeanValidation  INFO   [pool-1-thread-1] openjpa.Tool - Enhancer running on type "org.apache.openjpa.example.gallery.model.Creator".
124  BeanValidation  INFO   [pool-1-thread-1] openjpa.Tool - Enhancer running on type "org.apache.openjpa.example.gallery.model.Image".
[WARNING] DEPRECATED [systemProperties]: Use systemPropertyVariables instead.
[INFO] [surefire:test {execution: default-test}]
[INFO] Surefire report directory: <https://builds.apache.org/job/OpenJPA-trunk-deploy/ws/trunk/openjpa-examples/image-gallery/target/surefire-reports>

-------------------------------------------------------
 T E S T S
-------------------------------------------------------
Running org.apache.openjpa.example.gallery.TestJPAValidation
Persisting an entity with non-matching extension and type
------------------------------------------------
Violation: Image data is not a supported format.
Entity: Image
Attribute: 
Invalid value: org.apache.openjpa.example.gallery.model.Image@c954e
------------------------------------------------
Fixing the file type and re-attempting the persist.
Persist was successful
Modifying file name to use an extension that does not
match the file type.  This will cause a CVE.
Update failed as expected
------------------------------------------------
Violation: Image data is not a supported format.
Entity: Image
Attribute: 
Invalid value: org.apache.openjpa.example.gallery.model.Image@c954e
------------------------------------------------
Setting the type to an invalid type.  This will cause a
validation exception upon removal
Remove failed as expected
------------------------------------------------
Violation: Image type must be specified.
Entity: Image
Attribute: type
Invalid value: null
------------------------------------------------
Done
Tests run: 1, Failures: 0, Errors: 0, Skipped: 0, Time elapsed: 12.881 sec

Results :

Tests run: 1, Failures: 0, Errors: 0, Skipped: 0

[JENKINS] Recording test results
[INFO] [jar:jar {execution: default-jar}]
[INFO] Building jar: <https://builds.apache.org/job/OpenJPA-trunk-deploy/ws/trunk/openjpa-examples/image-gallery/target/image-gallery-2.3.0-SNAPSHOT.jar>
[INFO] [jar:jar {execution: default-jar}]
[INFO] [jar:test-jar {execution: attach-tests}]
[INFO] Building jar: <https://builds.apache.org/job/OpenJPA-trunk-deploy/ws/trunk/openjpa-examples/image-gallery/target/image-gallery-2.3.0-SNAPSHOT-tests.jar>
[INFO] [ianal:verify-legal-files {execution: default}]
[INFO] Checking legal files in: image-gallery-2.3.0-SNAPSHOT.jar
[INFO] Checking legal files in: image-gallery-2.3.0-SNAPSHOT-tests.jar
[INFO] [apache-rat:check {execution: default}]
[INFO] Exclude: **/.*/**
[INFO] Exclude: **/target/**/*
[INFO] [install:install {execution: default-install}]
[INFO] Installing <https://builds.apache.org/job/OpenJPA-trunk-deploy/ws/trunk/openjpa-examples/image-gallery/target/image-gallery-2.3.0-SNAPSHOT.jar>
to /home/jenkins/jenkins-slave/maven-repositories/1/org/apache/openjpa/openjpa-examples/image-gallery/2.3.0-SNAPSHOT/image-gallery-2.3.0-SNAPSHOT.jar
[INFO] Installing <https://builds.apache.org/job/OpenJPA-trunk-deploy/ws/trunk/openjpa-examples/image-gallery/target/image-gallery-2.3.0-SNAPSHOT-tests.jar>
to /home/jenkins/jenkins-slave/maven-repositories/1/org/apache/openjpa/openjpa-examples/image-gallery/2.3.0-SNAPSHOT/image-gallery-2.3.0-SNAPSHOT-tests.jar
[INFO] [deploy:deploy {execution: default-deploy}]
[INFO] Retrieving previous build number from apache.snapshots.https
[WARNING] *** CHECKSUM FAILED - Checksum failed on download: local = 'aaa0268758e055d423403581fa2919d99fa8d280';
remote = '4b07682dadd4ee2098e8d2fc95c516ce4611e45b' - RETRYING
[WARNING] *** CHECKSUM FAILED - Checksum failed on download: local = 'aaa0268758e055d423403581fa2919d99fa8d280';
remote = '4b07682dadd4ee2098e8d2fc95c516ce4611e45b' - IGNORING
Uploading: https://repository.apache.org/content/repositories/snapshots/org/apache/openjpa/openjpa-examples/image-gallery/2.3.0-SNAPSHOT/image-gallery-2.3.0-20130720.065149-124.jar
7K uploaded  (image-gallery-2.3.0-20130720.065149-124.jar)
[INFO] Uploading project information for image-gallery 2.3.0-20130720.065149-124
[INFO] Retrieving previous metadata from apache.snapshots.https
[WARNING] *** CHECKSUM FAILED - Checksum failed on download: local = 'aaa0268758e055d423403581fa2919d99fa8d280';
remote = '4b07682dadd4ee2098e8d2fc95c516ce4611e45b' - RETRYING
[WARNING] *** CHECKSUM FAILED - Checksum failed on download: local = 'aaa0268758e055d423403581fa2919d99fa8d280';
remote = '4b07682dadd4ee2098e8d2fc95c516ce4611e45b' - IGNORING
[INFO] Uploading repository metadata for: 'snapshot org.apache.openjpa.openjpa-examples:image-gallery:2.3.0-SNAPSHOT'
[INFO] Retrieving previous metadata from apache.snapshots.https
[INFO] Uploading repository metadata for: 'artifact org.apache.openjpa.openjpa-examples:image-gallery'
[INFO] Retrieving previous build number from apache.snapshots.https
Uploading: https://repository.apache.org/content/repositories/snapshots/org/apache/openjpa/openjpa-examples/image-gallery/2.3.0-SNAPSHOT/image-gallery-2.3.0-20130720.065149-124-tests.jar
33K uploaded  (image-gallery-2.3.0-20130720.065149-124-tests.jar)
[JENKINS] Archiving <https://builds.apache.org/job/OpenJPA-trunk-deploy/ws/trunk/openjpa-examples/image-gallery/pom.xml>
to /home/hudson/hudson/jobs/OpenJPA-trunk-deploy/modules/org.apache.openjpa.openjpa-examples$image-gallery/builds/2013-07-20_06-50-57/archive/org.apache.openjpa.openjpa-examples/image-gallery/2.3.0-SNAPSHOT/image-gallery-2.3.0-SNAPSHOT.pom
[JENKINS] Archiving <https://builds.apache.org/job/OpenJPA-trunk-deploy/ws/trunk/openjpa-examples/image-gallery/target/image-gallery-2.3.0-SNAPSHOT.jar>
to /home/hudson/hudson/jobs/OpenJPA-trunk-deploy/modules/org.apache.openjpa.openjpa-examples$image-gallery/builds/2013-07-20_06-50-57/archive/org.apache.openjpa.openjpa-examples/image-gallery/2.3.0-20130720.065149-124/image-gallery-2.3.0-20130720.065149-124.jar
[JENKINS] Archiving <https://builds.apache.org/job/OpenJPA-trunk-deploy/ws/trunk/openjpa-examples/image-gallery/target/image-gallery-2.3.0-SNAPSHOT-tests.jar>
to /home/hudson/hudson/jobs/OpenJPA-trunk-deploy/modules/org.apache.openjpa.openjpa-examples$image-gallery/builds/2013-07-20_06-50-57/archive/org.apache.openjpa.openjpa-examples/image-gallery/2.3.0-20130720.065149-124/image-gallery-2.3.0-20130720.065149-124-tests.jar
[INFO] ------------------------------------------------------------------------
[INFO] Building OpenJPA Examples - OpenBooks
[INFO]    task-segment: [clean, deploy]
[INFO] ------------------------------------------------------------------------
[INFO] [clean:clean {execution: default-clean}]
[INFO] [buildnumber:create {execution: default}]
[INFO] [enforcer:enforce {execution: default}]
[INFO] [checkstyle:checkstyle {execution: default}]
[INFO] Starting audit...
<https://builds.apache.org/job/OpenJPA-trunk-deploy/ws/trunk/openjpa-examples/openbooks/src/main/java/jpa/tools/swing/PowerPointViewer.java>:225:
Line matches the illegal pattern 'System\.(out|err)\.print(ln)?\('.
<https://builds.apache.org/job/OpenJPA-trunk-deploy/ws/trunk/openjpa-examples/openbooks/src/main/java/jpa/tools/swing/SourceCodeViewer.java>:124:
Line matches the illegal pattern 'System\.(out|err)\.print(ln)?\('.
<https://builds.apache.org/job/OpenJPA-trunk-deploy/ws/trunk/openjpa-examples/openbooks/src/main/java/jpa/tools/swing/EntityDataModel.java>:204:
Line matches the illegal pattern 'System\.(out|err)\.print(ln)?\('.
<https://builds.apache.org/job/OpenJPA-trunk-deploy/ws/trunk/openjpa-examples/openbooks/src/main/java/jpa/tools/swing/EntityDataModel.java>:208:
Line matches the illegal pattern 'System\.(out|err)\.print(ln)?\('.
<https://builds.apache.org/job/OpenJPA-trunk-deploy/ws/trunk/openjpa-examples/openbooks/src/main/java/jpa/tools/swing/EntityDataModel.java>:214:
Line matches the illegal pattern 'System\.(out|err)\.print(ln)?\('.
<https://builds.apache.org/job/OpenJPA-trunk-deploy/ws/trunk/openjpa-examples/openbooks/src/main/java/jpa/tools/swing/Finder.java>:55:
Line matches the illegal pattern 'System\.(out|err)\.print(ln)?\('.
<https://builds.apache.org/job/OpenJPA-trunk-deploy/ws/trunk/openjpa-examples/openbooks/src/main/java/jpa/tools/swing/Finder.java>:59:
Line matches the illegal pattern 'System\.(out|err)\.print(ln)?\('.
<https://builds.apache.org/job/OpenJPA-trunk-deploy/ws/trunk/openjpa-examples/openbooks/src/main/java/jpa/tools/swing/Finder.java>:60:
Line matches the illegal pattern 'System\.(out|err)\.print(ln)?\('.
<https://builds.apache.org/job/OpenJPA-trunk-deploy/ws/trunk/openjpa-examples/openbooks/src/main/java/jpa/tools/swing/Finder.java>:61:
Line matches the illegal pattern 'System\.(out|err)\.print(ln)?\('.
<https://builds.apache.org/job/OpenJPA-trunk-deploy/ws/trunk/openjpa-examples/openbooks/src/main/java/jpa/tools/swing/Finder.java>:62:
Line matches the illegal pattern 'System\.(out|err)\.print(ln)?\('.
<https://builds.apache.org/job/OpenJPA-trunk-deploy/ws/trunk/openjpa-examples/openbooks/src/main/java/jpa/tools/swing/Finder.java>:63:
Line matches the illegal pattern 'System\.(out|err)\.print(ln)?\('.
<https://builds.apache.org/job/OpenJPA-trunk-deploy/ws/trunk/openjpa-examples/openbooks/src/main/java/jpa/tools/swing/Finder.java>:64:
Line matches the illegal pattern 'System\.(out|err)\.print(ln)?\('.
<https://builds.apache.org/job/OpenJPA-trunk-deploy/ws/trunk/openjpa-examples/openbooks/src/main/java/jpa/tools/swing/Finder.java>:65:
Line matches the illegal pattern 'System\.(out|err)\.print(ln)?\('.
<https://builds.apache.org/job/OpenJPA-trunk-deploy/ws/trunk/openjpa-examples/openbooks/src/main/java/jpa/tools/swing/Finder.java>:90:
Line matches the illegal pattern 'System\.(out|err)\.print(ln)?\('.
<https://builds.apache.org/job/OpenJPA-trunk-deploy/ws/trunk/openjpa-examples/openbooks/src/main/java/jpa/tools/swing/Finder.java>:123:
Line matches the illegal pattern 'System\.(out|err)\.print(ln)?\('.
<https://builds.apache.org/job/OpenJPA-trunk-deploy/ws/trunk/openjpa-examples/openbooks/src/main/java/jpa/tools/swing/Finder.java>:129:
Line matches the illegal pattern 'System\.(out|err)\.print(ln)?\('.
<https://builds.apache.org/job/OpenJPA-trunk-deploy/ws/trunk/openjpa-examples/openbooks/src/main/java/openbook/server/PersistenceService.java>:182:
Line matches the illegal pattern 'System\.(out|err)\.print(ln)?\('.
<https://builds.apache.org/job/OpenJPA-trunk-deploy/ws/trunk/openjpa-examples/openbooks/src/main/java/openbook/server/OpenBookServiceImpl.java>:115:
Line matches the illegal pattern 'System\.(out|err)\.print(ln)?\('.
<https://builds.apache.org/job/OpenJPA-trunk-deploy/ws/trunk/openjpa-examples/openbooks/src/main/java/openbook/server/OpenBookServiceImpl.java>:123:
Line matches the illegal pattern 'System\.(out|err)\.print(ln)?\('.
<https://builds.apache.org/job/OpenJPA-trunk-deploy/ws/trunk/openjpa-examples/openbooks/src/main/java/openbook/server/OpenBookServiceImpl.java>:130:
Line matches the illegal pattern 'System\.(out|err)\.print(ln)?\('.
<https://builds.apache.org/job/OpenJPA-trunk-deploy/ws/trunk/openjpa-examples/openbooks/src/main/java/openbook/server/OpenBookServiceImpl.java>:131:
Line matches the illegal pattern 'System\.(out|err)\.print(ln)?\('.
<https://builds.apache.org/job/OpenJPA-trunk-deploy/ws/trunk/openjpa-examples/openbooks/src/main/java/openbook/server/OpenBookServiceImpl.java>:427:
Line matches the illegal pattern 'System\.(out|err)\.print(ln)?\('.
<https://builds.apache.org/job/OpenJPA-trunk-deploy/ws/trunk/openjpa-examples/openbooks/src/main/java/openbook/util/PropertyHelper.java>:121:
Line matches the illegal pattern 'System\.(out|err)\.print(ln)?\('.
<https://builds.apache.org/job/OpenJPA-trunk-deploy/ws/trunk/openjpa-examples/openbooks/src/main/java/openbook/util/PropertyHelper.java>:241:
Line matches the illegal pattern 'System\.(out|err)\.print(ln)?\('.
<https://builds.apache.org/job/OpenJPA-trunk-deploy/ws/trunk/openjpa-examples/openbooks/src/main/java/openbook/tools/converter/SourceRenderer.java>:187:
Line matches the illegal pattern 'System\.(out|err)\.print(ln)?\('.
<https://builds.apache.org/job/OpenJPA-trunk-deploy/ws/trunk/openjpa-examples/openbooks/src/main/java/openbook/tools/converter/SourceRenderer.java>:191:
Line matches the illegal pattern 'System\.(out|err)\.print(ln)?\('.
<https://builds.apache.org/job/OpenJPA-trunk-deploy/ws/trunk/openjpa-examples/openbooks/src/main/java/openbook/client/Images.java>:99:
Line matches the illegal pattern 'System\.(out|err)\.print(ln)?\('.
<https://builds.apache.org/job/OpenJPA-trunk-deploy/ws/trunk/openjpa-examples/openbooks/src/main/java/openbook/client/SourceCodeBrowser.java>:91:
Line matches the illegal pattern 'System\.(out|err)\.print(ln)?\('.
<https://builds.apache.org/job/OpenJPA-trunk-deploy/ws/trunk/openjpa-examples/openbooks/src/main/java/openbook/client/BuyBookPage.java>:253:
Line matches the illegal pattern 'System\.(out|err)\.print(ln)?\('.
<https://builds.apache.org/job/OpenJPA-trunk-deploy/ws/trunk/openjpa-examples/openbooks/src/main/java/openbook/client/Demo.java>:489:
Line matches the illegal pattern 'System\.(out|err)\.print(ln)?\('.
Audit done.

[JENKINS] Archiving <https://builds.apache.org/job/OpenJPA-trunk-deploy/ws/trunk/openjpa-examples/openbooks/pom.xml>
to /home/hudson/hudson/jobs/OpenJPA-trunk-deploy/modules/org.apache.openjpa.openjpa-examples$openbooks/builds/2013-07-20_06-50-57/archive/org.apache.openjpa.openjpa-examples/openbooks/2.3.0-SNAPSHOT/openbooks-2.3.0-SNAPSHOT.pom
[INFO] ------------------------------------------------------------------------
[ERROR] BUILD ERROR
[INFO] ------------------------------------------------------------------------
[INFO] An error has occurred in Checkstyle report generation.

Embedded error: There are 30 checkstyle errors.
[INFO] ------------------------------------------------------------------------
[INFO] For more information, run Maven with the -e switch
[INFO] ------------------------------------------------------------------------
[INFO] Total time: 63 minutes 41 seconds
[INFO] Finished at: Sat Jul 20 07:55:06 UTC 2013
[INFO] Final Memory: 136M/559M
[INFO] ------------------------------------------------------------------------
Sending e-mails to: commits@openjpa.apache.org
Sending e-mails to: commits@openjpa.apache.org
channel stopped

Mime
View raw message