openjpa-commits mailing list archives

Site index · List index
Message view « Date » · « Thread »
Top « Date » · « Thread »
From Apache Jenkins Server <jenk...@builds.apache.org>
Subject Build failed in Jenkins: OpenJPA-21x #159
Date Fri, 04 Oct 2013 21:46:08 GMT
See <https://builds.apache.org/job/OpenJPA-21x/159/changes>

Changes:

[jgrassel] OPENJPA-2414: FinderCache does not consider active Fetch Groups/FetchPlan added
Fields

------------------------------------------
[...truncated 5476 lines...]
A         src/site/apt/index.apt
A         src/site/xdoc
A         scripts
A         scripts/domain-class.list
AU        scripts/test.bat
AU        scripts/mmg.bat
AU        scripts/docit.bat
AU        scripts/status.bat
AU        scripts/mmg.readme.txt
AU        scripts/branchdiff.bat
AU        scripts/rollback.bat
A         scripts/user.dict
 U        .
At revision 1529316
Parsing POMs
maven-agent.jar already up to date
classworlds.jar already up to date
maven-interceptor.jar already up to date
maven2.1-interceptor.jar already up to date
[2.1.x] $ /home/hudson/tools/java/latest1.6/bin/java -Xmx1024m -XX:MaxPermSize=512m -cp /home/jenkins/jenkins-slave/maven-agent.jar:/home/jenkins/jenkins-slave/classworlds.jar
hudson.maven.agent.Main /home/hudson/tools/maven/apache-maven-2.2.1 /home/jenkins/jenkins-slave/slave.jar
/home/jenkins/jenkins-slave/maven-interceptor.jar 46775 /home/jenkins/jenkins-slave/maven2.1-interceptor.jar
<===[JENKINS REMOTING CAPACITY]===>channel started
   log4j:WARN No appenders could be found for logger (org.apache.commons.beanutils.converters.BooleanConverter).
log4j:WARN Please initialize the log4j system properly.
[INFO] Scanning for projects...
Executing Maven:  -B -f <https://builds.apache.org/job/OpenJPA-21x/ws/2.1.x/pom.xml>
-Dmaven.repo.local=/home/jenkins/jenkins-slave/maven-repositories/1 clean install
[INFO] Reactor build order: 
[INFO]   OpenJPA Parent POM
[INFO]   OpenJPA Utilities Library
[INFO]   OpenJPA Kernel
[INFO]   OpenJPA JDBC
[INFO]   OpenJPA Persistence
[INFO]   OpenJPA Persistence JDBC
[INFO]   OpenJPA Persistence Locking Tests
[INFO]   OpenJPA XML Store
[INFO]   OpenJPA Slice
[INFO]   OpenJPA Aggregate Jar
[INFO]   OpenJPA Aggregate Jar with Dependencies
[INFO]   OpenJPA Project Docs and Assemblies
[INFO]   OpenJPA Examples
[INFO]   OpenJPA Examples - Simple
[INFO]   OpenJPA Examples - image-gallery
[INFO]   OpenJPA Examples - OpenBooks
[INFO]   OpenJPA Integration Tests
[INFO]   OpenJPA Integration Tests - Daytrader
[INFO]   OpenJPA Integration Tests - Examples
[INFO]   OpenJPA Integration Tests - SLF4JLogFactory
[INFO]   OpenJPA Integration Tests - JPA TCK
[INFO]   OpenJPA Integration Tests - Bean Validation
[INFO]   OpenJPA Integration Tests - JMX Platform MBeans
[INFO] ------------------------------------------------------------------------
[INFO] Building OpenJPA Parent POM
[INFO]    task-segment: [clean, install]
[INFO] ------------------------------------------------------------------------
[INFO] [clean:clean {execution: default-clean}]
[INFO] [buildnumber:create {execution: default}]
[INFO] Checking for local modifications: skipped.
[INFO] Updating project files from SCM: skipped.
[INFO] Executing: /bin/sh -c cd <https://builds.apache.org/job/OpenJPA-21x/ws/2.1.x>
&& svn --non-interactive info
[INFO] Working directory: <https://builds.apache.org/job/OpenJPA-21x/ws/2.1.x>
[INFO] Storing buildNumber: 1529292 at timestamp: October 4, 2013 at 9:45 PM
[INFO] Executing: /bin/sh -c cd <https://builds.apache.org/job/OpenJPA-21x/ws/2.1.x>
&& svn --non-interactive info
[INFO] Working directory: <https://builds.apache.org/job/OpenJPA-21x/ws/2.1.x>
[INFO] Storing buildScmBranch: branches/2.1.x
[INFO] [enforcer:enforce {execution: default}]
Setting property: classpath.resource.loader.class => 'org.codehaus.plexus.velocity.ContextClassLoaderResourceLoader'.
Setting property: site.resource.loader.class => 'org.codehaus.plexus.velocity.SiteResourceLoader'.
Setting property: velocimacro.messages.on => 'false'.
Setting property: resource.loader => 'classpath,site'.
Setting property: runtime.log.invalid.references => 'false'.
Setting property: resource.manager.logwhenfound => 'false'.
Setting property: velocimacro.permissions.allow.inline.to.replace.global => 'true'.
[INFO] [checkstyle:checkstyle {execution: default}]
[INFO] Source directory does not exist - skipping report.
[ERROR] VM #displayTree: error : too few arguments to macro. Wanted 2 got 0
[ERROR] VM #menuItem: error : too few arguments to macro. Wanted 1 got 0
[INFO] Setting property: classpath.resource.loader.class => 'org.codehaus.plexus.velocity.ContextClassLoaderResourceLoader'.
[INFO] Setting property: velocimacro.messages.on => 'false'.
[INFO] Setting property: resource.loader => 'classpath'.
[INFO] Setting property: resource.manager.logwhenfound => 'false'.
[INFO] [remote-resources:process {execution: default}]
[INFO] [site:attach-descriptor {execution: default-attach-descriptor}]
[INFO] Parent project loaded from repository.
[INFO] [ianal:verify-legal-files {execution: default}]
[INFO] [apache-rat:check {execution: default}]
[INFO] Exclude: **/.*/**
[INFO] Exclude: **/target/**/*
[INFO] [install:install {execution: default-install}]
[INFO] Installing <https://builds.apache.org/job/OpenJPA-21x/ws/2.1.x/pom.xml> to /home/jenkins/jenkins-slave/maven-repositories/1/org/apache/openjpa/openjpa-parent/2.1.2-SNAPSHOT/openjpa-parent-2.1.2-SNAPSHOT.pom
[JENKINS] Archiving <https://builds.apache.org/job/OpenJPA-21x/ws/2.1.x/pom.xml> to
/home/hudson/hudson/jobs/OpenJPA-21x/modules/org.apache.openjpa$openjpa-parent/builds/2013-10-04_21-44-25/archive/org.apache.openjpa/openjpa-parent/2.1.2-SNAPSHOT/openjpa-parent-2.1.2-SNAPSHOT.pom
[INFO] ------------------------------------------------------------------------
[INFO] Building OpenJPA Utilities Library
[INFO]    task-segment: [clean, install]
[INFO] ------------------------------------------------------------------------
[INFO] [clean:clean {execution: default-clean}]
[INFO] [buildnumber:create {execution: default}]
[INFO] [enforcer:enforce {execution: default}]
[INFO] [checkstyle:checkstyle {execution: default}]
[INFO] Starting audit...
Audit done.

[WARNING] Unable to locate Source XRef to link to - DISABLED
Setting property: classpath.resource.loader.class => 'org.codehaus.plexus.velocity.ContextClassLoaderResourceLoader'.
Setting property: site.resource.loader.class => 'org.codehaus.plexus.velocity.SiteResourceLoader'.
Setting property: velocimacro.messages.on => 'false'.
Setting property: resource.loader => 'classpath,site'.
Setting property: runtime.log.invalid.references => 'false'.
Setting property: resource.manager.logwhenfound => 'false'.
[INFO] [remote-resources:process {execution: default}]
[INFO] [resources:resources {execution: default-resources}]
[INFO] Using 'UTF-8' encoding to copy filtered resources.
[INFO] Copying 9 resources
[INFO] Copying 3 resources
[INFO] [compiler:compile {execution: default-compile}]
[INFO] Compiling 160 source files to <https://builds.apache.org/job/OpenJPA-21x/ws/2.1.x/openjpa-lib/target/classes>
[INFO] [antrun:run {execution: set subversion revision}]
[INFO] Executing tasks
   [delete] Deleting: <https://builds.apache.org/job/OpenJPA-21x/ws/2.1.x/openjpa-lib/pcenhancer.revision.file>
     [echo] Revision: 422266:1529292
     [echo] OpenJPA version: 2.1.2-SNAPSHOT
[INFO] Executed tasks
[INFO] [resources:testResources {execution: default-testResources}]
[INFO] Using 'UTF-8' encoding to copy filtered resources.
[INFO] Copying 8 resources
[INFO] Copying 3 resources
[INFO] [compiler:testCompile {execution: default-testCompile}]
[INFO] Compiling 42 source files to <https://builds.apache.org/job/OpenJPA-21x/ws/2.1.x/openjpa-lib/target/test-classes>
[WARNING] DEPRECATED [systemProperties]: Use systemPropertyVariables instead.
[INFO] [surefire:test {execution: default-test}]
[INFO] Surefire report directory: <https://builds.apache.org/job/OpenJPA-21x/ws/2.1.x/openjpa-lib/target/surefire-reports>

-------------------------------------------------------
 T E S T S
-------------------------------------------------------
Running org.apache.openjpa.lib.conf.TestValue
Tests run: 3, Failures: 0, Errors: 0, Skipped: 0, Time elapsed: 0.032 sec
Running org.apache.openjpa.lib.graph.TestGraph
Tests run: 3, Failures: 0, Errors: 0, Skipped: 0, Time elapsed: 0.015 sec
Running org.apache.openjpa.lib.util.TestLocalizer
Tests run: 7, Failures: 0, Errors: 0, Skipped: 0, Time elapsed: 0.016 sec
Running org.apache.openjpa.lib.util.concurrent.TestConcurrentMap
Tests run: 4, Failures: 0, Errors: 0, Skipped: 0, Time elapsed: 2.265 sec
Running org.apache.openjpa.lib.conf.TestConfigurationProviderPrefixes
Tests run: 7, Failures: 0, Errors: 0, Skipped: 0, Time elapsed: 0.014 sec
Running org.apache.openjpa.lib.conf.TestConfigurations
Tests run: 3, Failures: 0, Errors: 0, Skipped: 0, Time elapsed: 0.016 sec
Running org.apache.openjpa.lib.rop.TestRandomAccessResultList
Tests run: 17, Failures: 0, Errors: 0, Skipped: 0, Time elapsed: 0.021 sec
Running org.apache.openjpa.lib.rop.TestLazyForwardResultList
Tests run: 17, Failures: 0, Errors: 0, Skipped: 0, Time elapsed: 0.012 sec
Running org.apache.openjpa.lib.rop.TestEagerResultList
Tests run: 17, Failures: 0, Errors: 0, Skipped: 0, Time elapsed: 0.011 sec
Running org.apache.openjpa.lib.conf.TestXMLCaseConversions
Tests run: 1, Failures: 0, Errors: 0, Skipped: 0, Time elapsed: 0.008 sec
Running org.apache.openjpa.lib.util.TestTypedProperties
Tests run: 4, Failures: 0, Errors: 0, Skipped: 0, Time elapsed: 0.004 sec
Running org.apache.openjpa.lib.conf.test.TestPluginValue
Tests run: 3, Failures: 0, Errors: 0, Skipped: 0, Time elapsed: 0.004 sec
Running org.apache.openjpa.lib.graph.TestDepthFirstAnalysis
Tests run: 4, Failures: 0, Errors: 0, Skipped: 0, Time elapsed: 0.006 sec
Running org.apache.openjpa.lib.xml.TestDocTypeReader
Tests run: 3, Failures: 0, Errors: 0, Skipped: 0, Time elapsed: 0.057 sec
Running org.apache.openjpa.lib.rop.TestListResultList
Tests run: 17, Failures: 0, Errors: 0, Skipped: 0, Time elapsed: 0.008 sec
Running org.apache.openjpa.lib.rop.TestMergedResultObjectProvider
Tests run: 17, Failures: 0, Errors: 0, Skipped: 0, Time elapsed: 0.039 sec
Running org.apache.openjpa.lib.conf.test.TestConfigurationImpl
1  WARN   [main] openjpa.Runtime - The configuration property named "openjpa.ConnectionProperties"
was not recognized and will be ignored, although the name closely matches a valid property
called "openjpa.objectKey".
1  WARN   [main] openjpa.Runtime - The configuration property named "openjpa.ConnectionURL"
was not recognized and will be ignored, although the name closely matches a valid property
called "openjpa.objectKey".
2  WARN   [main] openjpa.Runtime - The configuration property named "openjpa.ConnectionUserName"
was not recognized and will be ignored, although the name closely matches a valid property
called "openjpa.objectKey".
2  WARN   [main] openjpa.Runtime - The configuration property named "openjpa.ConnectionDriverName"
was not recognized and will be ignored, although the name closely matches a valid property
called "openjpa.objectKey".
3  WARN   [main] openjpa.Runtime - The configuration property named "openjpa.ConnectionPassword"
was not recognized and will be ignored, although the name closely matches a valid property
called "openjpa.objectKey".
4  WARN   [main] openjpa.Runtime - The configuration property named "openjpa.DynamicEnhancementAgent"
was not recognized and will be ignored.
0  WARN   [main] openjpa.Runtime - The configuration property named "openjpa.ConnectionProperties"
was not recognized and will be ignored, although the name closely matches a valid property
called "openjpa.objectKey".
1  WARN   [main] openjpa.Runtime - The configuration property named "openjpa.ConnectionURL"
was not recognized and will be ignored, although the name closely matches a valid property
called "openjpa.objectKey".
1  WARN   [main] openjpa.Runtime - The configuration property named "openjpa.ConnectionUserName"
was not recognized and will be ignored, although the name closely matches a valid property
called "openjpa.objectKey".
2  WARN   [main] openjpa.Runtime - The configuration property named "openjpa.ConnectionDriverName"
was not recognized and will be ignored, although the name closely matches a valid property
called "openjpa.objectKey".
2  WARN   [main] openjpa.Runtime - The configuration property named "openjpa.ConnectionPassword"
was not recognized and will be ignored, although the name closely matches a valid property
called "openjpa.objectKey".
3  WARN   [main] openjpa.Runtime - The configuration property named "openjpa.DynamicEnhancementAgent"
was not recognized and will be ignored.
1  WARN   [main] openjpa.Runtime - The configuration property named "openjpa.ConnectionProperties"
was not recognized and will be ignored, although the name closely matches a valid property
called "openjpa.objectKey".
1  WARN   [main] openjpa.Runtime - The configuration property named "openjpa.ConnectionURL"
was not recognized and will be ignored, although the name closely matches a valid property
called "openjpa.objectKey".
2  WARN   [main] openjpa.Runtime - The configuration property named "openjpa.ConnectionUserName"
was not recognized and will be ignored, although the name closely matches a valid property
called "openjpa.objectKey".
2  WARN   [main] openjpa.Runtime - The configuration property named "openjpa.ConnectionDriverName"
was not recognized and will be ignored, although the name closely matches a valid property
called "openjpa.objectKey".
3  WARN   [main] openjpa.Runtime - The configuration property named "openjpa.ConnectionPassword"
was not recognized and will be ignored, although the name closely matches a valid property
called "openjpa.objectKey".
3  WARN   [main] openjpa.Runtime - The configuration property named "openjpa.DynamicEnhancementAgent"
was not recognized and will be ignored.
1  WARN   [main] openjpa.Runtime - The configuration property named "openjpa.ConnectionProperties"
was not recognized and will be ignored, although the name closely matches a valid property
called "openjpa.objectKey".
1  WARN   [main] openjpa.Runtime - The configuration property named "openjpa.ConnectionURL"
was not recognized and will be ignored, although the name closely matches a valid property
called "openjpa.objectKey".
2  WARN   [main] openjpa.Runtime - The configuration property named "openjpa.ConnectionUserName"
was not recognized and will be ignored, although the name closely matches a valid property
called "openjpa.objectKey".
2  WARN   [main] openjpa.Runtime - The configuration property named "openjpa.ConnectionDriverName"
was not recognized and will be ignored, although the name closely matches a valid property
called "openjpa.objectKey".
3  WARN   [main] openjpa.Runtime - The configuration property named "openjpa.ConnectionPassword"
was not recognized and will be ignored, although the name closely matches a valid property
called "openjpa.objectKey".
3  WARN   [main] openjpa.Runtime - The configuration property named "openjpa.DynamicEnhancementAgent"
was not recognized and will be ignored.
Tests run: 8, Failures: 0, Errors: 0, Skipped: 0, Time elapsed: 0.055 sec
Running org.apache.openjpa.lib.rop.TestOrderedMergedResultObjectProvider
Tests run: 17, Failures: 0, Errors: 0, Skipped: 0, Time elapsed: 0.086 sec
Running org.apache.openjpa.lib.identifier.TestIdentifiers
Tests run: 1, Failures: 0, Errors: 0, Skipped: 0, Time elapsed: 0.007 sec
Running org.apache.openjpa.lib.util.TestPropertiesParser
Tests run: 13, Failures: 0, Errors: 0, Skipped: 0, Time elapsed: 0.063 sec
Running org.apache.openjpa.lib.util.TestMultiClassLoader
Tests run: 2, Failures: 0, Errors: 0, Skipped: 0, Time elapsed: 0.003 sec
Running org.apache.openjpa.lib.util.TestTemporaryClassLoader
Tests run: 1, Failures: 0, Errors: 0, Skipped: 0, Time elapsed: 0.004 sec
Running org.apache.openjpa.lib.util.TestReferenceSet
Tests run: 4, Failures: 0, Errors: 0, Skipped: 0, Time elapsed: 0.013 sec
Running org.apache.openjpa.lib.rop.TestSimpleResultList
Tests run: 17, Failures: 0, Errors: 0, Skipped: 0, Time elapsed: 0.007 sec
Running org.apache.openjpa.lib.rop.TestSoftRandomAccessResultList
Tests run: 17, Failures: 0, Errors: 0, Skipped: 0, Time elapsed: 0.016 sec
Running org.apache.openjpa.lib.util.TestSimpleRegex
Tests run: 1, Failures: 0, Errors: 0, Skipped: 0, Time elapsed: 0.003 sec
Running org.apache.openjpa.lib.util.TestAbstractEventManager
Tests run: 2, Failures: 0, Errors: 0, Skipped: 0, Time elapsed: 0.004 sec
Running org.apache.openjpa.lib.util.TestOptions
Tests run: 2, Failures: 0, Errors: 0, Skipped: 0, Time elapsed: 0.004 sec
Running org.apache.openjpa.lib.util.TestUUIDGenerator
Tests run: 7, Failures: 0, Errors: 0, Skipped: 0, Time elapsed: 0.372 sec
Running org.apache.openjpa.lib.util.TestParameterTemplate
Tests run: 1, Failures: 0, Errors: 0, Skipped: 0, Time elapsed: 0.003 sec
Running org.apache.openjpa.lib.xml.TestXMLWriter
Tests run: 1, Failures: 0, Errors: 0, Skipped: 0, Time elapsed: 0.018 sec
Running org.apache.openjpa.lib.util.svn.TestSVNUtils
Tests run: 6, Failures: 0, Errors: 0, Skipped: 0, Time elapsed: 0.005 sec
Running org.apache.openjpa.lib.rop.TestWindowResultList
Tests run: 17, Failures: 0, Errors: 0, Skipped: 0, Time elapsed: 0.01 sec
Running org.apache.openjpa.lib.util.concurrent.TestNullSafeConcurrentHashMap
Tests run: 5, Failures: 0, Errors: 0, Skipped: 0, Time elapsed: 0.235 sec
Running org.apache.openjpa.lib.rop.TestRangeResultObjectProvider
Tests run: 17, Failures: 0, Errors: 0, Skipped: 0, Time elapsed: 0.023 sec

Results :

Tests run: 266, Failures: 0, Errors: 0, Skipped: 0

[JENKINS] Recording test results
[INFO] [jar:jar {execution: default-jar}]
[INFO] Building jar: <https://builds.apache.org/job/OpenJPA-21x/ws/2.1.x/openjpa-lib/target/openjpa-lib-2.1.2-SNAPSHOT.jar>
[INFO] [jar:jar {execution: default-jar}]
[INFO] [jar:test-jar {execution: attach-tests}]
[INFO] Building jar: <https://builds.apache.org/job/OpenJPA-21x/ws/2.1.x/openjpa-lib/target/openjpa-lib-2.1.2-SNAPSHOT-tests.jar>
[INFO] [ianal:verify-legal-files {execution: default}]
[INFO] Checking legal files in: openjpa-lib-2.1.2-SNAPSHOT.jar
[INFO] Checking legal files in: openjpa-lib-2.1.2-SNAPSHOT-tests.jar
[INFO] [apache-rat:check {execution: default}]
[INFO] Exclude: **/.*/**
[INFO] Exclude: **/target/**/*
[INFO] [install:install {execution: default-install}]
[INFO] Installing <https://builds.apache.org/job/OpenJPA-21x/ws/2.1.x/openjpa-lib/target/openjpa-lib-2.1.2-SNAPSHOT.jar>
to /home/jenkins/jenkins-slave/maven-repositories/1/org/apache/openjpa/openjpa-lib/2.1.2-SNAPSHOT/openjpa-lib-2.1.2-SNAPSHOT.jar
[INFO] Installing <https://builds.apache.org/job/OpenJPA-21x/ws/2.1.x/openjpa-lib/target/openjpa-lib-2.1.2-SNAPSHOT-tests.jar>
to /home/jenkins/jenkins-slave/maven-repositories/1/org/apache/openjpa/openjpa-lib/2.1.2-SNAPSHOT/openjpa-lib-2.1.2-SNAPSHOT-tests.jar
ERROR: Maven JVM terminated unexpectedly with exit code 143


Mime
View raw message