openjpa-commits mailing list archives

Site index · List index
Message view « Date » · « Thread »
Top « Date » · « Thread »
From Apache Jenkins Server <jenk...@builds.apache.org>
Subject Build failed in Jenkins: OpenJPA-trunk-deploy #429
Date Wed, 30 Oct 2013 06:52:35 GMT
See <https://builds.apache.org/job/OpenJPA-trunk-deploy/429/changes>

Changes:

[struberg] OPENJPA-2200 remove unused imports

------------------------------------------
[...truncated 567 lines...]
org.apache.openjpa.util.java$util$LinkedHashSet$proxy
org.apache.openjpa.util.java$util$PriorityQueue$proxy
[INFO] Executed tasks
[INFO] [compiler:testCompile {execution: test-source-compile}]
[INFO] Compiling 12 source files to <https://builds.apache.org/job/OpenJPA-trunk-deploy/ws/trunk/openjpa-kernel/target/test-classes>
[INFO] [resources:testResources {execution: default-testResources}]
[INFO] Using 'UTF-8' encoding to copy filtered resources.
[INFO] skip non existing resourceDirectory <https://builds.apache.org/job/OpenJPA-trunk-deploy/ws/trunk/openjpa-kernel/src/test/resources>
[INFO] Copying 3 resources
[INFO] [compiler:testCompile {execution: default-testCompile}]
[INFO] Nothing to compile - all classes are up to date
[WARNING] DEPRECATED [systemProperties]: Use systemPropertyVariables instead.
[INFO] [surefire:test {execution: default-test}]
[INFO] Surefire report directory: <https://builds.apache.org/job/OpenJPA-trunk-deploy/ws/trunk/openjpa-kernel/target/surefire-reports>

-------------------------------------------------------
 T E S T S
-------------------------------------------------------
Running org.apache.openjpa.meta.TestMemberProvider
Tests run: 2, Failures: 0, Errors: 0, Skipped: 0, Time elapsed: 0.056 sec
Running org.apache.openjpa.conf.TestSpecification
Tests run: 3, Failures: 0, Errors: 0, Skipped: 0, Time elapsed: 0.012 sec
Running org.apache.openjpa.meta.TestJavaTypes
Tests run: 1, Failures: 0, Errors: 0, Skipped: 0, Time elapsed: 0.012 sec
Running org.apache.openjpa.enhance.TestPCSubclassNameConversion
Tests run: 1, Failures: 0, Errors: 0, Skipped: 0, Time elapsed: 0.034 sec
Running org.apache.openjpa.meta.TestAccessCode
Tests run: 8, Failures: 0, Errors: 0, Skipped: 0, Time elapsed: 0.015 sec
Running org.apache.openjpa.enhance.TestGetDeclaredMethod
Tests run: 3, Failures: 0, Errors: 0, Skipped: 0, Time elapsed: 0.017 sec
Running org.apache.openjpa.util.TestProxyManager
Tests run: 43, Failures: 0, Errors: 0, Skipped: 0, Time elapsed: 0.306 sec
Running org.apache.openjpa.ee.TestOSGiManagedRuntime
Tests run: 4, Failures: 0, Errors: 0, Skipped: 0, Time elapsed: 0.01 sec
Running org.apache.openjpa.util.TestResultShape
Tests run: 8, Failures: 0, Errors: 0, Skipped: 0, Time elapsed: 0.011 sec
Running org.apache.openjpa.ee.TestWASManagedRuntime
Tests run: 1, Failures: 0, Errors: 0, Skipped: 0, Time elapsed: 0.002 sec

Results :

Tests run: 74, Failures: 0, Errors: 0, Skipped: 0

[JENKINS] Recording test results
[INFO] [jar:jar {execution: default-jar}]
[INFO] Building jar: <https://builds.apache.org/job/OpenJPA-trunk-deploy/ws/trunk/openjpa-kernel/target/openjpa-kernel-2.4.0-SNAPSHOT.jar>
[INFO] [jar:jar {execution: default-jar}]
[INFO] [jar:test-jar {execution: attach-tests}]
[INFO] Building jar: <https://builds.apache.org/job/OpenJPA-trunk-deploy/ws/trunk/openjpa-kernel/target/openjpa-kernel-2.4.0-SNAPSHOT-tests.jar>
[INFO] [ianal:verify-legal-files {execution: default}]
[INFO] Checking legal files in: openjpa-kernel-2.4.0-SNAPSHOT.jar
[INFO] Checking legal files in: openjpa-kernel-2.4.0-SNAPSHOT-tests.jar
[INFO] [apache-rat:check {execution: default}]
[INFO] Exclude: **/.*/**
[INFO] Exclude: **/target/**/*
[INFO] [install:install {execution: default-install}]
[INFO] Installing <https://builds.apache.org/job/OpenJPA-trunk-deploy/ws/trunk/openjpa-kernel/target/openjpa-kernel-2.4.0-SNAPSHOT.jar>
to /home/jenkins/jenkins-slave/maven-repositories/1/org/apache/openjpa/openjpa-kernel/2.4.0-SNAPSHOT/openjpa-kernel-2.4.0-SNAPSHOT.jar
[INFO] Installing <https://builds.apache.org/job/OpenJPA-trunk-deploy/ws/trunk/openjpa-kernel/target/openjpa-kernel-2.4.0-SNAPSHOT-tests.jar>
to /home/jenkins/jenkins-slave/maven-repositories/1/org/apache/openjpa/openjpa-kernel/2.4.0-SNAPSHOT/openjpa-kernel-2.4.0-SNAPSHOT-tests.jar
[INFO] [deploy:deploy {execution: default-deploy}]
[INFO] Retrieving previous build number from apache.snapshots.https
[WARNING] *** CHECKSUM FAILED - Checksum failed on download: local = '29955113c262b75d264e2c5a95b844e30b915169';
remote = 'a10d28a75300056439ebb094230d846fbb88b519' - RETRYING
[WARNING] *** CHECKSUM FAILED - Checksum failed on download: local = '29955113c262b75d264e2c5a95b844e30b915169';
remote = 'a10d28a75300056439ebb094230d846fbb88b519' - IGNORING
Uploading: https://repository.apache.org/content/repositories/snapshots/org/apache/openjpa/openjpa-kernel/2.4.0-SNAPSHOT/openjpa-kernel-2.4.0-20131030.064947-5.jar
1424K uploaded  (openjpa-kernel-2.4.0-20131030.064947-5.jar)
[INFO] Retrieving previous metadata from apache.snapshots.https
[WARNING] *** CHECKSUM FAILED - Checksum failed on download: local = '29955113c262b75d264e2c5a95b844e30b915169';
remote = 'a10d28a75300056439ebb094230d846fbb88b519' - RETRYING
[WARNING] *** CHECKSUM FAILED - Checksum failed on download: local = '29955113c262b75d264e2c5a95b844e30b915169';
remote = 'a10d28a75300056439ebb094230d846fbb88b519' - IGNORING
[INFO] Uploading repository metadata for: 'snapshot org.apache.openjpa:openjpa-kernel:2.4.0-SNAPSHOT'
[INFO] Retrieving previous metadata from apache.snapshots.https
[INFO] Uploading repository metadata for: 'artifact org.apache.openjpa:openjpa-kernel'
[INFO] Uploading project information for openjpa-kernel 2.4.0-20131030.064947-5
[INFO] Retrieving previous build number from apache.snapshots.https
Uploading: https://repository.apache.org/content/repositories/snapshots/org/apache/openjpa/openjpa-kernel/2.4.0-SNAPSHOT/openjpa-kernel-2.4.0-20131030.064947-5-tests.jar
50K uploaded  (openjpa-kernel-2.4.0-20131030.064947-5-tests.jar)
[JENKINS] Archiving <https://builds.apache.org/job/OpenJPA-trunk-deploy/ws/trunk/openjpa-kernel/pom.xml>
to /home/hudson/hudson/jobs/OpenJPA-trunk-deploy/modules/org.apache.openjpa$openjpa-kernel/builds/2013-10-30_06-47-43/archive/org.apache.openjpa/openjpa-kernel/2.4.0-SNAPSHOT/openjpa-kernel-2.4.0-SNAPSHOT.pom
[JENKINS] Archiving <https://builds.apache.org/job/OpenJPA-trunk-deploy/ws/trunk/openjpa-kernel/target/openjpa-kernel-2.4.0-SNAPSHOT.jar>
to /home/hudson/hudson/jobs/OpenJPA-trunk-deploy/modules/org.apache.openjpa$openjpa-kernel/builds/2013-10-30_06-47-43/archive/org.apache.openjpa/openjpa-kernel/2.4.0-20131030.064947-5/openjpa-kernel-2.4.0-20131030.064947-5.jar
[JENKINS] Archiving <https://builds.apache.org/job/OpenJPA-trunk-deploy/ws/trunk/openjpa-kernel/target/openjpa-kernel-2.4.0-SNAPSHOT-tests.jar>
to /home/hudson/hudson/jobs/OpenJPA-trunk-deploy/modules/org.apache.openjpa$openjpa-kernel/builds/2013-10-30_06-47-43/archive/org.apache.openjpa/openjpa-kernel/2.4.0-20131030.064947-5/openjpa-kernel-2.4.0-20131030.064947-5-tests.jar
[INFO] ------------------------------------------------------------------------
[INFO] Building OpenJPA JDBC
[INFO]    task-segment: [clean, deploy]
[INFO] ------------------------------------------------------------------------
[INFO] [clean:clean {execution: default-clean}]
[INFO] Deleting file set: <https://builds.apache.org/job/OpenJPA-trunk-deploy/ws/trunk/openjpa-jdbc/target>
(included: [**], excluded: [])
[INFO] [buildnumber:create {execution: default}]
[INFO] [enforcer:enforce {execution: default}]
[INFO] [checkstyle:checkstyle {execution: default}]
[INFO] Starting audit...
Audit done.

[WARNING] Unable to locate Source XRef to link to - DISABLED
[INFO] [remote-resources:process {execution: default}]
[WARNING] org.apache.velocity.runtime.exception.ReferenceException: reference : template =
META-INF/DEPENDENCIES.vm [line 40,column 14] : $license.name is not a valid reference.
[WARNING] org.apache.velocity.runtime.exception.ReferenceException: reference : template =
META-INF/DEPENDENCIES.vm [line 40,column 14] : $license.name is not a valid reference.
[INFO] [resources:resources {execution: default-resources}]
[INFO] Using 'UTF-8' encoding to copy filtered resources.
[INFO] Copying 14 resources
[INFO] Copying 3 resources
[INFO] [compiler:compile {execution: default-compile}]
[INFO] Compiling 359 source files to <https://builds.apache.org/job/OpenJPA-trunk-deploy/ws/trunk/openjpa-jdbc/target/classes>
[INFO] [compiler:testCompile {execution: test-source-compile}]
[INFO] Compiling 8 source files to <https://builds.apache.org/job/OpenJPA-trunk-deploy/ws/trunk/openjpa-jdbc/target/test-classes>
[INFO] [resources:testResources {execution: default-testResources}]
[INFO] Using 'UTF-8' encoding to copy filtered resources.
[INFO] skip non existing resourceDirectory <https://builds.apache.org/job/OpenJPA-trunk-deploy/ws/trunk/openjpa-jdbc/src/test/resources>
[INFO] Copying 3 resources
[INFO] [compiler:testCompile {execution: default-testCompile}]
[INFO] Nothing to compile - all classes are up to date
[WARNING] DEPRECATED [systemProperties]: Use systemPropertyVariables instead.
[INFO] [surefire:test {execution: default-test}]
[INFO] Surefire report directory: <https://builds.apache.org/job/OpenJPA-trunk-deploy/ws/trunk/openjpa-jdbc/target/surefire-reports>

-------------------------------------------------------
 T E S T S
-------------------------------------------------------
Running org.apache.openjpa.jdbc.sql.identifier.TestDBIdentifiers
Tests run: 5, Failures: 0, Errors: 0, Skipped: 0, Time elapsed: 0.052 sec
Running org.apache.openjpa.jdbc.meta.TestMappingDefaultsImpl
11  INFO   [main] openjpa.jdbc.JDBC - Using dictionary class "org.apache.openjpa.jdbc.sql.OracleDictionary".
Tests run: 1, Failures: 0, Errors: 0, Skipped: 0, Time elapsed: 0.215 sec
Running org.apache.openjpa.jdbc.sql.TestDBDictionaryGeneratedSQL
Tests run: 5, Failures: 0, Errors: 0, Skipped: 0, Time elapsed: 0.195 sec
Running org.apache.openjpa.jdbc.sql.TestDB2Dictionary
Tests run: 5, Failures: 0, Errors: 0, Skipped: 0, Time elapsed: 0.145 sec
Running org.apache.openjpa.jdbc.sql.TestMySQLDictionary
Tests run: 3, Failures: 0, Errors: 0, Skipped: 0, Time elapsed: 0.099 sec
Running org.apache.openjpa.jdbc.kernel.TestSQLStoreParamsSubstitution
Tests run: 1, Failures: 0, Errors: 0, Skipped: 0, Time elapsed: 0.007 sec
Running org.apache.openjpa.jdbc.kernel.TestUpdateManagerFlushException
Tests run: 1, Failures: 0, Errors: 0, Skipped: 0, Time elapsed: 0.006 sec
Running org.apache.openjpa.jdbc.sql.TestDictionaryFactory
Tests run: 1, Failures: 0, Errors: 0, Skipped: 0, Time elapsed: 0.005 sec

Results :

Tests run: 22, Failures: 0, Errors: 0, Skipped: 0

[JENKINS] Recording test results
[INFO] [jar:jar {execution: default-jar}]
[INFO] Building jar: <https://builds.apache.org/job/OpenJPA-trunk-deploy/ws/trunk/openjpa-jdbc/target/openjpa-jdbc-2.4.0-SNAPSHOT.jar>
[INFO] [jar:jar {execution: default-jar}]
[INFO] [jar:test-jar {execution: attach-tests}]
[INFO] Building jar: <https://builds.apache.org/job/OpenJPA-trunk-deploy/ws/trunk/openjpa-jdbc/target/openjpa-jdbc-2.4.0-SNAPSHOT-tests.jar>
[INFO] [ianal:verify-legal-files {execution: default}]
[INFO] Checking legal files in: openjpa-jdbc-2.4.0-SNAPSHOT.jar
[INFO] Checking legal files in: openjpa-jdbc-2.4.0-SNAPSHOT-tests.jar
[INFO] [apache-rat:check {execution: default}]
[INFO] Exclude: **/.*/**
[INFO] Exclude: **/target/**/*
[INFO] [install:install {execution: default-install}]
[INFO] Installing <https://builds.apache.org/job/OpenJPA-trunk-deploy/ws/trunk/openjpa-jdbc/target/openjpa-jdbc-2.4.0-SNAPSHOT.jar>
to /home/jenkins/jenkins-slave/maven-repositories/1/org/apache/openjpa/openjpa-jdbc/2.4.0-SNAPSHOT/openjpa-jdbc-2.4.0-SNAPSHOT.jar
[INFO] Installing <https://builds.apache.org/job/OpenJPA-trunk-deploy/ws/trunk/openjpa-jdbc/target/openjpa-jdbc-2.4.0-SNAPSHOT-tests.jar>
to /home/jenkins/jenkins-slave/maven-repositories/1/org/apache/openjpa/openjpa-jdbc/2.4.0-SNAPSHOT/openjpa-jdbc-2.4.0-SNAPSHOT-tests.jar
[INFO] [deploy:deploy {execution: default-deploy}]
[INFO] Retrieving previous build number from apache.snapshots.https
[WARNING] *** CHECKSUM FAILED - Checksum failed on download: local = '1f84df08489df160b236ea398ce3051368333099';
remote = 'a1ec59c6a5245ff96a2ed27f4b889e6b3eea3cad' - RETRYING
[WARNING] *** CHECKSUM FAILED - Checksum failed on download: local = '1f84df08489df160b236ea398ce3051368333099';
remote = 'a1ec59c6a5245ff96a2ed27f4b889e6b3eea3cad' - IGNORING
Uploading: https://repository.apache.org/content/repositories/snapshots/org/apache/openjpa/openjpa-jdbc/2.4.0-SNAPSHOT/openjpa-jdbc-2.4.0-20131030.064947-5.jar
1404K uploaded  (openjpa-jdbc-2.4.0-20131030.064947-5.jar)
[INFO] Retrieving previous metadata from apache.snapshots.https
[WARNING] *** CHECKSUM FAILED - Checksum failed on download: local = '1f84df08489df160b236ea398ce3051368333099';
remote = 'a1ec59c6a5245ff96a2ed27f4b889e6b3eea3cad' - RETRYING
[WARNING] *** CHECKSUM FAILED - Checksum failed on download: local = '1f84df08489df160b236ea398ce3051368333099';
remote = 'a1ec59c6a5245ff96a2ed27f4b889e6b3eea3cad' - IGNORING
[INFO] Uploading repository metadata for: 'snapshot org.apache.openjpa:openjpa-jdbc:2.4.0-SNAPSHOT'
[INFO] Uploading project information for openjpa-jdbc 2.4.0-20131030.064947-5
[INFO] Retrieving previous metadata from apache.snapshots.https
[INFO] Uploading repository metadata for: 'artifact org.apache.openjpa:openjpa-jdbc'
[INFO] Retrieving previous build number from apache.snapshots.https
Uploading: https://repository.apache.org/content/repositories/snapshots/org/apache/openjpa/openjpa-jdbc/2.4.0-SNAPSHOT/openjpa-jdbc-2.4.0-20131030.064947-5-tests.jar
42K uploaded  (openjpa-jdbc-2.4.0-20131030.064947-5-tests.jar)
[JENKINS] Archiving <https://builds.apache.org/job/OpenJPA-trunk-deploy/ws/trunk/openjpa-jdbc/pom.xml>
to /home/hudson/hudson/jobs/OpenJPA-trunk-deploy/modules/org.apache.openjpa$openjpa-jdbc/builds/2013-10-30_06-47-43/archive/org.apache.openjpa/openjpa-jdbc/2.4.0-SNAPSHOT/openjpa-jdbc-2.4.0-SNAPSHOT.pom
[JENKINS] Archiving <https://builds.apache.org/job/OpenJPA-trunk-deploy/ws/trunk/openjpa-jdbc/target/openjpa-jdbc-2.4.0-SNAPSHOT.jar>
to /home/hudson/hudson/jobs/OpenJPA-trunk-deploy/modules/org.apache.openjpa$openjpa-jdbc/builds/2013-10-30_06-47-43/archive/org.apache.openjpa/openjpa-jdbc/2.4.0-20131030.064947-5/openjpa-jdbc-2.4.0-20131030.064947-5.jar
[JENKINS] Archiving <https://builds.apache.org/job/OpenJPA-trunk-deploy/ws/trunk/openjpa-jdbc/target/openjpa-jdbc-2.4.0-SNAPSHOT-tests.jar>
to /home/hudson/hudson/jobs/OpenJPA-trunk-deploy/modules/org.apache.openjpa$openjpa-jdbc/builds/2013-10-30_06-47-43/archive/org.apache.openjpa/openjpa-jdbc/2.4.0-20131030.064947-5/openjpa-jdbc-2.4.0-20131030.064947-5-tests.jar
[INFO] ------------------------------------------------------------------------
[INFO] Building OpenJPA Persistence
[INFO]    task-segment: [clean, deploy]
[INFO] ------------------------------------------------------------------------
[INFO] [clean:clean {execution: default-clean}]
[INFO] Deleting file set: <https://builds.apache.org/job/OpenJPA-trunk-deploy/ws/trunk/openjpa-persistence/target>
(included: [**], excluded: [])
[INFO] [buildnumber:create {execution: default}]
[INFO] [enforcer:enforce {execution: default}]
[INFO] [checkstyle:checkstyle {execution: default}]
[INFO] Starting audit...
Audit done.

[WARNING] Unable to locate Source XRef to link to - DISABLED
[INFO] [remote-resources:process {execution: default}]
[WARNING] org.apache.velocity.runtime.exception.ReferenceException: reference : template =
META-INF/DEPENDENCIES.vm [line 40,column 14] : $license.name is not a valid reference.
[WARNING] org.apache.velocity.runtime.exception.ReferenceException: reference : template =
META-INF/DEPENDENCIES.vm [line 40,column 14] : $license.name is not a valid reference.
[INFO] [resources:resources {execution: default-resources}]
[INFO] Using 'UTF-8' encoding to copy filtered resources.
[INFO] Copying 14 resources
[INFO] Copying 3 resources
[INFO] [compiler:compile {execution: default-compile}]
[INFO] Compiling 234 source files to <https://builds.apache.org/job/OpenJPA-trunk-deploy/ws/trunk/openjpa-persistence/target/classes>
[INFO] [compiler:testCompile {execution: test-source-compile}]
[INFO] Compiling 2 source files to <https://builds.apache.org/job/OpenJPA-trunk-deploy/ws/trunk/openjpa-persistence/target/test-classes>
[INFO] [resources:testResources {execution: default-testResources}]
[INFO] Using 'UTF-8' encoding to copy filtered resources.
[INFO] Copying 3 resources
[INFO] Copying 3 resources
[INFO] [compiler:testCompile {execution: default-testCompile}]
[INFO] Nothing to compile - all classes are up to date
[WARNING] DEPRECATED [systemProperties]: Use systemPropertyVariables instead.
[INFO] [surefire:test {execution: default-test}]
[INFO] Surefire report directory: <https://builds.apache.org/job/OpenJPA-trunk-deploy/ws/trunk/openjpa-persistence/target/surefire-reports>

-------------------------------------------------------
 T E S T S
-------------------------------------------------------
Running org.apache.openjpa.persistence.TestEnumToKernelConstantMappings
Tests run: 7, Failures: 0, Errors: 0, Skipped: 0, Time elapsed: 0.035 sec
Running org.apache.openjpa.persistence.TestPersistenceProductDerivation
Tests run: 5, Failures: 0, Errors: 0, Skipped: 0, Time elapsed: 0.332 sec

Results :

Tests run: 12, Failures: 0, Errors: 0, Skipped: 0

[JENKINS] Recording test results
[INFO] [jar:jar {execution: default-jar}]
[INFO] Building jar: <https://builds.apache.org/job/OpenJPA-trunk-deploy/ws/trunk/openjpa-persistence/target/openjpa-persistence-2.4.0-SNAPSHOT.jar>
[INFO] [jar:jar {execution: default-jar}]
[INFO] [jar:test-jar {execution: attach-tests}]
[INFO] Building jar: <https://builds.apache.org/job/OpenJPA-trunk-deploy/ws/trunk/openjpa-persistence/target/openjpa-persistence-2.4.0-SNAPSHOT-tests.jar>
[INFO] [ianal:verify-legal-files {execution: default}]
[INFO] Checking legal files in: openjpa-persistence-2.4.0-SNAPSHOT.jar
[INFO] Checking legal files in: openjpa-persistence-2.4.0-SNAPSHOT-tests.jar
[INFO] [apache-rat:check {execution: default}]
[INFO] Exclude: **/.*/**
[INFO] Exclude: **/target/**/*
[INFO] [install:install {execution: default-install}]
[INFO] Installing <https://builds.apache.org/job/OpenJPA-trunk-deploy/ws/trunk/openjpa-persistence/target/openjpa-persistence-2.4.0-SNAPSHOT.jar>
to /home/jenkins/jenkins-slave/maven-repositories/1/org/apache/openjpa/openjpa-persistence/2.4.0-SNAPSHOT/openjpa-persistence-2.4.0-SNAPSHOT.jar
[INFO] Installing <https://builds.apache.org/job/OpenJPA-trunk-deploy/ws/trunk/openjpa-persistence/target/openjpa-persistence-2.4.0-SNAPSHOT-tests.jar>
to /home/jenkins/jenkins-slave/maven-repositories/1/org/apache/openjpa/openjpa-persistence/2.4.0-SNAPSHOT/openjpa-persistence-2.4.0-SNAPSHOT-tests.jar
[INFO] [deploy:deploy {execution: default-deploy}]
[INFO] Retrieving previous build number from apache.snapshots.https
[WARNING] *** CHECKSUM FAILED - Checksum failed on download: local = 'd0984b48660b31acbcfb6b2cb9fd6a64a07c4cda';
remote = 'f0cdddf7f3fb1694fc80fc4eb2ce3e4fe756b45b' - RETRYING
[WARNING] *** CHECKSUM FAILED - Checksum failed on download: local = 'd0984b48660b31acbcfb6b2cb9fd6a64a07c4cda';
remote = 'f0cdddf7f3fb1694fc80fc4eb2ce3e4fe756b45b' - IGNORING
Uploading: https://repository.apache.org/content/repositories/snapshots/org/apache/openjpa/openjpa-persistence/2.4.0-SNAPSHOT/openjpa-persistence-2.4.0-20131030.064947-5.jar
811K uploaded  (openjpa-persistence-2.4.0-20131030.064947-5.jar)
[INFO] Retrieving previous metadata from apache.snapshots.https
[WARNING] *** CHECKSUM FAILED - Checksum failed on download: local = 'd0984b48660b31acbcfb6b2cb9fd6a64a07c4cda';
remote = 'f0cdddf7f3fb1694fc80fc4eb2ce3e4fe756b45b' - RETRYING
[WARNING] *** CHECKSUM FAILED - Checksum failed on download: local = 'd0984b48660b31acbcfb6b2cb9fd6a64a07c4cda';
remote = 'f0cdddf7f3fb1694fc80fc4eb2ce3e4fe756b45b' - IGNORING
[INFO] Uploading repository metadata for: 'snapshot org.apache.openjpa:openjpa-persistence:2.4.0-SNAPSHOT'
[INFO] Uploading project information for openjpa-persistence 2.4.0-20131030.064947-5
[INFO] Retrieving previous metadata from apache.snapshots.https
[INFO] Uploading repository metadata for: 'artifact org.apache.openjpa:openjpa-persistence'
[INFO] Retrieving previous build number from apache.snapshots.https
Uploading: https://repository.apache.org/content/repositories/snapshots/org/apache/openjpa/openjpa-persistence/2.4.0-SNAPSHOT/openjpa-persistence-2.4.0-20131030.064947-5-tests.jar
29K uploaded  (openjpa-persistence-2.4.0-20131030.064947-5-tests.jar)
ERROR: Maven JVM terminated unexpectedly with exit code 143


Mime
View raw message