openjpa-commits mailing list archives

Site index · List index
Message view « Date » · « Thread »
Top « Date » · « Thread »
From Apache Jenkins Server <jenk...@builds.apache.org>
Subject Build failed in Jenkins: OpenJPA-22x » OpenJPA Kernel #48
Date Fri, 04 Oct 2013 21:07:45 GMT
See <https://builds.apache.org/job/OpenJPA-22x/org.apache.openjpa$openjpa-kernel/48/changes>

Changes:

[hthomann] OPENJPA-1794: Return null, rather than 0, on MAX function - back ported to 2.2.x
Jeremy Bauer's commit to trunk.

------------------------------------------
[INFO] ------------------------------------------------------------------------
[INFO] Building OpenJPA Kernel
[INFO]    task-segment: [clean, install]
[INFO] ------------------------------------------------------------------------
[INFO] [clean:clean {execution: default-clean}]
[INFO] [buildnumber:create {execution: default}]
[INFO] [enforcer:enforce {execution: default}]
[INFO] [javacc:jjtree-javacc {execution: jjtree-javacc-jpql}]
Java Compiler Compiler Version 4.0 (Tree Builder)
(type "jjtree" with no arguments for help)
Reading from file <https://builds.apache.org/job/OpenJPA-22x/org.apache.openjpa$openjpa-kernel/ws/src/main/jjtree/org/apache/openjpa/kernel/jpql/JPQL.jjt>
. . .
File "<https://builds.apache.org/job/OpenJPA-22x/org.apache.openjpa$openjpa-kernel/ws/target/generated-sources/jjtree/org/apache/openjpa/kernel/jpql/Node.java">
does not exist.  Will create one.
Annotated grammar generated successfully in <https://builds.apache.org/job/OpenJPA-22x/org.apache.openjpa$openjpa-kernel/ws/target/generated-sources/jjtree/org/apache/openjpa/kernel/jpql/JPQL.jj>
Java Compiler Compiler Version 4.0 (Parser Generator)
(type "javacc" with no arguments for help)
Reading from file <https://builds.apache.org/job/OpenJPA-22x/org.apache.openjpa$openjpa-kernel/ws/target/generated-sources/jjtree/org/apache/openjpa/kernel/jpql/JPQL.jj>
. . .
Warning: Choice conflict in (...)* construct at line 939, column 17.
         Expansion nested within construct and expansion following construct
         have common prefixes, one of which is: "+"
         Consider using a lookahead of 2 or more for nested expansion.
Warning: Choice conflict in (...)* construct at line 948, column 17.
         Expansion nested within construct and expansion following construct
         have common prefixes, one of which is: "*"
         Consider using a lookahead of 2 or more for nested expansion.
File "TokenMgrError.java" does not exist.  Will create one.
Warning: ParseException.java: File is obsolete.  Please rename or delete this file so that
a new one can be generated for you.
File "Token.java" does not exist.  Will create one.
File "JavaCharStream.java" does not exist.  Will create one.
Parser generated with 0 errors and 3 warnings.
[INFO] Processed 1 grammar
[INFO] [checkstyle:checkstyle {execution: default}]
[INFO] Starting audit...
Audit done.

[WARNING] Unable to locate Source XRef to link to - DISABLED
[INFO] [remote-resources:process {execution: default}]
[INFO] [resources:resources {execution: default-resources}]
[INFO] Using 'UTF-8' encoding to copy filtered resources.
[INFO] Copying 15 resources
[INFO] Copying 3 resources
[INFO] [compiler:compile {execution: default-compile}]
[INFO] Compiling 505 source files to <https://builds.apache.org/job/OpenJPA-22x/org.apache.openjpa$openjpa-kernel/ws/target/classes>
[INFO] -------------------------------------------------------------
[ERROR] COMPILATION ERROR : 
[INFO] -------------------------------------------------------------
[ERROR] <https://builds.apache.org/job/OpenJPA-22x/org.apache.openjpa$openjpa-kernel/ws/src/main/java/org/apache/openjpa/conf/Compatibility.java>:[79,20]
_useListAttributeForArrays is already defined in org.apache.openjpa.conf.Compatibility
[INFO] 1 error
[INFO] -------------------------------------------------------------
[JENKINS] Archiving <https://builds.apache.org/job/OpenJPA-22x/org.apache.openjpa$openjpa-kernel/ws/pom.xml>
to /home/hudson/hudson/jobs/OpenJPA-22x/modules/org.apache.openjpa$openjpa-kernel/builds/2013-10-04_21-06-07/archive/org.apache.openjpa/openjpa-kernel/2.2.3-SNAPSHOT/openjpa-kernel-2.2.3-SNAPSHOT.pom
[INFO] ------------------------------------------------------------------------
[ERROR] BUILD FAILURE
[INFO] ------------------------------------------------------------------------
[INFO] Compilation failure
<https://builds.apache.org/job/OpenJPA-22x/org.apache.openjpa$openjpa-kernel/ws/src/main/java/org/apache/openjpa/conf/Compatibility.java>:[79,20]
_useListAttributeForArrays is already defined in org.apache.openjpa.conf.Compatibility

[INFO] ------------------------------------------------------------------------
[INFO] For more information, run Maven with the -e switch
[INFO] ------------------------------------------------------------------------
[INFO] Total time: 1 minute 10 seconds
[INFO] Finished at: Fri Oct 04 21:07:42 UTC 2013
[INFO] Final Memory: 82M/524M
[INFO] ------------------------------------------------------------------------

Mime
View raw message