openjpa-commits mailing list archives

Site index · List index
Message view « Date » · « Thread »
Top « Date » · « Thread »
From Apache Jenkins Server <jenk...@builds.apache.org>
Subject Build failed in Jenkins: OpenJPA-22x #48
Date Fri, 04 Oct 2013 21:08:02 GMT
See <https://builds.apache.org/job/OpenJPA-22x/48/changes>

Changes:

[hthomann] OPENJPA-1794: Return null, rather than 0, on MAX function - back ported to 2.2.x
Jeremy Bauer's commit to trunk.

------------------------------------------
[...truncated 6041 lines...]
Setting property: site.resource.loader.class => 'org.codehaus.plexus.velocity.SiteResourceLoader'.
Setting property: velocimacro.messages.on => 'false'.
Setting property: resource.loader => 'classpath,site'.
Setting property: runtime.log.invalid.references => 'false'.
Setting property: resource.manager.logwhenfound => 'false'.
Setting property: velocimacro.permissions.allow.inline.to.replace.global => 'true'.
[INFO] [checkstyle:checkstyle {execution: default}]
[INFO] Setting property: classpath.resource.loader.class => 'org.codehaus.plexus.velocity.ContextClassLoaderResourceLoader'.
[INFO] Setting property: velocimacro.messages.on => 'false'.
[INFO] Setting property: resource.loader => 'classpath'.
[INFO] Setting property: resource.manager.logwhenfound => 'false'.
[INFO] [remote-resources:process {execution: default}]
[INFO] [compiler:testCompile {execution: test-source-compile}]
[INFO] No sources to compile
[INFO] [site:attach-descriptor {execution: default-attach-descriptor}]
[INFO] Unable to load parent project from a relative path: Could not find the model file '<https://builds.apache.org/job/OpenJPA-22x/ws/pom.xml'.>
for project unknown
[INFO] Parent project loaded from repository.
[INFO] [ianal:verify-legal-files {execution: default}]
[INFO] [apache-rat:check {execution: default}]
[INFO] Exclude: **/.*/**
[INFO] Exclude: **/target/**/*
[INFO] [install:install {execution: default-install}]
[INFO] Installing <https://builds.apache.org/job/OpenJPA-22x/ws/2.2.x/pom.xml> to /home/jenkins/jenkins-slave/maven-repositories/1/org/apache/openjpa/openjpa-parent/2.2.3-SNAPSHOT/openjpa-parent-2.2.3-SNAPSHOT.pom
[JENKINS] Archiving <https://builds.apache.org/job/OpenJPA-22x/ws/2.2.x/pom.xml> to
/home/hudson/hudson/jobs/OpenJPA-22x/modules/org.apache.openjpa$openjpa-parent/builds/2013-10-04_21-06-07/archive/org.apache.openjpa/openjpa-parent/2.2.3-SNAPSHOT/openjpa-parent-2.2.3-SNAPSHOT.pom
[INFO] ------------------------------------------------------------------------
[INFO] Building OpenJPA Utilities Library
[INFO]    task-segment: [clean, install]
[INFO] ------------------------------------------------------------------------
[INFO] [clean:clean {execution: default-clean}]
[INFO] [buildnumber:create {execution: default}]
[INFO] [enforcer:enforce {execution: default}]
[INFO] [checkstyle:checkstyle {execution: default}]
[INFO] Starting audit...
Audit done.

[WARNING] Unable to locate Source XRef to link to - DISABLED
[ERROR] VM #image: error : too few arguments to macro. Wanted 5 got 0
[ERROR] VM #image: error : too few arguments to macro. Wanted 5 got 0
[ERROR] VM #displayTree: error : too few arguments to macro. Wanted 2 got 0
[ERROR] VM #menuItem: error : too few arguments to macro. Wanted 1 got 0
[INFO] [remote-resources:process {execution: default}]
[INFO] [resources:resources {execution: default-resources}]
[INFO] Using 'UTF-8' encoding to copy filtered resources.
[INFO] Copying 9 resources
[INFO] Copying 3 resources
[INFO] [compiler:compile {execution: default-compile}]
[INFO] Compiling 161 source files to <https://builds.apache.org/job/OpenJPA-22x/ws/2.2.x/openjpa-lib/target/classes>
[INFO] [antrun:run {execution: set subversion revision}]
[INFO] Executing tasks
   [delete] Deleting: <https://builds.apache.org/job/OpenJPA-22x/ws/2.2.x/openjpa-lib/pcenhancer.revision.file>
     [echo] Revision: 422266:1529273
     [echo] OpenJPA version: 2.2.3-SNAPSHOT
[INFO] Executed tasks
[INFO] [compiler:testCompile {execution: test-source-compile}]
[INFO] Compiling 42 source files to <https://builds.apache.org/job/OpenJPA-22x/ws/2.2.x/openjpa-lib/target/test-classes>
[INFO] [resources:testResources {execution: default-testResources}]
[INFO] Using 'UTF-8' encoding to copy filtered resources.
[INFO] Copying 8 resources
[INFO] Copying 3 resources
[INFO] [compiler:testCompile {execution: default-testCompile}]
[INFO] Nothing to compile - all classes are up to date
[WARNING] DEPRECATED [systemProperties]: Use systemPropertyVariables instead.
[INFO] [surefire:test {execution: default-test}]
[INFO] Surefire report directory: <https://builds.apache.org/job/OpenJPA-22x/ws/2.2.x/openjpa-lib/target/surefire-reports>

-------------------------------------------------------
 T E S T S
-------------------------------------------------------
Running org.apache.openjpa.lib.conf.TestValue
Tests run: 3, Failures: 0, Errors: 0, Skipped: 0, Time elapsed: 0.039 sec
Running org.apache.openjpa.lib.util.concurrent.TestConcurrentMap
Tests run: 4, Failures: 0, Errors: 0, Skipped: 0, Time elapsed: 2.31 sec
Running org.apache.openjpa.lib.graph.TestGraph
Tests run: 3, Failures: 0, Errors: 0, Skipped: 0, Time elapsed: 0.007 sec
Running org.apache.openjpa.lib.util.TestLocalizer
Tests run: 7, Failures: 0, Errors: 0, Skipped: 0, Time elapsed: 0.014 sec
Running org.apache.openjpa.lib.conf.TestConfigurationProviderPrefixes
Tests run: 7, Failures: 0, Errors: 0, Skipped: 0, Time elapsed: 0.016 sec
Running org.apache.openjpa.lib.conf.TestConfigurations
Tests run: 3, Failures: 0, Errors: 0, Skipped: 0, Time elapsed: 0.017 sec
Running org.apache.openjpa.lib.rop.TestRandomAccessResultList
Tests run: 17, Failures: 0, Errors: 0, Skipped: 0, Time elapsed: 0.019 sec
Running org.apache.openjpa.lib.rop.TestLazyForwardResultList
Tests run: 17, Failures: 0, Errors: 0, Skipped: 0, Time elapsed: 0.012 sec
Running org.apache.openjpa.lib.rop.TestEagerResultList
Tests run: 17, Failures: 0, Errors: 0, Skipped: 0, Time elapsed: 0.011 sec
Running org.apache.openjpa.lib.conf.TestXMLCaseConversions
Tests run: 1, Failures: 0, Errors: 0, Skipped: 0, Time elapsed: 0.008 sec
Running org.apache.openjpa.lib.util.TestTypedProperties
Tests run: 4, Failures: 0, Errors: 0, Skipped: 0, Time elapsed: 0.004 sec
Running org.apache.openjpa.lib.conf.test.TestPluginValue
Tests run: 3, Failures: 0, Errors: 0, Skipped: 0, Time elapsed: 0.004 sec
Running org.apache.openjpa.lib.graph.TestDepthFirstAnalysis
Tests run: 4, Failures: 0, Errors: 0, Skipped: 0, Time elapsed: 0.006 sec
Running org.apache.openjpa.lib.xml.TestDocTypeReader
Tests run: 3, Failures: 0, Errors: 0, Skipped: 0, Time elapsed: 0.081 sec
Running org.apache.openjpa.lib.rop.TestListResultList
Tests run: 17, Failures: 0, Errors: 0, Skipped: 0, Time elapsed: 0.009 sec
Running org.apache.openjpa.lib.rop.TestMergedResultObjectProvider
Tests run: 17, Failures: 0, Errors: 0, Skipped: 0, Time elapsed: 0.042 sec
Running org.apache.openjpa.lib.conf.test.TestConfigurationImpl
1  WARN   [main] openjpa.Runtime - The configuration property named "openjpa.ConnectionProperties"
was not recognized and will be ignored, although the name closely matches a valid property
called "openjpa.objectKey".
1  WARN   [main] openjpa.Runtime - The configuration property named "openjpa.ConnectionURL"
was not recognized and will be ignored, although the name closely matches a valid property
called "openjpa.objectKey".
2  WARN   [main] openjpa.Runtime - The configuration property named "openjpa.ConnectionUserName"
was not recognized and will be ignored, although the name closely matches a valid property
called "openjpa.objectKey".
2  WARN   [main] openjpa.Runtime - The configuration property named "openjpa.ConnectionDriverName"
was not recognized and will be ignored, although the name closely matches a valid property
called "openjpa.objectKey".
3  WARN   [main] openjpa.Runtime - The configuration property named "openjpa.ConnectionPassword"
was not recognized and will be ignored, although the name closely matches a valid property
called "openjpa.objectKey".
4  WARN   [main] openjpa.Runtime - The configuration property named "openjpa.DynamicEnhancementAgent"
was not recognized and will be ignored.
0  WARN   [main] openjpa.Runtime - The configuration property named "openjpa.ConnectionProperties"
was not recognized and will be ignored, although the name closely matches a valid property
called "openjpa.objectKey".
1  WARN   [main] openjpa.Runtime - The configuration property named "openjpa.ConnectionURL"
was not recognized and will be ignored, although the name closely matches a valid property
called "openjpa.objectKey".
1  WARN   [main] openjpa.Runtime - The configuration property named "openjpa.ConnectionUserName"
was not recognized and will be ignored, although the name closely matches a valid property
called "openjpa.objectKey".
2  WARN   [main] openjpa.Runtime - The configuration property named "openjpa.ConnectionDriverName"
was not recognized and will be ignored, although the name closely matches a valid property
called "openjpa.objectKey".
2  WARN   [main] openjpa.Runtime - The configuration property named "openjpa.ConnectionPassword"
was not recognized and will be ignored, although the name closely matches a valid property
called "openjpa.objectKey".
3  WARN   [main] openjpa.Runtime - The configuration property named "openjpa.DynamicEnhancementAgent"
was not recognized and will be ignored.
1  WARN   [main] openjpa.Runtime - The configuration property named "openjpa.ConnectionProperties"
was not recognized and will be ignored, although the name closely matches a valid property
called "openjpa.objectKey".
1  WARN   [main] openjpa.Runtime - The configuration property named "openjpa.ConnectionURL"
was not recognized and will be ignored, although the name closely matches a valid property
called "openjpa.objectKey".
2  WARN   [main] openjpa.Runtime - The configuration property named "openjpa.ConnectionUserName"
was not recognized and will be ignored, although the name closely matches a valid property
called "openjpa.objectKey".
2  WARN   [main] openjpa.Runtime - The configuration property named "openjpa.ConnectionDriverName"
was not recognized and will be ignored, although the name closely matches a valid property
called "openjpa.objectKey".
3  WARN   [main] openjpa.Runtime - The configuration property named "openjpa.ConnectionPassword"
was not recognized and will be ignored, although the name closely matches a valid property
called "openjpa.objectKey".
3  WARN   [main] openjpa.Runtime - The configuration property named "openjpa.DynamicEnhancementAgent"
was not recognized and will be ignored.
1  WARN   [main] openjpa.Runtime - The configuration property named "openjpa.ConnectionProperties"
was not recognized and will be ignored, although the name closely matches a valid property
called "openjpa.objectKey".
1  WARN   [main] openjpa.Runtime - The configuration property named "openjpa.ConnectionURL"
was not recognized and will be ignored, although the name closely matches a valid property
called "openjpa.objectKey".
2  WARN   [main] openjpa.Runtime - The configuration property named "openjpa.ConnectionUserName"
was not recognized and will be ignored, although the name closely matches a valid property
called "openjpa.objectKey".
2  WARN   [main] openjpa.Runtime - The configuration property named "openjpa.ConnectionDriverName"
was not recognized and will be ignored, although the name closely matches a valid property
called "openjpa.objectKey".
3  WARN   [main] openjpa.Runtime - The configuration property named "openjpa.ConnectionPassword"
was not recognized and will be ignored, although the name closely matches a valid property
called "openjpa.objectKey".
3  WARN   [main] openjpa.Runtime - The configuration property named "openjpa.DynamicEnhancementAgent"
was not recognized and will be ignored.
Tests run: 8, Failures: 0, Errors: 0, Skipped: 0, Time elapsed: 0.055 sec
Running org.apache.openjpa.lib.rop.TestOrderedMergedResultObjectProvider
Tests run: 17, Failures: 0, Errors: 0, Skipped: 0, Time elapsed: 0.087 sec
Running org.apache.openjpa.lib.identifier.TestIdentifiers
Tests run: 1, Failures: 0, Errors: 0, Skipped: 0, Time elapsed: 0.008 sec
Running org.apache.openjpa.lib.util.TestPropertiesParser
Tests run: 13, Failures: 0, Errors: 0, Skipped: 0, Time elapsed: 0.068 sec
Running org.apache.openjpa.lib.util.TestMultiClassLoader
Tests run: 2, Failures: 0, Errors: 0, Skipped: 0, Time elapsed: 0.003 sec
Running org.apache.openjpa.lib.util.TestTemporaryClassLoader
Tests run: 1, Failures: 0, Errors: 0, Skipped: 0, Time elapsed: 0.005 sec
Running org.apache.openjpa.lib.util.TestReferenceSet
Tests run: 4, Failures: 0, Errors: 0, Skipped: 0, Time elapsed: 0.013 sec
Running org.apache.openjpa.lib.rop.TestSimpleResultList
Tests run: 17, Failures: 0, Errors: 0, Skipped: 0, Time elapsed: 0.008 sec
Running org.apache.openjpa.lib.rop.TestSoftRandomAccessResultList
Tests run: 17, Failures: 0, Errors: 0, Skipped: 0, Time elapsed: 0.016 sec
Running org.apache.openjpa.lib.util.TestSimpleRegex
Tests run: 1, Failures: 0, Errors: 0, Skipped: 0, Time elapsed: 0.003 sec
Running org.apache.openjpa.lib.util.TestOptions
Tests run: 2, Failures: 0, Errors: 0, Skipped: 0, Time elapsed: 0.006 sec
Running org.apache.openjpa.lib.util.TestAbstractEventManager
Tests run: 2, Failures: 0, Errors: 0, Skipped: 0, Time elapsed: 0.004 sec
Running org.apache.openjpa.lib.util.TestUUIDGenerator
Tests run: 7, Failures: 0, Errors: 0, Skipped: 0, Time elapsed: 0.369 sec
Running org.apache.openjpa.lib.util.TestParameterTemplate
Tests run: 1, Failures: 0, Errors: 0, Skipped: 0, Time elapsed: 0.003 sec
Running org.apache.openjpa.lib.xml.TestXMLWriter
Tests run: 1, Failures: 0, Errors: 0, Skipped: 0, Time elapsed: 0.017 sec
Running org.apache.openjpa.lib.rop.TestWindowResultList
Tests run: 17, Failures: 0, Errors: 0, Skipped: 0, Time elapsed: 0.011 sec
Running org.apache.openjpa.lib.util.svn.TestSVNUtils
Tests run: 6, Failures: 0, Errors: 0, Skipped: 0, Time elapsed: 0.006 sec
Running org.apache.openjpa.lib.rop.TestRangeResultObjectProvider
Tests run: 17, Failures: 0, Errors: 0, Skipped: 0, Time elapsed: 0.022 sec
Running org.apache.openjpa.lib.util.concurrent.TestNullSafeConcurrentHashMap
Tests run: 5, Failures: 0, Errors: 0, Skipped: 0, Time elapsed: 0.167 sec

Results :

Tests run: 266, Failures: 0, Errors: 0, Skipped: 0

[JENKINS] Recording test results
[INFO] [jar:jar {execution: default-jar}]
[INFO] Building jar: <https://builds.apache.org/job/OpenJPA-22x/ws/2.2.x/openjpa-lib/target/openjpa-lib-2.2.3-SNAPSHOT.jar>
[INFO] [jar:jar {execution: default-jar}]
[INFO] [jar:test-jar {execution: attach-tests}]
[INFO] Building jar: <https://builds.apache.org/job/OpenJPA-22x/ws/2.2.x/openjpa-lib/target/openjpa-lib-2.2.3-SNAPSHOT-tests.jar>
[INFO] [ianal:verify-legal-files {execution: default}]
[INFO] Checking legal files in: openjpa-lib-2.2.3-SNAPSHOT.jar
[INFO] Checking legal files in: openjpa-lib-2.2.3-SNAPSHOT-tests.jar
[INFO] [apache-rat:check {execution: default}]
[INFO] Exclude: **/.*/**
[INFO] Exclude: **/target/**/*
[INFO] [install:install {execution: default-install}]
[INFO] Installing <https://builds.apache.org/job/OpenJPA-22x/ws/2.2.x/openjpa-lib/target/openjpa-lib-2.2.3-SNAPSHOT.jar>
to /home/jenkins/jenkins-slave/maven-repositories/1/org/apache/openjpa/openjpa-lib/2.2.3-SNAPSHOT/openjpa-lib-2.2.3-SNAPSHOT.jar
[INFO] Installing <https://builds.apache.org/job/OpenJPA-22x/ws/2.2.x/openjpa-lib/target/openjpa-lib-2.2.3-SNAPSHOT-tests.jar>
to /home/jenkins/jenkins-slave/maven-repositories/1/org/apache/openjpa/openjpa-lib/2.2.3-SNAPSHOT/openjpa-lib-2.2.3-SNAPSHOT-tests.jar
[JENKINS] Archiving <https://builds.apache.org/job/OpenJPA-22x/ws/2.2.x/openjpa-lib/pom.xml>
to /home/hudson/hudson/jobs/OpenJPA-22x/modules/org.apache.openjpa$openjpa-lib/builds/2013-10-04_21-06-07/archive/org.apache.openjpa/openjpa-lib/2.2.3-SNAPSHOT/openjpa-lib-2.2.3-SNAPSHOT.pom
[JENKINS] Archiving <https://builds.apache.org/job/OpenJPA-22x/ws/2.2.x/openjpa-lib/target/openjpa-lib-2.2.3-SNAPSHOT.jar>
to /home/hudson/hudson/jobs/OpenJPA-22x/modules/org.apache.openjpa$openjpa-lib/builds/2013-10-04_21-06-07/archive/org.apache.openjpa/openjpa-lib/2.2.3-SNAPSHOT/openjpa-lib-2.2.3-SNAPSHOT.jar
[JENKINS] Archiving <https://builds.apache.org/job/OpenJPA-22x/ws/2.2.x/openjpa-lib/target/openjpa-lib-2.2.3-SNAPSHOT-tests.jar>
to /home/hudson/hudson/jobs/OpenJPA-22x/modules/org.apache.openjpa$openjpa-lib/builds/2013-10-04_21-06-07/archive/org.apache.openjpa/openjpa-lib/2.2.3-SNAPSHOT/openjpa-lib-2.2.3-SNAPSHOT-tests.jar
[INFO] ------------------------------------------------------------------------
[INFO] Building OpenJPA Kernel
[INFO]    task-segment: [clean, install]
[INFO] ------------------------------------------------------------------------
[INFO] [clean:clean {execution: default-clean}]
[INFO] [buildnumber:create {execution: default}]
[INFO] [enforcer:enforce {execution: default}]
[INFO] [javacc:jjtree-javacc {execution: jjtree-javacc-jpql}]
Java Compiler Compiler Version 4.0 (Tree Builder)
(type "jjtree" with no arguments for help)
Reading from file <https://builds.apache.org/job/OpenJPA-22x/ws/2.2.x/openjpa-kernel/src/main/jjtree/org/apache/openjpa/kernel/jpql/JPQL.jjt>
. . .
File "<https://builds.apache.org/job/OpenJPA-22x/ws/2.2.x/openjpa-kernel/target/generated-sources/jjtree/org/apache/openjpa/kernel/jpql/Node.java">
does not exist.  Will create one.
Annotated grammar generated successfully in <https://builds.apache.org/job/OpenJPA-22x/ws/2.2.x/openjpa-kernel/target/generated-sources/jjtree/org/apache/openjpa/kernel/jpql/JPQL.jj>
Java Compiler Compiler Version 4.0 (Parser Generator)
(type "javacc" with no arguments for help)
Reading from file <https://builds.apache.org/job/OpenJPA-22x/ws/2.2.x/openjpa-kernel/target/generated-sources/jjtree/org/apache/openjpa/kernel/jpql/JPQL.jj>
. . .
Warning: Choice conflict in (...)* construct at line 939, column 17.
         Expansion nested within construct and expansion following construct
         have common prefixes, one of which is: "+"
         Consider using a lookahead of 2 or more for nested expansion.
Warning: Choice conflict in (...)* construct at line 948, column 17.
         Expansion nested within construct and expansion following construct
         have common prefixes, one of which is: "*"
         Consider using a lookahead of 2 or more for nested expansion.
File "TokenMgrError.java" does not exist.  Will create one.
Warning: ParseException.java: File is obsolete.  Please rename or delete this file so that
a new one can be generated for you.
File "Token.java" does not exist.  Will create one.
File "JavaCharStream.java" does not exist.  Will create one.
Parser generated with 0 errors and 3 warnings.
[INFO] Processed 1 grammar
[INFO] [checkstyle:checkstyle {execution: default}]
[INFO] Starting audit...
Audit done.

[WARNING] Unable to locate Source XRef to link to - DISABLED
[INFO] [remote-resources:process {execution: default}]
[INFO] [resources:resources {execution: default-resources}]
[INFO] Using 'UTF-8' encoding to copy filtered resources.
[INFO] Copying 15 resources
[INFO] Copying 3 resources
[INFO] [compiler:compile {execution: default-compile}]
[INFO] Compiling 505 source files to <https://builds.apache.org/job/OpenJPA-22x/ws/2.2.x/openjpa-kernel/target/classes>
[INFO] -------------------------------------------------------------
[ERROR] COMPILATION ERROR : 
[INFO] -------------------------------------------------------------
[ERROR] <https://builds.apache.org/job/OpenJPA-22x/ws/2.2.x/openjpa-kernel/src/main/java/org/apache/openjpa/conf/Compatibility.java>:[79,20]
_useListAttributeForArrays is already defined in org.apache.openjpa.conf.Compatibility
[INFO] 1 error
[INFO] -------------------------------------------------------------
[JENKINS] Archiving <https://builds.apache.org/job/OpenJPA-22x/ws/2.2.x/openjpa-kernel/pom.xml>
to /home/hudson/hudson/jobs/OpenJPA-22x/modules/org.apache.openjpa$openjpa-kernel/builds/2013-10-04_21-06-07/archive/org.apache.openjpa/openjpa-kernel/2.2.3-SNAPSHOT/openjpa-kernel-2.2.3-SNAPSHOT.pom
[INFO] ------------------------------------------------------------------------
[ERROR] BUILD FAILURE
[INFO] ------------------------------------------------------------------------
[INFO] Compilation failure
<https://builds.apache.org/job/OpenJPA-22x/ws/2.2.x/openjpa-kernel/src/main/java/org/apache/openjpa/conf/Compatibility.java>:[79,20]
_useListAttributeForArrays is already defined in org.apache.openjpa.conf.Compatibility

[INFO] ------------------------------------------------------------------------
[INFO] For more information, run Maven with the -e switch
[INFO] ------------------------------------------------------------------------
[INFO] Total time: 1 minute 10 seconds
[INFO] Finished at: Fri Oct 04 21:07:42 UTC 2013
[INFO] Final Memory: 82M/524M
[INFO] ------------------------------------------------------------------------
Sending e-mails to: commits@openjpa.apache.org
channel stopped

Mime
View raw message