openjpa-commits mailing list archives

Site index · List index
Message view « Date » · « Thread »
Top « Date » · « Thread »
From Apache Jenkins Server <jenk...@builds.apache.org>
Subject Build failed in Jenkins: OpenJPA-trunk-deploy #431
Date Mon, 25 Nov 2013 10:57:27 GMT
See <https://builds.apache.org/job/OpenJPA-trunk-deploy/431/changes>

Changes:

[kwsutter] OPENJPA-2459.  Update source and test java level to 1.7 as the minimum version.

------------------------------------------
[...truncated 5999 lines...]
AU        openjpa-persistence/src/main/java/org/apache/openjpa/persistence/util/ReservedWords.java
AU        openjpa-persistence/src/main/java/org/apache/openjpa/persistence/util/package.html
AU        openjpa-persistence/src/main/java/org/apache/openjpa/persistence/DataCache.java
AU        openjpa-persistence/src/main/java/org/apache/openjpa/persistence/OpenJPAQuerySPI.java
AU        openjpa-persistence/src/main/java/org/apache/openjpa/persistence/CallbackMode.java
AU        openjpa-persistence/src/main/java/org/apache/openjpa/persistence/OpenJPAPersistence.java
AU        openjpa-persistence/src/main/java/org/apache/openjpa/persistence/ArgumentException.java
AU        openjpa-persistence/src/main/java/org/apache/openjpa/persistence/StoreCacheImpl.java
AU        openjpa-persistence/src/main/java/org/apache/openjpa/persistence/ExternalValues.java
AU        openjpa-persistence/src/main/java/org/apache/openjpa/persistence/ParameterImpl.java
AU        openjpa-persistence/src/main/java/org/apache/openjpa/persistence/TransactionRequiredException.java
AU        openjpa-persistence/src/main/java/org/apache/openjpa/persistence/LockScopesHelper.java
A         openjpa-persistence/src/main/java/org/apache/openjpa/persistence/meta
AU        openjpa-persistence/src/main/java/org/apache/openjpa/persistence/meta/package.html
AU        openjpa-persistence/src/main/java/org/apache/openjpa/persistence/meta/AnnotationProcessor6.java
AU        openjpa-persistence/src/main/java/org/apache/openjpa/persistence/meta/MetadataProcessor.java
AU        openjpa-persistence/src/main/java/org/apache/openjpa/persistence/meta/AbstractManagedType.java
AU        openjpa-persistence/src/main/java/org/apache/openjpa/persistence/meta/Types.java
AU        openjpa-persistence/src/main/java/org/apache/openjpa/persistence/meta/CompileTimeLogger.java
AU        openjpa-persistence/src/main/java/org/apache/openjpa/persistence/meta/MetamodelImpl.java
AU        openjpa-persistence/src/main/java/org/apache/openjpa/persistence/meta/SourceAnnotationHandler.java
AU        openjpa-persistence/src/main/java/org/apache/openjpa/persistence/meta/Members.java
AU        openjpa-persistence/src/main/java/org/apache/openjpa/persistence/EntityNotFoundException.java
AU        openjpa-persistence/src/main/java/org/apache/openjpa/persistence/GeneratorImpl.java
AU        openjpa-persistence/src/main/java/org/apache/openjpa/persistence/QueryResultCacheImpl.java
AU        openjpa-persistence/src/main/java/org/apache/openjpa/persistence/AnnotationPersistenceMetaDataSerializer.java
A         openjpa-persistence/src/main/java/org/apache/openjpa/persistence/validation
AU        openjpa-persistence/src/main/java/org/apache/openjpa/persistence/validation/ValidationUtils.java
AU        openjpa-persistence/src/main/java/org/apache/openjpa/persistence/validation/TraversableResolverImpl.java
AU        openjpa-persistence/src/main/java/org/apache/openjpa/persistence/validation/ValidatorImpl.java
AU        openjpa-persistence/src/main/java/org/apache/openjpa/persistence/KeyDependent.java
AU        openjpa-persistence/src/main/java/org/apache/openjpa/persistence/StoreCache.java
AU        openjpa-persistence/src/main/java/org/apache/openjpa/persistence/UpdateAction.java
AU        openjpa-persistence/src/main/java/org/apache/openjpa/persistence/PersistenceProviderImpl.java
AU        openjpa-persistence/src/main/java/org/apache/openjpa/persistence/OpenJPAEnum.java
AU        openjpa-persistence/src/main/java/org/apache/openjpa/persistence/AutoClearType.java
AU        openjpa-persistence/src/main/java/org/apache/openjpa/persistence/AnnotationBuilder.java
AU        openjpa-persistence/src/main/java/org/apache/openjpa/persistence/AutoDetachType.java
AU        openjpa-persistence/src/main/java/org/apache/openjpa/persistence/XMLPersistenceMetaDataParser.java
AU        openjpa-persistence/src/main/java/org/apache/openjpa/persistence/OpenJPAEntityManager.java
AU        openjpa-persistence/src/main/java/org/apache/openjpa/persistence/PersistenceExceptions.java
AU        openjpa-persistence/src/main/java/org/apache/openjpa/persistence/Generator.java
AU        openjpa-persistence/src/main/java/org/apache/openjpa/persistence/QueryResultCache.java
AU        openjpa-persistence/src/main/java/org/apache/openjpa/persistence/KeyType.java
AU        openjpa-persistence/src/main/java/org/apache/openjpa/persistence/ElementType.java
AU        openjpa-persistence/src/main/java/org/apache/openjpa/persistence/QueryTimeoutException.java
AU        openjpa-persistence/src/main/java/org/apache/openjpa/persistence/PersistenceListenerAdapter.java
AU        openjpa-persistence/src/main/java/org/apache/openjpa/persistence/OpenJPAEntityTransaction.java
AU        openjpa-persistence/src/main/java/org/apache/openjpa/persistence/HintHandler.java
AU        openjpa-persistence/src/main/java/org/apache/openjpa/persistence/LRS.java
AU        openjpa-persistence/src/main/java/org/apache/openjpa/persistence/OpenJPAEntityManagerSPI.java
AU        openjpa-persistence/src/main/java/org/apache/openjpa/persistence/InverseLogical.java
AU        openjpa-persistence/src/main/java/org/apache/openjpa/persistence/LoadFetchGroup.java
AU        openjpa-persistence/src/main/java/org/apache/openjpa/persistence/OptimisticLockException.java
AU        openjpa-persistence/src/main/java/org/apache/openjpa/persistence/Externalizer.java
AU        openjpa-persistence/src/main/java/org/apache/openjpa/persistence/PersistentCollection.java
AU        openjpa-persistence/src/main/java/org/apache/openjpa/persistence/PersistenceMetaDataDefaults.java
AU        openjpa-persistence/src/main/java/org/apache/openjpa/persistence/LockTimeoutException.java
AU        openjpa-persistence/src/main/java/org/apache/openjpa/persistence/ElementDependent.java
A         openjpa-persistence/src/main/java/org/apache/openjpa/persistence/osgi
AU        openjpa-persistence/src/main/java/org/apache/openjpa/persistence/osgi/PersistenceActivator.java
AU        openjpa-persistence/src/main/java/org/apache/openjpa/persistence/osgi/BundleDelegatingClassLoader.java
AU        openjpa-persistence/src/main/java/org/apache/openjpa/persistence/osgi/BundleUtils.java
AU        openjpa-persistence/src/main/java/org/apache/openjpa/persistence/osgi/package.html
AU        openjpa-persistence/src/main/java/org/apache/openjpa/persistence/TupleFactory.java
AU        openjpa-persistence/src/main/java/org/apache/openjpa/persistence/OpenJPAQuery.java
AU        openjpa-persistence/src/main/java/org/apache/openjpa/persistence/FetchPlanImpl.java
AU        openjpa-persistence/src/main/java/org/apache/openjpa/persistence/HintValueConverter.java
AU        openjpa-persistence/src/main/java/org/apache/openjpa/persistence/JPAProperties.java
AU        openjpa-persistence/src/main/java/org/apache/openjpa/persistence/NoResultException.java
AU        openjpa-persistence/src/main/java/org/apache/openjpa/persistence/Persistent.java
AU        openjpa-persistence/src/main/java/org/apache/openjpa/persistence/XMLPersistenceMetaDataSerializer.java
AU        openjpa-persistence/src/main/java/org/apache/openjpa/persistence/DetachedState.java
AU        openjpa-persistence/pom.xml
AU        patchoj.py
A         NOTICE
A         LICENSE
A         src
A         src/site
A         src/site/apt
A         src/site/apt/index.apt
A         src/site/xdoc
AU        src/site/site.xml
A         scripts
A         scripts/domain-class.list
AU        scripts/test.bat
AU        scripts/mmg.bat
AU        scripts/docit.bat
AU        scripts/status.bat
AU        scripts/mmg.readme.txt
AU        scripts/branchdiff.bat
AU        scripts/rollback.bat
A         scripts/user.dict
 U        .
At revision 1545215
Parsing POMs
maven-agent.jar already up to date
classworlds.jar already up to date
maven-interceptor.jar already up to date
maven2.1-interceptor.jar already up to date
[trunk] $ /home/hudson/tools/java/latest1.6/bin/java -Xmx1280m -XX:MaxPermSize=512m -cp /home/jenkins/jenkins-slave/maven-agent.jar:/home/jenkins/jenkins-slave/classworlds.jar
hudson.maven.agent.Main /home/hudson/tools/maven/apache-maven-2.2.1 /x1/jenkins/jenkins-slave/slave.jar
/home/jenkins/jenkins-slave/maven-interceptor.jar 47735 /home/jenkins/jenkins-slave/maven2.1-interceptor.jar
<===[JENKINS REMOTING CAPACITY]===>   channel started
log4j:WARN No appenders could be found for logger (org.apache.commons.beanutils.converters.BooleanConverter).
log4j:WARN Please initialize the log4j system properly.
Executing Maven:  -B -f <https://builds.apache.org/job/OpenJPA-trunk-deploy/ws/trunk/pom.xml>
-Dmaven.repo.local=/home/jenkins/jenkins-slave/maven-repositories/0 clean deploy
[INFO] Scanning for projects...
[INFO] Reactor build order: 
[INFO]   OpenJPA Parent POM
[INFO]   OpenJPA Utilities Library
[INFO]   OpenJPA Kernel
[INFO]   OpenJPA JDBC
[INFO]   OpenJPA Persistence
[INFO]   OpenJPA Persistence JDBC
[INFO]   OpenJPA Persistence Locking Tests
[INFO]   OpenJPA tools
[INFO]   OpenJPA Maven Plugin
[INFO]   OpenJPA XML Store
[INFO]   OpenJPA Slice
[INFO]   OpenJPA JEST
[INFO]   OpenJPA Aggregate Jar
[INFO]   OpenJPA Aggregate Jar with Dependencies
[INFO]   OpenJPA Project Docs and Assemblies
[INFO]   OpenJPA Examples
[INFO]   OpenJPA Examples - Simple
[INFO]   OpenJPA Examples - image-gallery
[INFO]   OpenJPA Examples - OpenBooks
[INFO]   OpenJPA Integration Tests
[INFO]   OpenJPA Integration Tests - Daytrader
[INFO]   OpenJPA Integration Tests - Examples
[INFO]   OpenJPA Integration Tests - SLF4JLogFactory
[INFO]   OpenJPA Integration Tests - JPA TCK
[INFO]   OpenJPA Integration Tests - Bean Validation
[INFO]   OpenJPA Integration Tests - JMX Platform MBeans
[INFO]   OpenJPA Fetching Statistic Tool
[INFO]   OpenJPA Fetching Statistic Tool -- WAS Bundle
[INFO] ------------------------------------------------------------------------
[INFO] Building OpenJPA Parent POM
[INFO]    task-segment: [clean, deploy]
[INFO] ------------------------------------------------------------------------
[INFO] [clean:clean {execution: default-clean}]
[INFO] [buildnumber:create {execution: default}]
[INFO] Checking for local modifications: skipped.
[INFO] Updating project files from SCM: skipped.
[INFO] Executing: /bin/sh -c cd <https://builds.apache.org/job/OpenJPA-trunk-deploy/ws/trunk>
&& svn --non-interactive info
[INFO] Working directory: <https://builds.apache.org/job/OpenJPA-trunk-deploy/ws/trunk>
[INFO] Storing buildNumber: 1545100 at timestamp: November 25, 2013 at 10:50 AM
[INFO] Executing: /bin/sh -c cd <https://builds.apache.org/job/OpenJPA-trunk-deploy/ws/trunk>
&& svn --non-interactive info
[INFO] Working directory: <https://builds.apache.org/job/OpenJPA-trunk-deploy/ws/trunk>
[INFO] Storing buildScmBranch: trunk
[INFO] [enforcer:enforce {execution: default}]
Setting property: classpath.resource.loader.class => 'org.codehaus.plexus.velocity.ContextClassLoaderResourceLoader'.
Setting property: site.resource.loader.class => 'org.codehaus.plexus.velocity.SiteResourceLoader'.
Setting property: velocimacro.messages.on => 'false'.
Setting property: resource.loader => 'classpath,site'.
Setting property: runtime.log.invalid.references => 'false'.
Setting property: resource.manager.logwhenfound => 'false'.
Setting property: classpath.resource.loader.class => 'org.codehaus.plexus.velocity.ContextClassLoaderResourceLoader'.
Setting property: site.resource.loader.class => 'org.codehaus.plexus.velocity.SiteResourceLoader'.
Setting property: velocimacro.messages.on => 'false'.
Setting property: resource.loader => 'classpath,site'.
Setting property: runtime.log.invalid.references => 'false'.
Setting property: resource.manager.logwhenfound => 'false'.
Setting property: velocimacro.permissions.allow.inline.to.replace.global => 'true'.
[INFO] [checkstyle:checkstyle {execution: default}]
[INFO] Setting property: classpath.resource.loader.class => 'org.codehaus.plexus.velocity.ContextClassLoaderResourceLoader'.
[INFO] Setting property: velocimacro.messages.on => 'false'.
[INFO] Setting property: resource.loader => 'classpath'.
[INFO] Setting property: resource.manager.logwhenfound => 'false'.
[INFO] [remote-resources:process {execution: default}]
[INFO] [compiler:testCompile {execution: test-source-compile}]
[INFO] No sources to compile
[INFO] [site:attach-descriptor {execution: default-attach-descriptor}]
[INFO] Unable to load parent project from a relative path: Could not find the model file '<https://builds.apache.org/job/OpenJPA-trunk-deploy/ws/pom.xml'.>
for project unknown
[INFO] Parent project loaded from repository.
[INFO] [ianal:verify-legal-files {execution: default}]
[INFO] [apache-rat:check {execution: default}]
[INFO] Exclude: **/.*/**
[INFO] Exclude: **/target/**/*
[INFO] [install:install {execution: default-install}]
[INFO] Installing <https://builds.apache.org/job/OpenJPA-trunk-deploy/ws/trunk/pom.xml>
to /home/jenkins/jenkins-slave/maven-repositories/0/org/apache/openjpa/openjpa-parent/2.4.0-SNAPSHOT/openjpa-parent-2.4.0-SNAPSHOT.pom
[INFO] [deploy:deploy {execution: default-deploy}]
[INFO] Retrieving previous build number from apache.snapshots.https
[WARNING] *** CHECKSUM FAILED - Checksum failed on download: local = 'd3744ed03c471fdd5d1b72a4a5bf0b2d38a2648d';
remote = '5222fc59af490ce12df302c439f30b766a013d32' - RETRYING
[WARNING] *** CHECKSUM FAILED - Checksum failed on download: local = 'd3744ed03c471fdd5d1b72a4a5bf0b2d38a2648d';
remote = '5222fc59af490ce12df302c439f30b766a013d32' - IGNORING
Uploading: https://repository.apache.org/content/repositories/snapshots/org/apache/openjpa/openjpa-parent/2.4.0-SNAPSHOT/openjpa-parent-2.4.0-20131125.105110-7.pom
52K uploaded  (openjpa-parent-2.4.0-20131125.105110-7.pom)
[INFO] Uploading site descriptor for openjpa-parent 2.4.0-20131125.105110-7 site.xml
[INFO] Retrieving previous metadata from apache.snapshots.https
[INFO] Uploading repository metadata for: 'artifact org.apache.openjpa:openjpa-parent'
[INFO] Retrieving previous metadata from apache.snapshots.https
[WARNING] *** CHECKSUM FAILED - Checksum failed on download: local = 'd3744ed03c471fdd5d1b72a4a5bf0b2d38a2648d';
remote = '5222fc59af490ce12df302c439f30b766a013d32' - RETRYING
[WARNING] *** CHECKSUM FAILED - Checksum failed on download: local = 'd3744ed03c471fdd5d1b72a4a5bf0b2d38a2648d';
remote = '5222fc59af490ce12df302c439f30b766a013d32' - IGNORING
[INFO] Uploading repository metadata for: 'snapshot org.apache.openjpa:openjpa-parent:2.4.0-SNAPSHOT'
[INFO] ------------------------------------------------------------------------
[INFO] Building OpenJPA Utilities Library
[INFO]    task-segment: [clean, deploy]
[INFO] ------------------------------------------------------------------------
[INFO] [clean:clean {execution: default-clean}]
[INFO] [buildnumber:create {execution: default}]
[INFO] [enforcer:enforce {execution: default}]
[INFO] [checkstyle:checkstyle {execution: default}]
[INFO] Starting audit...
Audit done.

[WARNING] Unable to locate Source XRef to link to - DISABLED
[ERROR] VM #image: error : too few arguments to macro. Wanted 5 got 0
[ERROR] VM #image: error : too few arguments to macro. Wanted 5 got 0
[ERROR] VM #displayTree: error : too few arguments to macro. Wanted 2 got 0
[ERROR] VM #menuItem: error : too few arguments to macro. Wanted 1 got 0
[INFO] [remote-resources:process {execution: default}]
[INFO] [resources:resources {execution: default-resources}]
[INFO] Using 'UTF-8' encoding to copy filtered resources.
[INFO] Copying 9 resources
[INFO] Copying 3 resources
[INFO] [compiler:compile {execution: default-compile}]
[INFO] Compiling 161 source files to <https://builds.apache.org/job/OpenJPA-trunk-deploy/ws/trunk/openjpa-lib/target/classes>
[INFO] -------------------------------------------------------------
[ERROR] COMPILATION ERROR : 
[INFO] -------------------------------------------------------------
[ERROR] Failure executing javac, but could not parse the error:
javac: invalid target release: 1.7
Usage: javac <options> <source files>
use -help for a list of possible options

[INFO] 1 error
[INFO] -------------------------------------------------------------
[INFO] ------------------------------------------------------------------------
[ERROR] BUILD FAILURE
[INFO] ------------------------------------------------------------------------
[INFO] Compilation failure
Failure executing javac, but could not parse the error:
javac: invalid target release: 1.7
Usage: javac <options> <source files>
use -help for a list of possible options


[INFO] ------------------------------------------------------------------------
[INFO] For more information, run Maven with the -e switch
[INFO] ------------------------------------------------------------------------
[INFO] Total time: 2 minutes 43 seconds
[INFO] Finished at: Mon Nov 25 10:53:34 UTC 2013
[INFO] Final Memory: 62M/414M
[INFO] ------------------------------------------------------------------------
[JENKINS] Archiving <https://builds.apache.org/job/OpenJPA-trunk-deploy/ws/trunk/openjpa-lib/pom.xml>
to org.apache.openjpa/openjpa-lib/2.4.0-SNAPSHOT/openjpa-lib-2.4.0-SNAPSHOT.pom
[JENKINS] Archiving <https://builds.apache.org/job/OpenJPA-trunk-deploy/ws/trunk/pom.xml>
to org.apache.openjpa/openjpa-parent/2.4.0-SNAPSHOT/openjpa-parent-2.4.0-SNAPSHOT.pom
[JENKINS] Archiving /home/jenkins/jenkins-slave/maven-repositories/0/org/apache/openjpa/openjpa-parent/2.4.0-SNAPSHOT/openjpa-parent-2.4.0-SNAPSHOT.pom
to org.apache.openjpa/openjpa-parent/2.4.0-20131125.105110-7/openjpa-parent-2.4.0-20131125.105110-7.pom
/x1/jenkins/jenkins-slave/maven-repositories/0/org/apache/openjpa/openjpa-parent/2.4.0-SNAPSHOT/openjpa-parent-2.4.0-SNAPSHOT.pom
is not inside /x1/jenkins/jenkins-slave/workspace/OpenJPA-trunk-deploy/trunk/; will archive
in a separate pass
Sending e-mails to: commits@openjpa.apache.org null@apache.org
channel stopped

Mime
View raw message