openjpa-commits mailing list archives

Site index · List index
Message view « Date » · « Thread »
Top « Date » · « Thread »
From Apache Jenkins Server <jenk...@builds.apache.org>
Subject Build failed in Jenkins: OpenJPA-trunk #921
Date Fri, 13 Dec 2013 15:03:41 GMT
See <https://builds.apache.org/job/OpenJPA-trunk/921/changes>

Changes:

[curtisr7] OPENJPA-2466: Fix checkstyle problem.

------------------------------------------
[...truncated 5985 lines...]
AU        openjpa-kernel/src/main/java/org/apache/openjpa/util/UnsupportedException.java
AU        openjpa-kernel/src/main/java/org/apache/openjpa/util/OpenJPAId.java
AU        openjpa-kernel/src/main/java/org/apache/openjpa/util/ExceptionInfo.java
AU        openjpa-kernel/src/main/java/org/apache/openjpa/util/OpenJPAException.java
AU        openjpa-kernel/src/main/java/org/apache/openjpa/util/Serialization.java
AU        openjpa-kernel/src/main/java/org/apache/openjpa/util/ReferentialIntegrityException.java
AU        openjpa-kernel/src/main/java/org/apache/openjpa/util/DelayedPriorityQueueProxy.java
AU        openjpa-kernel/src/main/java/org/apache/openjpa/util/Exceptions.java
AU        openjpa-kernel/src/main/java/org/apache/openjpa/util/WrappedException.java
AU        openjpa-kernel/src/main/java/org/apache/openjpa/util/ArrayStateImage.java
AU        openjpa-kernel/src/main/java/org/apache/openjpa/util/AbstractChangeTracker.java
AU        openjpa-kernel/src/main/java/org/apache/openjpa/util/DoubleId.java
AU        openjpa-kernel/src/main/java/org/apache/openjpa/util/Proxies.java
AU        openjpa-kernel/src/main/java/org/apache/openjpa/util/InternalException.java
AU        openjpa-kernel/src/main/java/org/apache/openjpa/util/BigDecimalId.java
AU        openjpa-kernel/src/main/java/org/apache/openjpa/util/ProxyManagerImpl.java
AU        openjpa-kernel/src/main/java/org/apache/openjpa/util/LRSProxy.java
AU        openjpa-kernel/src/main/java/org/apache/openjpa/util/ApplicationIds.java
AU        openjpa-kernel/src/main/java/org/apache/openjpa/util/DelayedArrayListProxy.java
AU        openjpa-kernel/src/main/java/org/apache/openjpa/util/ClassResolverImpl.java
AU        openjpa-kernel/src/main/java/org/apache/openjpa/util/StoreException.java
AU        openjpa-kernel/src/main/java/org/apache/openjpa/util/ProxyManager.java
AU        openjpa-kernel/src/main/java/org/apache/openjpa/util/GeneratedClasses.java
AU        openjpa-kernel/src/main/java/org/apache/openjpa/util/ProxyDate.java
AU        openjpa-kernel/src/main/java/org/apache/openjpa/util/ProxyMap.java
AU        openjpa-kernel/src/main/java/org/apache/openjpa/util/MapChangeTrackerImpl.java
AU        openjpa-kernel/src/main/java/org/apache/openjpa/util/Proxy.java
AU        openjpa-kernel/src/main/java/org/apache/openjpa/util/ObjectExistsException.java
AU        openjpa-kernel/src/main/java/org/apache/openjpa/util/ClassResolver.java
AU        openjpa-kernel/src/main/java/org/apache/openjpa/util/MultiLoaderClassResolver.java
AU        openjpa-kernel/src/main/java/org/apache/openjpa/util/NoResultException.java
AU        openjpa-kernel/src/main/java/org/apache/openjpa/util/CharId.java
AU        openjpa-kernel/src/main/java/org/apache/openjpa/util/DateId.java
AU        openjpa-kernel/src/main/java/org/apache/openjpa/util/BigIntegerId.java
AU        openjpa-kernel/src/main/java/org/apache/openjpa/util/BooleanId.java
AU        openjpa-kernel/src/main/java/org/apache/openjpa/util/Id.java
AU        openjpa-kernel/src/main/java/org/apache/openjpa/util/DelayedLinkedListProxy.java
AU        openjpa-kernel/src/main/java/org/apache/openjpa/util/DelayedVectorProxy.java
AU        openjpa-kernel/src/main/java/org/apache/openjpa/util/MapChangeTracker.java
AU        openjpa-kernel/src/main/java/org/apache/openjpa/util/ChangeTracker.java
AU        openjpa-kernel/src/main/java/org/apache/openjpa/util/ImplHelper.java
AU        openjpa-kernel/src/main/java/org/apache/openjpa/util/ObjectNotFoundException.java
AU        openjpa-kernel/src/main/java/org/apache/openjpa/util/OptimisticException.java
AU        openjpa-kernel/src/main/java/org/apache/openjpa/util/ProxyConcurrentMaps.java
AU        openjpa-kernel/src/main/java/org/apache/openjpa/util/InvalidStateException.java
A         openjpa-kernel/src/main/jjtree
A         openjpa-kernel/src/main/jjtree/org
A         openjpa-kernel/src/main/jjtree/org/apache
A         openjpa-kernel/src/main/jjtree/org/apache/openjpa
A         openjpa-kernel/src/main/jjtree/org/apache/openjpa/kernel
A         openjpa-kernel/src/main/jjtree/org/apache/openjpa/kernel/jpql
A         openjpa-kernel/src/main/jjtree/org/apache/openjpa/kernel/jpql/JPQL.jjt
AU        openjpa-kernel/src/main/jjtree/org/apache/openjpa/kernel/jpql/ParseException.java
A         openjpa-kernel/src/main/appended-resources
A         openjpa-kernel/src/main/appended-resources/META-INF
AU        openjpa-kernel/src/main/appended-resources/META-INF/NOTICE.vm
A         openjpa-kernel/src/main/resources
A         openjpa-kernel/src/main/resources/META-INF
A         openjpa-kernel/src/main/resources/META-INF/services
A         openjpa-kernel/src/main/resources/META-INF/services/org.apache.openjpa.kernel.exps.ExpressionParser
A         openjpa-kernel/src/main/resources/org
A         openjpa-kernel/src/main/resources/org/apache
A         openjpa-kernel/src/main/resources/org/apache/openjpa
A         openjpa-kernel/src/main/resources/org/apache/openjpa/ee
AU        openjpa-kernel/src/main/resources/org/apache/openjpa/ee/localizer.properties
A         openjpa-kernel/src/main/resources/org/apache/openjpa/datacache
AU        openjpa-kernel/src/main/resources/org/apache/openjpa/datacache/localizer.properties
A         openjpa-kernel/src/main/resources/org/apache/openjpa/util
AU        openjpa-kernel/src/main/resources/org/apache/openjpa/util/localizer.properties
A         openjpa-kernel/src/main/resources/org/apache/openjpa/abstractstore
AU        openjpa-kernel/src/main/resources/org/apache/openjpa/abstractstore/localizer.properties
A         openjpa-kernel/src/main/resources/org/apache/openjpa/kernel
A         openjpa-kernel/src/main/resources/org/apache/openjpa/kernel/jpql
AU        openjpa-kernel/src/main/resources/org/apache/openjpa/kernel/jpql/localizer.properties
A         openjpa-kernel/src/main/resources/org/apache/openjpa/kernel/exps
AU        openjpa-kernel/src/main/resources/org/apache/openjpa/kernel/exps/localizer.properties
AU        openjpa-kernel/src/main/resources/org/apache/openjpa/kernel/localizer.properties
A         openjpa-kernel/src/main/resources/org/apache/openjpa/enhance
AU        openjpa-kernel/src/main/resources/org/apache/openjpa/enhance/localizer.properties
A         openjpa-kernel/src/main/resources/org/apache/openjpa/event
AU        openjpa-kernel/src/main/resources/org/apache/openjpa/event/localizer.properties
A         openjpa-kernel/src/main/resources/org/apache/openjpa/ant
AU        openjpa-kernel/src/main/resources/org/apache/openjpa/ant/localizer.properties
AU        openjpa-kernel/src/main/resources/org/apache/openjpa/ant/antlib.xml
A         openjpa-kernel/src/main/resources/org/apache/openjpa/instrumentation
A         openjpa-kernel/src/main/resources/org/apache/openjpa/instrumentation/jmx
AU        openjpa-kernel/src/main/resources/org/apache/openjpa/instrumentation/jmx/localizer.properties
A         openjpa-kernel/src/main/resources/org/apache/openjpa/conf
AU        openjpa-kernel/src/main/resources/org/apache/openjpa/conf/localizer.properties
A         openjpa-kernel/src/main/resources/org/apache/openjpa/meta
AU        openjpa-kernel/src/main/resources/org/apache/openjpa/meta/localizer.properties
A         openjpa-kernel/internal-repository
A         openjpa-kernel/internal-repository/com
A         openjpa-kernel/internal-repository/com/ibm
A         openjpa-kernel/internal-repository/com/ibm/websphere
A         openjpa-kernel/internal-repository/com/ibm/websphere/websphere_uow_api
AU        openjpa-kernel/internal-repository/com/ibm/websphere/websphere_uow_api/maven-metadata.xml
A         openjpa-kernel/internal-repository/com/ibm/websphere/websphere_uow_api/maven-metadata.xml.md5
A         openjpa-kernel/internal-repository/com/ibm/websphere/websphere_uow_api/0.0.1
AU        openjpa-kernel/internal-repository/com/ibm/websphere/websphere_uow_api/0.0.1/websphere_uow_api-0.0.1.jar
A         openjpa-kernel/internal-repository/com/ibm/websphere/websphere_uow_api/0.0.1/websphere_uow_api-0.0.1.pom.md5
A         openjpa-kernel/internal-repository/com/ibm/websphere/websphere_uow_api/0.0.1/websphere_uow_api-0.0.1.jar.md5
A         openjpa-kernel/internal-repository/com/ibm/websphere/websphere_uow_api/0.0.1/websphere_uow_api-0.0.1.pom.sha1
A         openjpa-kernel/internal-repository/com/ibm/websphere/websphere_uow_api/0.0.1/websphere_uow_api-0.0.1.jar.sha1
AU        openjpa-kernel/internal-repository/com/ibm/websphere/websphere_uow_api/0.0.1/websphere_uow_api-0.0.1.pom
A         openjpa-kernel/internal-repository/com/ibm/websphere/websphere_uow_api/maven-metadata.xml.sha1
AU        openjpa-kernel/pom.xml
 U        .
At revision 1550745
Parsing POMs
maven-agent.jar already up to date
classworlds.jar already up to date
maven-interceptor.jar already up to date
maven2.1-interceptor.jar already up to date
[trunk] $ /home/hudson/tools/java/latest1.6/bin/java -Xmx1280m -XX:MaxPermSize=512m -cp /home/jenkins/jenkins-slave/maven-agent.jar:/home/jenkins/jenkins-slave/classworlds.jar
hudson.maven.agent.Main /home/hudson/tools/maven/apache-maven-2.2.1 /home/jenkins/jenkins-slave/slave.jar
/home/jenkins/jenkins-slave/maven-interceptor.jar 45337 /home/jenkins/jenkins-slave/maven2.1-interceptor.jar
<===[JENKINS REMOTING CAPACITY]===>channel started
   log4j:WARN No appenders could be found for logger (org.apache.commons.beanutils.converters.BooleanConverter).
log4j:WARN Please initialize the log4j system properly.
Executing Maven:  -B -f <https://builds.apache.org/job/OpenJPA-trunk/ws/trunk/pom.xml>
-Dmaven.repo.local=/home/jenkins/jenkins-slave/maven-repositories/1 clean install
[INFO] Scanning for projects...
[INFO] Reactor build order: 
[INFO]   OpenJPA Parent POM
[INFO]   OpenJPA Utilities Library
[INFO]   OpenJPA Kernel
[INFO]   OpenJPA JDBC
[INFO]   OpenJPA Persistence
[INFO]   OpenJPA Persistence JDBC
[INFO]   OpenJPA Persistence Locking Tests
[INFO]   OpenJPA tools
[INFO]   OpenJPA Maven Plugin
[INFO]   OpenJPA XML Store
[INFO]   OpenJPA Slice
[INFO]   OpenJPA JEST
[INFO]   OpenJPA Aggregate Jar
[INFO]   OpenJPA Aggregate Jar with Dependencies
[INFO]   OpenJPA Project Docs and Assemblies
[INFO]   OpenJPA Examples
[INFO]   OpenJPA Examples - Simple
[INFO]   OpenJPA Examples - image-gallery
[INFO]   OpenJPA Examples - OpenBooks
[INFO]   OpenJPA Integration Tests
[INFO]   OpenJPA Integration Tests - Daytrader
[INFO]   OpenJPA Integration Tests - Examples
[INFO]   OpenJPA Integration Tests - SLF4JLogFactory
[INFO]   OpenJPA Integration Tests - JPA TCK
[INFO]   OpenJPA Integration Tests - Bean Validation
[INFO]   OpenJPA Integration Tests - JMX Platform MBeans
[INFO]   OpenJPA Fetching Statistic Tool
[INFO]   OpenJPA Fetching Statistic Tool -- WAS Bundle
[INFO] ------------------------------------------------------------------------
[INFO] Building OpenJPA Parent POM
[INFO]    task-segment: [clean, install]
[INFO] ------------------------------------------------------------------------
[INFO] [clean:clean {execution: default-clean}]
[INFO] [buildnumber:create {execution: default}]
[INFO] Checking for local modifications: skipped.
[INFO] Updating project files from SCM: skipped.
[INFO] Executing: /bin/sh -c cd <https://builds.apache.org/job/OpenJPA-trunk/ws/trunk>
&& svn --non-interactive info
[INFO] Working directory: <https://builds.apache.org/job/OpenJPA-trunk/ws/trunk>
[INFO] Storing buildNumber: 1550731 at timestamp: December 13, 2013 at 2:58 PM
[INFO] Executing: /bin/sh -c cd <https://builds.apache.org/job/OpenJPA-trunk/ws/trunk>
&& svn --non-interactive info
[INFO] Working directory: <https://builds.apache.org/job/OpenJPA-trunk/ws/trunk>
[INFO] Storing buildScmBranch: trunk
[INFO] [enforcer:enforce {execution: default}]
Setting property: classpath.resource.loader.class => 'org.codehaus.plexus.velocity.ContextClassLoaderResourceLoader'.
Setting property: site.resource.loader.class => 'org.codehaus.plexus.velocity.SiteResourceLoader'.
Setting property: velocimacro.messages.on => 'false'.
Setting property: resource.loader => 'classpath,site'.
Setting property: runtime.log.invalid.references => 'false'.
Setting property: resource.manager.logwhenfound => 'false'.
Setting property: classpath.resource.loader.class => 'org.codehaus.plexus.velocity.ContextClassLoaderResourceLoader'.
Setting property: site.resource.loader.class => 'org.codehaus.plexus.velocity.SiteResourceLoader'.
Setting property: velocimacro.messages.on => 'false'.
Setting property: resource.loader => 'classpath,site'.
Setting property: runtime.log.invalid.references => 'false'.
Setting property: resource.manager.logwhenfound => 'false'.
Setting property: velocimacro.permissions.allow.inline.to.replace.global => 'true'.
[INFO] [checkstyle:checkstyle {execution: default}]
[INFO] Setting property: classpath.resource.loader.class => 'org.codehaus.plexus.velocity.ContextClassLoaderResourceLoader'.
[INFO] Setting property: velocimacro.messages.on => 'false'.
[INFO] Setting property: resource.loader => 'classpath'.
[INFO] Setting property: resource.manager.logwhenfound => 'false'.
[INFO] [remote-resources:process {execution: default}]
[INFO] [compiler:testCompile {execution: test-source-compile}]
[INFO] No sources to compile
[INFO] [site:attach-descriptor {execution: default-attach-descriptor}]
[INFO] Unable to load parent project from a relative path: Could not find the model file '<https://builds.apache.org/job/OpenJPA-trunk/ws/pom.xml'.>
for project unknown
[INFO] Parent project loaded from repository.
[INFO] [ianal:verify-legal-files {execution: default}]
[INFO] [apache-rat:check {execution: default}]
[INFO] Exclude: **/.*/**
[INFO] Exclude: **/target/**/*
[INFO] [install:install {execution: default-install}]
[INFO] Installing <https://builds.apache.org/job/OpenJPA-trunk/ws/trunk/pom.xml> to
/home/jenkins/jenkins-slave/maven-repositories/1/org/apache/openjpa/openjpa-parent/2.4.0-SNAPSHOT/openjpa-parent-2.4.0-SNAPSHOT.pom
[INFO] ------------------------------------------------------------------------
[INFO] Building OpenJPA Utilities Library
[INFO]    task-segment: [clean, install]
[INFO] ------------------------------------------------------------------------
[INFO] [clean:clean {execution: default-clean}]
[INFO] [buildnumber:create {execution: default}]
[INFO] [enforcer:enforce {execution: default}]
[INFO] [checkstyle:checkstyle {execution: default}]
[INFO] Starting audit...
Audit done.

[WARNING] Unable to locate Source XRef to link to - DISABLED
[ERROR] VM #image: error : too few arguments to macro. Wanted 5 got 0
[ERROR] VM #image: error : too few arguments to macro. Wanted 5 got 0
[ERROR] VM #displayTree: error : too few arguments to macro. Wanted 2 got 0
[ERROR] VM #menuItem: error : too few arguments to macro. Wanted 1 got 0
[INFO] [remote-resources:process {execution: default}]
[INFO] [resources:resources {execution: default-resources}]
[INFO] Using 'UTF-8' encoding to copy filtered resources.
[INFO] Copying 9 resources
[INFO] Copying 3 resources
[INFO] [compiler:compile {execution: default-compile}]
[INFO] Compiling 161 source files to <https://builds.apache.org/job/OpenJPA-trunk/ws/trunk/openjpa-lib/target/classes>
[INFO] -------------------------------------------------------------
[ERROR] COMPILATION ERROR : 
[INFO] -------------------------------------------------------------
[ERROR] Failure executing javac, but could not parse the error:
javac: invalid target release: 1.7
Usage: javac <options> <source files>
use -help for a list of possible options

[INFO] 1 error
[INFO] -------------------------------------------------------------
[INFO] ------------------------------------------------------------------------
[ERROR] BUILD FAILURE
[INFO] ------------------------------------------------------------------------
[INFO] Compilation failure
Failure executing javac, but could not parse the error:
javac: invalid target release: 1.7
Usage: javac <options> <source files>
use -help for a list of possible options


[INFO] ------------------------------------------------------------------------
[INFO] For more information, run Maven with the -e switch
[INFO] ------------------------------------------------------------------------
[INFO] Total time: 1 minute 4 seconds
[INFO] Finished at: Fri Dec 13 14:59:11 UTC 2013
[INFO] Final Memory: 58M/283M
[INFO] ------------------------------------------------------------------------
[JENKINS] Archiving <https://builds.apache.org/job/OpenJPA-trunk/ws/trunk/openjpa-lib/pom.xml>
to org.apache.openjpa/openjpa-lib/2.4.0-SNAPSHOT/openjpa-lib-2.4.0-SNAPSHOT.pom
[JENKINS] Archiving /home/jenkins/jenkins-slave/maven-repositories/1/org/apache/openjpa/openjpa-parent/2.4.0-SNAPSHOT/openjpa-parent-2.4.0-SNAPSHOT.pom
to org.apache.openjpa/openjpa-parent/2.4.0-SNAPSHOT/openjpa-parent-2.4.0-SNAPSHOT.pom
/home/jenkins/jenkins-slave/maven-repositories/1/org/apache/openjpa/openjpa-parent/2.4.0-SNAPSHOT/openjpa-parent-2.4.0-SNAPSHOT.pom
is not inside <https://builds.apache.org/job/OpenJPA-trunk/ws/trunk/;> will archive
in a separate pass
Sending e-mails to: commits@openjpa.apache.org null@apache.org
channel stopped

Mime
View raw message