openjpa-commits mailing list archives

Site index · List index
Message view « Date » · « Thread »
Top « Date » · « Thread »
From Apache Jenkins Server <jenk...@builds.apache.org>
Subject Build failed in Jenkins: OpenJPA-trunk-deploy #432
Date Fri, 13 Dec 2013 08:28:27 GMT
See <https://builds.apache.org/job/OpenJPA-trunk-deploy/432/changes>

Changes:

[curtisr7] OPENJPA-2466: Update ReverseMappingTool to optionally write generated class to
a String.

------------------------------------------
[...truncated 5999 lines...]
A         openjpa-examples/opentrader/src/main
A         openjpa-examples/opentrader/src/main/resources
A         openjpa-examples/opentrader/src/main/resources/images
AU        openjpa-examples/opentrader/src/main/resources/images/login.gif
AU        openjpa-examples/opentrader/src/main/resources/images/logo.gif
AU        openjpa-examples/opentrader/src/main/resources/OpenTrader.html
A         openjpa-examples/opentrader/src/main/resources/WEB-INF
AU        openjpa-examples/opentrader/src/main/resources/WEB-INF/web.xml
A         openjpa-examples/opentrader/src/main/resources/css
AU        openjpa-examples/opentrader/src/main/resources/css/OpenTrader.css
A         openjpa-examples/opentrader/src/main/resources/help
AU        openjpa-examples/opentrader/src/main/resources/help/MarketData.html
AU        openjpa-examples/opentrader/src/main/resources/help/Polling.html
A         openjpa-examples/opentrader/src/main/resources/META-INF
AU        openjpa-examples/opentrader/src/main/resources/META-INF/persistence.xml
A         openjpa-examples/opentrader/src/main/java
A         openjpa-examples/opentrader/src/main/java/org
A         openjpa-examples/opentrader/src/main/java/org/apache
A         openjpa-examples/opentrader/src/main/java/org/apache/openjpa
A         openjpa-examples/opentrader/src/main/java/org/apache/openjpa/trader
A         openjpa-examples/opentrader/src/main/java/org/apache/openjpa/trader/client
AU        openjpa-examples/opentrader/src/main/java/org/apache/openjpa/trader/client/MarketDataPanel.java
A         openjpa-examples/opentrader/src/main/java/org/apache/openjpa/trader/client/ui
AU        openjpa-examples/opentrader/src/main/java/org/apache/openjpa/trader/client/ui/HelpLink.java
AU        openjpa-examples/opentrader/src/main/java/org/apache/openjpa/trader/client/ui/ErrorDialog.java
AU        openjpa-examples/opentrader/src/main/java/org/apache/openjpa/trader/client/ui/ScrollableTable.java
AU        openjpa-examples/opentrader/src/main/java/org/apache/openjpa/trader/client/ui/FadeEffect.java
AU        openjpa-examples/opentrader/src/main/java/org/apache/openjpa/trader/client/ui/GridCellRenderer.java
AU        openjpa-examples/opentrader/src/main/java/org/apache/openjpa/trader/client/ui/ProgressMonitor.java
AU        openjpa-examples/opentrader/src/main/java/org/apache/openjpa/trader/client/ui/MessageBox.java
AU        openjpa-examples/opentrader/src/main/java/org/apache/openjpa/trader/client/OpenTradeImageBundle.java
AU        openjpa-examples/opentrader/src/main/java/org/apache/openjpa/trader/client/TradingWindow.java
AU        openjpa-examples/opentrader/src/main/java/org/apache/openjpa/trader/client/TradeHistoryPanel.java
A         openjpa-examples/opentrader/src/main/java/org/apache/openjpa/trader/client/event
AU        openjpa-examples/opentrader/src/main/java/org/apache/openjpa/trader/client/event/ServiceEventHandler.java
AU        openjpa-examples/opentrader/src/main/java/org/apache/openjpa/trader/client/event/ServiceEvent.java
AU        openjpa-examples/opentrader/src/main/java/org/apache/openjpa/trader/client/OpenTrader.java
AU        openjpa-examples/opentrader/src/main/java/org/apache/openjpa/trader/client/TradeOrderWindow.java
AU        openjpa-examples/opentrader/src/main/java/org/apache/openjpa/trader/client/MatchWindow.java
AU        openjpa-examples/opentrader/src/main/java/org/apache/openjpa/trader/client/FormatUtil.java
AU        openjpa-examples/opentrader/src/main/java/org/apache/openjpa/trader/client/LoginDialog.java
AU        openjpa-examples/opentrader/src/main/java/org/apache/openjpa/trader/client/ServerLogPanel.java
AU        openjpa-examples/opentrader/src/main/java/org/apache/openjpa/trader/client/TradingServiceAdapterAsync.java
AU        openjpa-examples/opentrader/src/main/java/org/apache/openjpa/trader/client/TradingServiceAdapter.java
A         openjpa-examples/opentrader/src/main/java/org/apache/openjpa/trader/override
A         openjpa-examples/opentrader/src/main/java/org/apache/openjpa/trader/override/org
A         openjpa-examples/opentrader/src/main/java/org/apache/openjpa/trader/override/org/apache
A         openjpa-examples/opentrader/src/main/java/org/apache/openjpa/trader/override/org/apache/openjpa
A         openjpa-examples/opentrader/src/main/java/org/apache/openjpa/trader/service
AU        openjpa-examples/opentrader/src/main/java/org/apache/openjpa/trader/service/MarketFeed.java
AU        openjpa-examples/opentrader/src/main/java/org/apache/openjpa/trader/service/TradingService.java
A         openjpa-examples/opentrader/src/main/java/org/apache/openjpa/trader/service/slice
AU        openjpa-examples/opentrader/src/main/java/org/apache/openjpa/trader/service/slice/SectorBasedQueryTargetPolicy.java
AU        openjpa-examples/opentrader/src/main/java/org/apache/openjpa/trader/service/slice/SectorDistributionPolicy.java
AU        openjpa-examples/opentrader/src/main/java/org/apache/openjpa/trader/service/TradeEvent.java
AU        openjpa-examples/opentrader/src/main/java/org/apache/openjpa/trader/service/Exchange.java
AU        openjpa-examples/opentrader/src/main/java/org/apache/openjpa/trader/service/MockTradingService.java
AU        openjpa-examples/opentrader/src/main/java/org/apache/openjpa/trader/service/BufferedLog.java
AU        openjpa-examples/opentrader/src/main/java/org/apache/openjpa/trader/service/PersistenceService.java
AU        openjpa-examples/opentrader/src/main/java/org/apache/openjpa/trader/OpenTrader.gwt.xml
A         openjpa-examples/opentrader/src/main/java/org/apache/openjpa/trader/server
AU        openjpa-examples/opentrader/src/main/java/org/apache/openjpa/trader/server/ExceptionAdapter.java
AU        openjpa-examples/opentrader/src/main/java/org/apache/openjpa/trader/server/TradingServiceAdapterImpl.java
A         openjpa-examples/opentrader/src/main/java/org/apache/openjpa/trader/domain
AU        openjpa-examples/opentrader/src/main/java/org/apache/openjpa/trader/domain/Match.java
AU        openjpa-examples/opentrader/src/main/java/org/apache/openjpa/trader/domain/Ask.java
AU        openjpa-examples/opentrader/src/main/java/org/apache/openjpa/trader/domain/Bid.java
AU        openjpa-examples/opentrader/src/main/java/org/apache/openjpa/trader/domain/Tradable.java
AU        openjpa-examples/opentrader/src/main/java/org/apache/openjpa/trader/domain/package.html
AU        openjpa-examples/opentrader/src/main/java/org/apache/openjpa/trader/domain/Sector.java
AU        openjpa-examples/opentrader/src/main/java/org/apache/openjpa/trader/domain/Trade.java
AU        openjpa-examples/opentrader/src/main/java/org/apache/openjpa/trader/domain/Trader.java
AU        openjpa-examples/opentrader/src/main/java/org/apache/openjpa/trader/domain/Stock.java
AU        openjpa-examples/opentrader/src/main/java/org/apache/openjpa/trader/domain/LogStatement.java
A         openjpa-examples/jest
AU        openjpa-examples/jest/README.html
A         openjpa-examples/jest/src
A         openjpa-examples/jest/src/main
A         openjpa-examples/jest/src/main/resources
A         openjpa-examples/jest/src/main/resources/META-INF
AU        openjpa-examples/jest/src/main/resources/META-INF/persistence.xml
A         openjpa-examples/jest/src/main/resources/demo
AU        openjpa-examples/jest/src/main/resources/demo/index.html
A         openjpa-examples/jest/src/main/resources/WEB-INF
AU        openjpa-examples/jest/src/main/resources/WEB-INF/web.xml
A         openjpa-examples/jest/src/main/java
A         openjpa-examples/jest/src/main/java/demo
AU        openjpa-examples/jest/src/main/java/demo/Actor.java
AU        openjpa-examples/jest/src/main/java/demo/SimpleApp.java
AU        openjpa-examples/jest/src/main/java/demo/Movie.java
AU        openjpa-examples/jest/src/main/java/demo/DataLoader.java
AU        openjpa-examples/jest/build.properties
AU        openjpa-examples/jest/build.xml
 U        .
At revision 1550663
Parsing POMs
maven-agent.jar already up to date
classworlds.jar already up to date
maven-interceptor.jar already up to date
maven2.1-interceptor.jar already up to date
[trunk] $ /home/hudson/tools/java/latest1.6/bin/java -Xmx1280m -XX:MaxPermSize=512m -cp /home/jenkins/jenkins-slave/maven-agent.jar:/home/jenkins/jenkins-slave/classworlds.jar
hudson.maven.agent.Main /home/hudson/tools/maven/apache-maven-2.2.1 /home/jenkins/jenkins-slave/slave.jar
/home/jenkins/jenkins-slave/maven-interceptor.jar 56060 /home/jenkins/jenkins-slave/maven2.1-interceptor.jar
<===[JENKINS REMOTING CAPACITY]===>channel started
   log4j:WARN No appenders could be found for logger (org.apache.commons.beanutils.converters.BooleanConverter).
log4j:WARN Please initialize the log4j system properly.
[INFO] Scanning for projects...
Executing Maven:  -B -f <https://builds.apache.org/job/OpenJPA-trunk-deploy/ws/trunk/pom.xml>
-Dmaven.repo.local=/home/jenkins/jenkins-slave/maven-repositories/0 clean deploy
[INFO] Reactor build order: 
[INFO]   OpenJPA Parent POM
[INFO]   OpenJPA Utilities Library
[INFO]   OpenJPA Kernel
[INFO]   OpenJPA JDBC
[INFO]   OpenJPA Persistence
[INFO]   OpenJPA Persistence JDBC
[INFO]   OpenJPA Persistence Locking Tests
[INFO]   OpenJPA tools
[INFO]   OpenJPA Maven Plugin
[INFO]   OpenJPA XML Store
[INFO]   OpenJPA Slice
[INFO]   OpenJPA JEST
[INFO]   OpenJPA Aggregate Jar
[INFO]   OpenJPA Aggregate Jar with Dependencies
[INFO]   OpenJPA Project Docs and Assemblies
[INFO]   OpenJPA Examples
[INFO]   OpenJPA Examples - Simple
[INFO]   OpenJPA Examples - image-gallery
[INFO]   OpenJPA Examples - OpenBooks
[INFO]   OpenJPA Integration Tests
[INFO]   OpenJPA Integration Tests - Daytrader
[INFO]   OpenJPA Integration Tests - Examples
[INFO]   OpenJPA Integration Tests - SLF4JLogFactory
[INFO]   OpenJPA Integration Tests - JPA TCK
[INFO]   OpenJPA Integration Tests - Bean Validation
[INFO]   OpenJPA Integration Tests - JMX Platform MBeans
[INFO]   OpenJPA Fetching Statistic Tool
[INFO]   OpenJPA Fetching Statistic Tool -- WAS Bundle
[INFO] ------------------------------------------------------------------------
[INFO] Building OpenJPA Parent POM
[INFO]    task-segment: [clean, deploy]
[INFO] ------------------------------------------------------------------------
[INFO] [clean:clean {execution: default-clean}]
[INFO] [buildnumber:create {execution: default}]
[INFO] Checking for local modifications: skipped.
[INFO] Updating project files from SCM: skipped.
[INFO] Executing: /bin/sh -c cd <https://builds.apache.org/job/OpenJPA-trunk-deploy/ws/trunk>
&& svn --non-interactive info
[INFO] Working directory: <https://builds.apache.org/job/OpenJPA-trunk-deploy/ws/trunk>
[INFO] Storing buildNumber: 1550626 at timestamp: December 13, 2013 at 8:26 AM
[INFO] Executing: /bin/sh -c cd <https://builds.apache.org/job/OpenJPA-trunk-deploy/ws/trunk>
&& svn --non-interactive info
[INFO] Working directory: <https://builds.apache.org/job/OpenJPA-trunk-deploy/ws/trunk>
[INFO] Storing buildScmBranch: trunk
[INFO] [enforcer:enforce {execution: default}]
Setting property: classpath.resource.loader.class => 'org.codehaus.plexus.velocity.ContextClassLoaderResourceLoader'.
Setting property: site.resource.loader.class => 'org.codehaus.plexus.velocity.SiteResourceLoader'.
Setting property: velocimacro.messages.on => 'false'.
Setting property: resource.loader => 'classpath,site'.
Setting property: runtime.log.invalid.references => 'false'.
Setting property: resource.manager.logwhenfound => 'false'.
Setting property: classpath.resource.loader.class => 'org.codehaus.plexus.velocity.ContextClassLoaderResourceLoader'.
Setting property: site.resource.loader.class => 'org.codehaus.plexus.velocity.SiteResourceLoader'.
Setting property: velocimacro.messages.on => 'false'.
Setting property: resource.loader => 'classpath,site'.
Setting property: runtime.log.invalid.references => 'false'.
Setting property: resource.manager.logwhenfound => 'false'.
Setting property: velocimacro.permissions.allow.inline.to.replace.global => 'true'.
[INFO] [checkstyle:checkstyle {execution: default}]
[INFO] Setting property: classpath.resource.loader.class => 'org.codehaus.plexus.velocity.ContextClassLoaderResourceLoader'.
[INFO] Setting property: velocimacro.messages.on => 'false'.
[INFO] Setting property: resource.loader => 'classpath'.
[INFO] Setting property: resource.manager.logwhenfound => 'false'.
[INFO] [remote-resources:process {execution: default}]
[INFO] [compiler:testCompile {execution: test-source-compile}]
[INFO] No sources to compile
[INFO] [site:attach-descriptor {execution: default-attach-descriptor}]
[INFO] Unable to load parent project from a relative path: Could not find the model file '<https://builds.apache.org/job/OpenJPA-trunk-deploy/ws/pom.xml'.>
for project unknown
[INFO] Parent project loaded from repository.
[INFO] [ianal:verify-legal-files {execution: default}]
[INFO] [apache-rat:check {execution: default}]
[INFO] Exclude: **/.*/**
[INFO] Exclude: **/target/**/*
[INFO] [install:install {execution: default-install}]
[INFO] Installing <https://builds.apache.org/job/OpenJPA-trunk-deploy/ws/trunk/pom.xml>
to /home/jenkins/jenkins-slave/maven-repositories/0/org/apache/openjpa/openjpa-parent/2.4.0-SNAPSHOT/openjpa-parent-2.4.0-SNAPSHOT.pom
[INFO] [deploy:deploy {execution: default-deploy}]
[INFO] Retrieving previous build number from apache.snapshots.https
[WARNING] *** CHECKSUM FAILED - Checksum failed on download: local = '343226c5b245aa2d72a5b9382d35fd2bbcfea96d';
remote = '500c5d976cc69664379429128639352ed471faf9' - RETRYING
[WARNING] *** CHECKSUM FAILED - Checksum failed on download: local = '343226c5b245aa2d72a5b9382d35fd2bbcfea96d';
remote = '500c5d976cc69664379429128639352ed471faf9' - IGNORING
Uploading: https://repository.apache.org/content/repositories/snapshots/org/apache/openjpa/openjpa-parent/2.4.0-SNAPSHOT/openjpa-parent-2.4.0-20131213.082720-8.pom
52K uploaded  (openjpa-parent-2.4.0-20131213.082720-8.pom)
[INFO] Uploading site descriptor for openjpa-parent 2.4.0-20131213.082720-8 site.xml
[INFO] Retrieving previous metadata from apache.snapshots.https
[INFO] Uploading repository metadata for: 'artifact org.apache.openjpa:openjpa-parent'
[INFO] Retrieving previous metadata from apache.snapshots.https
[WARNING] *** CHECKSUM FAILED - Checksum failed on download: local = '343226c5b245aa2d72a5b9382d35fd2bbcfea96d';
remote = '500c5d976cc69664379429128639352ed471faf9' - RETRYING
[WARNING] *** CHECKSUM FAILED - Checksum failed on download: local = '343226c5b245aa2d72a5b9382d35fd2bbcfea96d';
remote = '500c5d976cc69664379429128639352ed471faf9' - IGNORING
[INFO] Uploading repository metadata for: 'snapshot org.apache.openjpa:openjpa-parent:2.4.0-SNAPSHOT'
[INFO] ------------------------------------------------------------------------
[INFO] Building OpenJPA Utilities Library
[INFO]    task-segment: [clean, deploy]
[INFO] ------------------------------------------------------------------------
[INFO] [clean:clean {execution: default-clean}]
[INFO] [buildnumber:create {execution: default}]
[INFO] [enforcer:enforce {execution: default}]
[INFO] [checkstyle:checkstyle {execution: default}]
[INFO] Starting audit...
Audit done.

[WARNING] Unable to locate Source XRef to link to - DISABLED
[ERROR] VM #image: error : too few arguments to macro. Wanted 5 got 0
[ERROR] VM #image: error : too few arguments to macro. Wanted 5 got 0
[ERROR] VM #displayTree: error : too few arguments to macro. Wanted 2 got 0
[ERROR] VM #menuItem: error : too few arguments to macro. Wanted 1 got 0
[INFO] [remote-resources:process {execution: default}]
[INFO] [resources:resources {execution: default-resources}]
[INFO] Using 'UTF-8' encoding to copy filtered resources.
[INFO] Copying 9 resources
[INFO] Copying 3 resources
[INFO] [compiler:compile {execution: default-compile}]
[INFO] Compiling 161 source files to <https://builds.apache.org/job/OpenJPA-trunk-deploy/ws/trunk/openjpa-lib/target/classes>
[INFO] -------------------------------------------------------------
[ERROR] COMPILATION ERROR : 
[INFO] -------------------------------------------------------------
[ERROR] Failure executing javac, but could not parse the error:
javac: invalid target release: 1.7
Usage: javac <options> <source files>
use -help for a list of possible options

[INFO] 1 error
[INFO] -------------------------------------------------------------
[INFO] ------------------------------------------------------------------------
[ERROR] BUILD FAILURE
[INFO] ------------------------------------------------------------------------
[INFO] Compilation failure
Failure executing javac, but could not parse the error:
javac: invalid target release: 1.7
Usage: javac <options> <source files>
use -help for a list of possible options


[INFO] ------------------------------------------------------------------------
[INFO] For more information, run Maven with the -e switch
[INFO] ------------------------------------------------------------------------
[INFO] Total time: 49 seconds
[INFO] Finished at: Fri Dec 13 08:27:34 UTC 2013
[INFO] Final Memory: 62M/370M
[INFO] ------------------------------------------------------------------------
[JENKINS] Archiving <https://builds.apache.org/job/OpenJPA-trunk-deploy/ws/trunk/openjpa-lib/pom.xml>
to org.apache.openjpa/openjpa-lib/2.4.0-SNAPSHOT/openjpa-lib-2.4.0-SNAPSHOT.pom
[JENKINS] Archiving <https://builds.apache.org/job/OpenJPA-trunk-deploy/ws/trunk/pom.xml>
to org.apache.openjpa/openjpa-parent/2.4.0-SNAPSHOT/openjpa-parent-2.4.0-SNAPSHOT.pom
[JENKINS] Archiving /home/jenkins/jenkins-slave/maven-repositories/0/org/apache/openjpa/openjpa-parent/2.4.0-SNAPSHOT/openjpa-parent-2.4.0-SNAPSHOT.pom
to org.apache.openjpa/openjpa-parent/2.4.0-20131213.082720-8/openjpa-parent-2.4.0-20131213.082720-8.pom
/home/jenkins/jenkins-slave/maven-repositories/0/org/apache/openjpa/openjpa-parent/2.4.0-SNAPSHOT/openjpa-parent-2.4.0-SNAPSHOT.pom
is not inside <https://builds.apache.org/job/OpenJPA-trunk-deploy/ws/trunk/;> will archive
in a separate pass
Sending e-mails to: commits@openjpa.apache.org null@apache.org
channel stopped

Mime
View raw message