openjpa-commits mailing list archives

Site index · List index
Message view « Date » · « Thread »
Top « Date » · « Thread »
From Apache Jenkins Server <jenk...@builds.apache.org>
Subject Build failed in Jenkins: OpenJPA-trunk #926
Date Thu, 29 May 2014 17:53:26 GMT
See <https://builds.apache.org/job/OpenJPA-trunk/926/changes>

Changes:

[kwsutter] OPENJPA-2509.  Updated doc references from @MappedById to @MapsId.

------------------------------------------
[...truncated 6020 lines...]
AU        openjpa-persistence/src/main/java/org/apache/openjpa/persistence/RollbackException.java
AU        openjpa-persistence/src/main/java/org/apache/openjpa/persistence/QueryResultCacheImpl.java
AU        openjpa-persistence/src/main/java/org/apache/openjpa/persistence/TupleImpl.java
AU        openjpa-persistence/src/main/java/org/apache/openjpa/persistence/OptimisticLockException.java
AU        openjpa-persistence/src/main/java/org/apache/openjpa/persistence/PersistenceMetaDataFactory.java
AU        openjpa-persistence/src/main/java/org/apache/openjpa/persistence/PersistenceMetaDataDefaults.java
AU        openjpa-persistence/src/main/java/org/apache/openjpa/persistence/AnnotationPersistenceXMLMetaDataParser.java
AU        openjpa-persistence/src/main/java/org/apache/openjpa/persistence/KeyDependent.java
AU        openjpa-persistence/src/main/java/org/apache/openjpa/persistence/UpdateAction.java
A         openjpa-persistence/src/main/java/org/apache/openjpa/persistence/osgi
AU        openjpa-persistence/src/main/java/org/apache/openjpa/persistence/osgi/PersistenceActivator.java
AU        openjpa-persistence/src/main/java/org/apache/openjpa/persistence/osgi/BundleDelegatingClassLoader.java
AU        openjpa-persistence/src/main/java/org/apache/openjpa/persistence/osgi/BundleUtils.java
AU        openjpa-persistence/src/main/java/org/apache/openjpa/persistence/osgi/package.html
AU        openjpa-persistence/src/main/java/org/apache/openjpa/persistence/XMLPersistenceMetaDataParser.java
AU        openjpa-persistence/src/main/java/org/apache/openjpa/persistence/OpenJPAEntityManager.java
AU        openjpa-persistence/src/main/java/org/apache/openjpa/persistence/QueryImpl.java
AU        openjpa-persistence/src/main/java/org/apache/openjpa/persistence/QueryResultCache.java
AU        openjpa-persistence/src/main/java/org/apache/openjpa/persistence/QueryOperationType.java
AU        openjpa-persistence/src/main/java/org/apache/openjpa/persistence/ExtentImpl.java
AU        openjpa-persistence/src/main/java/org/apache/openjpa/persistence/MixedLockLevelsHelper.java
AU        openjpa-persistence/src/main/java/org/apache/openjpa/persistence/EntityExistsException.java
AU        openjpa-persistence/src/main/java/org/apache/openjpa/persistence/EntityManagerFactoryValue.java
AU        openjpa-persistence/src/main/java/org/apache/openjpa/persistence/DataCache.java
AU        openjpa-persistence/src/main/java/org/apache/openjpa/persistence/OpenJPAEntityTransaction.java
AU        openjpa-persistence/src/main/java/org/apache/openjpa/persistence/OpenJPAPersistenceUtil.java
AU        openjpa-persistence/src/main/java/org/apache/openjpa/persistence/ArgumentException.java
AU        openjpa-persistence/src/main/java/org/apache/openjpa/persistence/ParameterImpl.java
AU        openjpa-persistence/src/main/java/org/apache/openjpa/persistence/Extent.java
AU        openjpa-persistence/src/main/java/org/apache/openjpa/persistence/Factory.java
AU        openjpa-persistence/src/main/java/org/apache/openjpa/persistence/PersistenceStrategy.java
AU        openjpa-persistence/src/main/java/org/apache/openjpa/persistence/GeneratorImpl.java
A         openjpa-persistence/src/main/java/org/apache/openjpa/persistence/validation
AU        openjpa-persistence/src/main/java/org/apache/openjpa/persistence/validation/ValidatorImpl.java
AU        openjpa-persistence/src/main/java/org/apache/openjpa/persistence/validation/ValidationUtils.java
AU        openjpa-persistence/src/main/java/org/apache/openjpa/persistence/validation/TraversableResolverImpl.java
AU        openjpa-persistence/src/main/java/org/apache/openjpa/persistence/Externalizer.java
AU        openjpa-persistence/src/main/java/org/apache/openjpa/persistence/PersistentCollection.java
AU        openjpa-persistence/src/main/java/org/apache/openjpa/persistence/FetchAttribute.java
AU        openjpa-persistence/src/main/java/org/apache/openjpa/persistence/LockTimeoutException.java
AU        openjpa-persistence/src/main/java/org/apache/openjpa/persistence/MetaDataParsers.java
AU        openjpa-persistence/src/main/java/org/apache/openjpa/persistence/ElementDependent.java
AU        openjpa-persistence/src/main/java/org/apache/openjpa/persistence/AutoClearType.java
AU        openjpa-persistence/src/main/java/org/apache/openjpa/persistence/AnnotationBuilder.java
AU        openjpa-persistence/src/main/java/org/apache/openjpa/persistence/TupleFactory.java
AU        openjpa-persistence/src/main/java/org/apache/openjpa/persistence/OpenJPAQuery.java
AU        openjpa-persistence/src/main/java/org/apache/openjpa/persistence/PersistenceUnitInfoImpl.java
A         openjpa-persistence/src/main/java/org/apache/openjpa/persistence/criteria
AU        openjpa-persistence/src/main/java/org/apache/openjpa/persistence/criteria/OpenJPACriteriaQuery.java
AU        openjpa-persistence/src/main/java/org/apache/openjpa/persistence/criteria/RootImpl.java
AU        openjpa-persistence/src/main/java/org/apache/openjpa/persistence/criteria/SelectionImpl.java
AU        openjpa-persistence/src/main/java/org/apache/openjpa/persistence/criteria/CriteriaQueryImpl.java
AU        openjpa-persistence/src/main/java/org/apache/openjpa/persistence/criteria/CompoundSelections.java
AU        openjpa-persistence/src/main/java/org/apache/openjpa/persistence/criteria/package.html
AU        openjpa-persistence/src/main/java/org/apache/openjpa/persistence/criteria/PathImpl.java
AU        openjpa-persistence/src/main/java/org/apache/openjpa/persistence/criteria/ExpressionImpl.java
AU        openjpa-persistence/src/main/java/org/apache/openjpa/persistence/criteria/PredicateImpl.java
AU        openjpa-persistence/src/main/java/org/apache/openjpa/persistence/criteria/ParameterExpressionImpl.java
AU        openjpa-persistence/src/main/java/org/apache/openjpa/persistence/criteria/CriteriaExpression.java
AU        openjpa-persistence/src/main/java/org/apache/openjpa/persistence/criteria/Expressions.java
AU        openjpa-persistence/src/main/java/org/apache/openjpa/persistence/criteria/Joins.java
AU        openjpa-persistence/src/main/java/org/apache/openjpa/persistence/criteria/FromImpl.java
AU        openjpa-persistence/src/main/java/org/apache/openjpa/persistence/criteria/OpenJPACriteriaBuilder.java
AU        openjpa-persistence/src/main/java/org/apache/openjpa/persistence/criteria/FetchPathImpl.java
AU        openjpa-persistence/src/main/java/org/apache/openjpa/persistence/criteria/CriteriaExpressionBuilder.java
AU        openjpa-persistence/src/main/java/org/apache/openjpa/persistence/criteria/ComparisonStyle.java
AU        openjpa-persistence/src/main/java/org/apache/openjpa/persistence/criteria/CriteriaBuilderImpl.java
AU        openjpa-persistence/src/main/java/org/apache/openjpa/persistence/criteria/CompareByExample.java
AU        openjpa-persistence/src/main/java/org/apache/openjpa/persistence/criteria/OrderImpl.java
AU        openjpa-persistence/src/main/java/org/apache/openjpa/persistence/criteria/AliasContext.java
AU        openjpa-persistence/src/main/java/org/apache/openjpa/persistence/criteria/BindableParameter.java
AU        openjpa-persistence/src/main/java/org/apache/openjpa/persistence/criteria/SubqueryImpl.java
AU        openjpa-persistence/src/main/java/org/apache/openjpa/persistence/criteria/CriteriaExpressionVisitor.java
AU        openjpa-persistence/src/main/java/org/apache/openjpa/persistence/Generator.java
AU        openjpa-persistence/src/main/java/org/apache/openjpa/persistence/PersistenceExceptions.java
AU        openjpa-persistence/src/main/java/org/apache/openjpa/persistence/OpenJPAEntityManagerFactorySPI.java
AU        openjpa-persistence/src/main/java/org/apache/openjpa/persistence/QueryTimeoutException.java
AU        openjpa-persistence/src/main/java/org/apache/openjpa/persistence/AnnotationPersistenceMetaDataParser.java
AU        openjpa-persistence/src/main/java/org/apache/openjpa/persistence/JPAFacadeHelper.java
AU        openjpa-persistence/src/main/java/org/apache/openjpa/persistence/XMLPersistenceMetaDataSerializer.java
AU        openjpa-persistence/src/main/java/org/apache/openjpa/persistence/OpenJPAPersistence.java
AU        openjpa-persistence/src/main/java/org/apache/openjpa/persistence/ExternalValues.java
AU        openjpa-persistence/src/main/java/org/apache/openjpa/persistence/StoreCacheImpl.java
AU        openjpa-persistence/src/main/java/org/apache/openjpa/persistence/DataStoreId.java
AU        openjpa-persistence/src/main/java/org/apache/openjpa/persistence/PersistenceException.java
A         openjpa-persistence/src/main/appended-resources
A         openjpa-persistence/src/main/appended-resources/META-INF
AU        openjpa-persistence/src/main/appended-resources/META-INF/NOTICE.vm
AU        openjpa-persistence/src/main/appended-resources/META-INF/LICENSE.vm
AU        openjpa-persistence/pom.xml
 U        .
At revision 1598344
Parsing POMs
maven-agent.jar already up to date
classworlds.jar already up to date
maven-interceptor.jar already up to date
maven2.1-interceptor.jar already up to date
[trunk] $ /home/hudson/tools/java/latest1.6/bin/java -Xmx1280m -XX:MaxPermSize=512m -cp /home/jenkins/jenkins-slave/maven-agent.jar:/home/jenkins/jenkins-slave/classworlds.jar
hudson.maven.agent.Main /home/hudson/tools/maven/apache-maven-2.2.1 /home/jenkins/jenkins-slave/slave.jar
/home/jenkins/jenkins-slave/maven-interceptor.jar 55421 /home/jenkins/jenkins-slave/maven2.1-interceptor.jar
<===[JEchannel started
NKINS REMOTING CAPACITY]===>   log4j:WARN No appenders could be found for logger (org.apache.commons.beanutils.converters.BooleanConverter).
log4j:WARN Please initialize the log4j system properly.
Executing Maven:  -B -f <https://builds.apache.org/job/OpenJPA-trunk/ws/trunk/pom.xml>
-Dmaven.repo.local=/home/jenkins/jenkins-slave/maven-repositories/0 clean install
[INFO] Scanning for projects...
[INFO] Reactor build order: 
[INFO]   OpenJPA Parent POM
[INFO]   OpenJPA Utilities Library
[INFO]   OpenJPA Kernel
[INFO]   OpenJPA JDBC
[INFO]   OpenJPA Persistence
[INFO]   OpenJPA Persistence JDBC
[INFO]   OpenJPA Persistence Locking Tests
[INFO]   OpenJPA tools
[INFO]   OpenJPA Maven Plugin
[INFO]   OpenJPA XML Store
[INFO]   OpenJPA Slice
[INFO]   OpenJPA JEST
[INFO]   OpenJPA Aggregate Jar
[INFO]   OpenJPA Aggregate Jar with Dependencies
[INFO]   OpenJPA Project Docs and Assemblies
[INFO]   OpenJPA Examples
[INFO]   OpenJPA Examples - Simple
[INFO]   OpenJPA Examples - image-gallery
[INFO]   OpenJPA Examples - OpenBooks
[INFO]   OpenJPA Integration Tests
[INFO]   OpenJPA Integration Tests - Daytrader
[INFO]   OpenJPA Integration Tests - Examples
[INFO]   OpenJPA Integration Tests - SLF4JLogFactory
[INFO]   OpenJPA Integration Tests - JPA TCK
[INFO]   OpenJPA Integration Tests - Bean Validation
[INFO]   OpenJPA Integration Tests - JMX Platform MBeans
[INFO]   OpenJPA Fetching Statistic Tool
[INFO]   OpenJPA Fetching Statistic Tool -- WAS Bundle
Downloading: http://repo1.maven.org/maven2/org/apache/felix/maven-bundle-plugin/2.0.1/maven-bundle-plugin-2.0.1.pom
4K downloaded  (maven-bundle-plugin-2.0.1.pom)
Downloading: http://repo1.maven.org/maven2/org/apache/felix/maven-bundle-plugin/2.0.1/maven-bundle-plugin-2.0.1.jar
175K downloaded  (maven-bundle-plugin-2.0.1.jar)
[INFO] ------------------------------------------------------------------------
[INFO] Building OpenJPA Parent POM
[INFO]    task-segment: [clean, install]
[INFO] ------------------------------------------------------------------------
Downloading: http://repo1.maven.org/maven2/org/apache/maven/plugins/maven-clean-plugin/2.3/maven-clean-plugin-2.3.pom
4K downloaded  (maven-clean-plugin-2.3.pom)
Downloading: http://repo1.maven.org/maven2/org/apache/maven/plugins/maven-clean-plugin/2.3/maven-clean-plugin-2.3.jar
16K downloaded  (maven-clean-plugin-2.3.jar)
Downloading: http://repo1.maven.org/maven2/org/apache/maven/plugins/maven-checkstyle-plugin/2.6/maven-checkstyle-plugin-2.6.pom
12K downloaded  (maven-checkstyle-plugin-2.6.pom)
Downloading: http://repo1.maven.org/maven2/org/apache/maven/plugins/maven-checkstyle-plugin/2.6/maven-checkstyle-plugin-2.6.jar
80K downloaded  (maven-checkstyle-plugin-2.6.jar)
[INFO] [clean:clean {execution: default-clean}]
[INFO] [buildnumber:create {execution: default}]
[INFO] Checking for local modifications: skipped.
[INFO] Updating project files from SCM: skipped.
[INFO] Executing: /bin/sh -c cd <https://builds.apache.org/job/OpenJPA-trunk/ws/trunk>
&& svn --non-interactive info
[INFO] Working directory: <https://builds.apache.org/job/OpenJPA-trunk/ws/trunk>
[INFO] Storing buildNumber: 1598334 at timestamp: May 29, 2014 at 5:52 PM
[INFO] Executing: /bin/sh -c cd <https://builds.apache.org/job/OpenJPA-trunk/ws/trunk>
&& svn --non-interactive info
[INFO] Working directory: <https://builds.apache.org/job/OpenJPA-trunk/ws/trunk>
[INFO] Storing buildScmBranch: trunk
[INFO] [enforcer:enforce {execution: default}]
Setting property: classpath.resource.loader.class => 'org.codehaus.plexus.velocity.ContextClassLoaderResourceLoader'.
Setting property: site.resource.loader.class => 'org.codehaus.plexus.velocity.SiteResourceLoader'.
Setting property: velocimacro.messages.on => 'false'.
Setting property: resource.loader => 'classpath,site'.
Setting property: runtime.log.invalid.references => 'false'.
Setting property: resource.manager.logwhenfound => 'false'.
Setting property: classpath.resource.loader.class => 'org.codehaus.plexus.velocity.ContextClassLoaderResourceLoader'.
Setting property: site.resource.loader.class => 'org.codehaus.plexus.velocity.SiteResourceLoader'.
Setting property: velocimacro.messages.on => 'false'.
Setting property: resource.loader => 'classpath,site'.
Setting property: runtime.log.invalid.references => 'false'.
Setting property: resource.manager.logwhenfound => 'false'.
Setting property: velocimacro.permissions.allow.inline.to.replace.global => 'true'.
[INFO] [checkstyle:checkstyle {execution: default}]
[INFO] Setting property: classpath.resource.loader.class => 'org.codehaus.plexus.velocity.ContextClassLoaderResourceLoader'.
[INFO] Setting property: velocimacro.messages.on => 'false'.
[INFO] Setting property: resource.loader => 'classpath'.
[INFO] Setting property: resource.manager.logwhenfound => 'false'.
[INFO] [remote-resources:process {execution: default}]
[INFO] [compiler:testCompile {execution: test-source-compile}]
[INFO] No sources to compile
[INFO] [site:attach-descriptor {execution: default-attach-descriptor}]
[INFO] Unable to load parent project from a relative path: Could not find the model file '<https://builds.apache.org/job/OpenJPA-trunk/ws/pom.xml'.>
for project unknown
[INFO] Parent project loaded from repository.
[INFO] [ianal:verify-legal-files {execution: default}]
Downloading: http://repo1.maven.org/maven2/org/apache/rat/apache-rat-core/0.7/apache-rat-core-0.7.pom
2K downloaded  (apache-rat-core-0.7.pom)
Downloading: http://repo1.maven.org/maven2/org/apache/rat/apache-rat-core/0.7/apache-rat-core-0.7.jar
94K downloaded  (apache-rat-core-0.7.jar)
[INFO] [apache-rat:check {execution: default}]
[INFO] Exclude: **/.*/**
[INFO] Exclude: **/target/**/*
[INFO] [install:install {execution: default-install}]
[INFO] Installing <https://builds.apache.org/job/OpenJPA-trunk/ws/trunk/pom.xml> to
/home/jenkins/jenkins-slave/maven-repositories/0/org/apache/openjpa/openjpa-parent/2.4.0-SNAPSHOT/openjpa-parent-2.4.0-SNAPSHOT.pom
[INFO] ------------------------------------------------------------------------
[INFO] Building OpenJPA Utilities Library
[INFO]    task-segment: [clean, install]
[INFO] ------------------------------------------------------------------------
[INFO] [clean:clean {execution: default-clean}]
[INFO] [buildnumber:create {execution: default}]
[INFO] [enforcer:enforce {execution: default}]
[INFO] [checkstyle:checkstyle {execution: default}]
[INFO] Starting audit...
Audit done.

[WARNING] Unable to locate Source XRef to link to - DISABLED
[ERROR] VM #image: error : too few arguments to macro. Wanted 5 got 0
[ERROR] VM #image: error : too few arguments to macro. Wanted 5 got 0
[ERROR] VM #displayTree: error : too few arguments to macro. Wanted 2 got 0
[ERROR] VM #menuItem: error : too few arguments to macro. Wanted 1 got 0
[INFO] [remote-resources:process {execution: default}]
[INFO] [resources:resources {execution: default-resources}]
[INFO] Using 'UTF-8' encoding to copy filtered resources.
[INFO] Copying 9 resources
[INFO] Copying 3 resources
[INFO] [compiler:compile {execution: default-compile}]
[INFO] Compiling 161 source files to <https://builds.apache.org/job/OpenJPA-trunk/ws/trunk/openjpa-lib/target/classes>
[INFO] -------------------------------------------------------------
[ERROR] COMPILATION ERROR : 
[INFO] -------------------------------------------------------------
[ERROR] Failure executing javac, but could not parse the error:
javac: invalid target release: 1.7
Usage: javac <options> <source files>
use -help for a list of possible options

[INFO] 1 error
[INFO] -------------------------------------------------------------
[INFO] ------------------------------------------------------------------------
[ERROR] BUILD FAILURE
[INFO] ------------------------------------------------------------------------
[INFO] Compilation failure
Failure executing javac, but could not parse the error:
javac: invalid target release: 1.7
Usage: javac <options> <source files>
use -help for a list of possible options


[INFO] ------------------------------------------------------------------------
[INFO] For more information, run Maven with the -e switch
[INFO] ------------------------------------------------------------------------
[INFO] Total time: 36 seconds
[INFO] Finished at: Thu May 29 17:52:33 UTC 2014
[INFO] Final Memory: 62M/489M
[INFO] ------------------------------------------------------------------------
Waiting for Jenkins to finish collecting data
[JENKINS] Archiving <https://builds.apache.org/job/OpenJPA-trunk/ws/trunk/openjpa-lib/pom.xml>
to org.apache.openjpa/openjpa-lib/2.4.0-SNAPSHOT/openjpa-lib-2.4.0-SNAPSHOT.pom
[JENKINS] Archiving /home/jenkins/jenkins-slave/maven-repositories/0/org/apache/openjpa/openjpa-parent/2.4.0-SNAPSHOT/openjpa-parent-2.4.0-SNAPSHOT.pom
to org.apache.openjpa/openjpa-parent/2.4.0-SNAPSHOT/openjpa-parent-2.4.0-SNAPSHOT.pom
/home/jenkins/jenkins-slave/maven-repositories/0/org/apache/openjpa/openjpa-parent/2.4.0-SNAPSHOT/openjpa-parent-2.4.0-SNAPSHOT.pom
is not inside <https://builds.apache.org/job/OpenJPA-trunk/ws/trunk/;> will archive
in a separate pass
Sending e-mails to: commits@openjpa.apache.org
channel stopped

Mime
View raw message