openjpa-commits mailing list archives

Site index · List index
Message view « Date » · « Thread »
Top « Date » · « Thread »
From Apache Jenkins Server <jenk...@builds.apache.org>
Subject Build failed in Jenkins: OpenJPA-22x-deploy #55
Date Tue, 26 Aug 2014 06:53:36 GMT
See <https://builds.apache.org/job/OpenJPA-22x-deploy/55/changes>

Changes:

[jgrassel] OPENJPA-2525: Use of JoinColumn targets to another joinColumn key exposed as an
attribute will cause a ConstrainViolation exception on persist

[jgrassel] OPENJPA-2525: Use of JoinColumn targets to another joinColumn key exposed as an
attribute will cause a ConstrainViolation exception on persist

------------------------------------------
[...truncated 6486 lines...]
[INFO] Copying 15 resources
[INFO] Copying 3 resources
[INFO] [compiler:compile {execution: default-compile}]
[INFO] Compiling 505 source files to <https://builds.apache.org/job/OpenJPA-22x-deploy/ws/2.2.x/openjpa-kernel/target/classes>
[INFO] [antrun:run {execution: add-was-interfaces}]
[INFO] Executing tasks
[INFO] Executed tasks
[INFO] [antrun:run {execution: generate-standard-sco-proxies}]
[INFO] Executing tasks
org.apache.openjpa.util.java$sql$Date$proxy
org.apache.openjpa.util.java$sql$Time$proxy
org.apache.openjpa.util.java$sql$Timestamp$proxy
org.apache.openjpa.util.java$util$ArrayList$proxy
org.apache.openjpa.util.java$util$Date$proxy
org.apache.openjpa.util.java$util$GregorianCalendar$proxy
org.apache.openjpa.util.java$util$HashMap$proxy
org.apache.openjpa.util.java$util$HashSet$proxy
org.apache.openjpa.util.java$util$Hashtable$proxy
org.apache.openjpa.util.java$util$LinkedList$proxy
org.apache.openjpa.util.java$util$Properties$proxy
org.apache.openjpa.util.java$util$TreeMap$proxy
org.apache.openjpa.util.java$util$TreeSet$proxy
org.apache.openjpa.util.java$util$Vector$proxy
org.apache.openjpa.util.java$util$EnumMap$proxy
org.apache.openjpa.util.java$util$IdentityHashMap$proxy
org.apache.openjpa.util.java$util$LinkedHashMap$proxy
org.apache.openjpa.util.java$util$LinkedHashSet$proxy
org.apache.openjpa.util.java$util$PriorityQueue$proxy
[INFO] Executed tasks
[INFO] [compiler:testCompile {execution: test-source-compile}]
[INFO] Compiling 10 source files to <https://builds.apache.org/job/OpenJPA-22x-deploy/ws/2.2.x/openjpa-kernel/target/test-classes>
[INFO] [resources:testResources {execution: default-testResources}]
[INFO] Using 'UTF-8' encoding to copy filtered resources.
[INFO] skip non existing resourceDirectory <https://builds.apache.org/job/OpenJPA-22x-deploy/ws/2.2.x/openjpa-kernel/src/test/resources>
[INFO] Copying 3 resources
[INFO] [compiler:testCompile {execution: default-testCompile}]
[INFO] Nothing to compile - all classes are up to date
[WARNING] DEPRECATED [systemProperties]: Use systemPropertyVariables instead.
[INFO] [surefire:test {execution: default-test}]
[INFO] Surefire report directory: <https://builds.apache.org/job/OpenJPA-22x-deploy/ws/2.2.x/openjpa-kernel/target/surefire-reports>

-------------------------------------------------------
 T E S T S
-------------------------------------------------------
Running org.apache.openjpa.meta.TestMemberProvider
Tests run: 2, Failures: 0, Errors: 0, Skipped: 0, Time elapsed: 0.049 sec
Running org.apache.openjpa.conf.TestSpecification
Tests run: 3, Failures: 0, Errors: 0, Skipped: 0, Time elapsed: 0.011 sec
Running org.apache.openjpa.enhance.TestPCSubclassNameConversion
Tests run: 1, Failures: 0, Errors: 0, Skipped: 0, Time elapsed: 0.032 sec
Running org.apache.openjpa.meta.TestJavaTypes
Tests run: 1, Failures: 0, Errors: 0, Skipped: 0, Time elapsed: 0.009 sec
Running org.apache.openjpa.meta.TestAccessCode
Tests run: 8, Failures: 0, Errors: 0, Skipped: 0, Time elapsed: 0.013 sec
Running org.apache.openjpa.enhance.TestGetDeclaredMethod
Tests run: 3, Failures: 0, Errors: 0, Skipped: 0, Time elapsed: 0.015 sec
Running org.apache.openjpa.util.TestProxyManager
Tests run: 41, Failures: 0, Errors: 0, Skipped: 0, Time elapsed: 0.275 sec
Running org.apache.openjpa.ee.TestOSGiManagedRuntime
Tests run: 4, Failures: 0, Errors: 0, Skipped: 0, Time elapsed: 0.01 sec
Running org.apache.openjpa.util.TestResultShape
Tests run: 8, Failures: 0, Errors: 0, Skipped: 0, Time elapsed: 0.011 sec
Running org.apache.openjpa.ee.TestWASManagedRuntime
Tests run: 1, Failures: 0, Errors: 0, Skipped: 0, Time elapsed: 0.003 sec

Results :

Tests run: 72, Failures: 0, Errors: 0, Skipped: 0

[JENKINS] Recording test results
[INFO] [jar:jar {execution: default-jar}]
[INFO] Building jar: <https://builds.apache.org/job/OpenJPA-22x-deploy/ws/2.2.x/openjpa-kernel/target/openjpa-kernel-2.2.3-SNAPSHOT.jar>
[INFO] [jar:jar {execution: default-jar}]
[INFO] [jar:test-jar {execution: attach-tests}]
[INFO] Building jar: <https://builds.apache.org/job/OpenJPA-22x-deploy/ws/2.2.x/openjpa-kernel/target/openjpa-kernel-2.2.3-SNAPSHOT-tests.jar>
[INFO] [ianal:verify-legal-files {execution: default}]
[INFO] Checking legal files in: openjpa-kernel-2.2.3-SNAPSHOT.jar
[INFO] Checking legal files in: openjpa-kernel-2.2.3-SNAPSHOT-tests.jar
[INFO] [apache-rat:check {execution: default}]
[INFO] Exclude: **/.*/**
[INFO] Exclude: **/target/**/*
[INFO] [install:install {execution: default-install}]
[INFO] Installing <https://builds.apache.org/job/OpenJPA-22x-deploy/ws/2.2.x/openjpa-kernel/target/openjpa-kernel-2.2.3-SNAPSHOT.jar>
to /home/jenkins/jenkins-slave/maven-repositories/1/org/apache/openjpa/openjpa-kernel/2.2.3-SNAPSHOT/openjpa-kernel-2.2.3-SNAPSHOT.jar
[INFO] Installing <https://builds.apache.org/job/OpenJPA-22x-deploy/ws/2.2.x/openjpa-kernel/target/openjpa-kernel-2.2.3-SNAPSHOT-tests.jar>
to /home/jenkins/jenkins-slave/maven-repositories/1/org/apache/openjpa/openjpa-kernel/2.2.3-SNAPSHOT/openjpa-kernel-2.2.3-SNAPSHOT-tests.jar
[INFO] [deploy:deploy {execution: default-deploy}]
[INFO] Retrieving previous build number from apache.snapshots.https
[WARNING] *** CHECKSUM FAILED - Checksum failed on download: local = '239b1e4a3c66f914d30f354d4f2a2df7ffb8e966';
remote = '73ed121913ef23df5adceddb606917363294d717' - RETRYING
[WARNING] *** CHECKSUM FAILED - Checksum failed on download: local = '239b1e4a3c66f914d30f354d4f2a2df7ffb8e966';
remote = '73ed121913ef23df5adceddb606917363294d717' - IGNORING
Uploading: https://repository.apache.org/content/repositories/snapshots/org/apache/openjpa/openjpa-kernel/2.2.3-SNAPSHOT/openjpa-kernel-2.2.3-20140826.064837-35.jar
1423K uploaded  (openjpa-kernel-2.2.3-20140826.064837-35.jar)
[INFO] Retrieving previous metadata from apache.snapshots.https
[WARNING] *** CHECKSUM FAILED - Checksum failed on download: local = '239b1e4a3c66f914d30f354d4f2a2df7ffb8e966';
remote = '73ed121913ef23df5adceddb606917363294d717' - RETRYING
[WARNING] *** CHECKSUM FAILED - Checksum failed on download: local = '239b1e4a3c66f914d30f354d4f2a2df7ffb8e966';
remote = '73ed121913ef23df5adceddb606917363294d717' - IGNORING
[INFO] Uploading repository metadata for: 'snapshot org.apache.openjpa:openjpa-kernel:2.2.3-SNAPSHOT'
[INFO] Retrieving previous metadata from apache.snapshots.https
[INFO] Uploading repository metadata for: 'artifact org.apache.openjpa:openjpa-kernel'
[INFO] Uploading project information for openjpa-kernel 2.2.3-20140826.064837-35
[INFO] Retrieving previous build number from apache.snapshots.https
Uploading: https://repository.apache.org/content/repositories/snapshots/org/apache/openjpa/openjpa-kernel/2.2.3-SNAPSHOT/openjpa-kernel-2.2.3-20140826.064837-35-tests.jar
48K uploaded  (openjpa-kernel-2.2.3-20140826.064837-35-tests.jar)
[INFO] ------------------------------------------------------------------------
[INFO] Building OpenJPA JDBC
[INFO]    task-segment: [clean, deploy]
[INFO] ------------------------------------------------------------------------
[INFO] [clean:clean {execution: default-clean}]
[INFO] [buildnumber:create {execution: default}]
Downloading: http://repo1.maven.org/maven2/javax/xml/bind/jaxb-api/2.2.1/jaxb-api-2.2.1.pom
3K downloaded  (jaxb-api-2.2.1.pom)
Downloading: http://repo1.maven.org/maven2/com/sun/xml/bind/jaxb-impl/2.2.1/jaxb-impl-2.2.1.pom
2K downloaded  (jaxb-impl-2.2.1.pom)
Downloading: http://repo1.maven.org/maven2/hsqldb/hsqldb/1.8.0.10/hsqldb-1.8.0.10.pom
600b downloaded  (hsqldb-1.8.0.10.pom)
Downloading: http://repo1.maven.org/maven2/postgresql/postgresql/8.4-701.jdbc3/postgresql-8.4-701.jdbc3.pom
620b downloaded  (postgresql-8.4-701.jdbc3.pom)
Downloading: http://repo1.maven.org/maven2/org/jmock/jmock-junit3/2.5.1/jmock-junit3-2.5.1.pom
808b downloaded  (jmock-junit3-2.5.1.pom)
Downloading: http://repo1.maven.org/maven2/postgresql/postgresql/8.4-701.jdbc3/postgresql-8.4-701.jdbc3.jar
Downloading: http://repo1.maven.org/maven2/org/jmock/jmock-junit3/2.5.1/jmock-junit3-2.5.1.jar
Downloading: http://repo1.maven.org/maven2/javax/xml/bind/jaxb-api/2.2.1/jaxb-api-2.2.1.jar
Downloading: http://repo1.maven.org/maven2/hsqldb/hsqldb/1.8.0.10/hsqldb-1.8.0.10.jar
Downloading: http://repo1.maven.org/maven2/com/sun/xml/bind/jaxb-impl/2.2.1/jaxb-impl-2.2.1.jar
10K downloaded  (jmock-junit3-2.5.1.jar)
102K downloaded  (jaxb-api-2.2.1.jar)
461K downloaded  (postgresql-8.4-701.jdbc3.jar)
690K downloaded  (hsqldb-1.8.0.10.jar)
856K downloaded  (jaxb-impl-2.2.1.jar)
[INFO] [enforcer:enforce {execution: default}]
[INFO] [checkstyle:checkstyle {execution: default}]
[INFO] Starting audit...
Audit done.

[WARNING] Unable to locate Source XRef to link to - DISABLED
[INFO] [remote-resources:process {execution: default}]
[INFO] [resources:resources {execution: default-resources}]
[INFO] Using 'UTF-8' encoding to copy filtered resources.
[INFO] Copying 14 resources
[INFO] Copying 3 resources
[INFO] [compiler:compile {execution: default-compile}]
[INFO] Compiling 358 source files to <https://builds.apache.org/job/OpenJPA-22x-deploy/ws/2.2.x/openjpa-jdbc/target/classes>
[INFO] [compiler:testCompile {execution: test-source-compile}]
[INFO] Compiling 8 source files to <https://builds.apache.org/job/OpenJPA-22x-deploy/ws/2.2.x/openjpa-jdbc/target/test-classes>
[INFO] [resources:testResources {execution: default-testResources}]
[INFO] Using 'UTF-8' encoding to copy filtered resources.
[INFO] skip non existing resourceDirectory <https://builds.apache.org/job/OpenJPA-22x-deploy/ws/2.2.x/openjpa-jdbc/src/test/resources>
[INFO] Copying 3 resources
[INFO] [compiler:testCompile {execution: default-testCompile}]
[INFO] Nothing to compile - all classes are up to date
[WARNING] DEPRECATED [systemProperties]: Use systemPropertyVariables instead.
[INFO] [surefire:test {execution: default-test}]
[INFO] Surefire report directory: <https://builds.apache.org/job/OpenJPA-22x-deploy/ws/2.2.x/openjpa-jdbc/target/surefire-reports>

-------------------------------------------------------
 T E S T S
-------------------------------------------------------
Running org.apache.openjpa.jdbc.sql.identifier.TestDBIdentifiers
Tests run: 5, Failures: 0, Errors: 0, Skipped: 0, Time elapsed: 0.052 sec
Running org.apache.openjpa.jdbc.sql.TestDBDictionaryGeneratedSQL
Tests run: 5, Failures: 0, Errors: 0, Skipped: 0, Time elapsed: 0.245 sec
Running org.apache.openjpa.jdbc.meta.TestMappingDefaultsImpl
5  INFO   [main] openjpa.jdbc.JDBC - Using dictionary class "org.apache.openjpa.jdbc.sql.OracleDictionary".
Tests run: 1, Failures: 0, Errors: 0, Skipped: 0, Time elapsed: 0.162 sec
Running org.apache.openjpa.jdbc.sql.TestDB2Dictionary
Tests run: 5, Failures: 0, Errors: 0, Skipped: 0, Time elapsed: 0.127 sec
Running org.apache.openjpa.jdbc.sql.TestMySQLDictionary
Tests run: 3, Failures: 0, Errors: 0, Skipped: 0, Time elapsed: 0.091 sec
Running org.apache.openjpa.jdbc.kernel.TestSQLStoreParamsSubstitution
Tests run: 1, Failures: 0, Errors: 0, Skipped: 0, Time elapsed: 0.006 sec
Running org.apache.openjpa.jdbc.kernel.TestUpdateManagerFlushException
Tests run: 1, Failures: 0, Errors: 0, Skipped: 0, Time elapsed: 0.007 sec
Running org.apache.openjpa.jdbc.sql.TestDictionaryFactory
Tests run: 1, Failures: 0, Errors: 0, Skipped: 0, Time elapsed: 0.004 sec

Results :

Tests run: 22, Failures: 0, Errors: 0, Skipped: 0

[JENKINS] Recording test results
[INFO] [jar:jar {execution: default-jar}]
[INFO] Building jar: <https://builds.apache.org/job/OpenJPA-22x-deploy/ws/2.2.x/openjpa-jdbc/target/openjpa-jdbc-2.2.3-SNAPSHOT.jar>
[INFO] [jar:jar {execution: default-jar}]
[INFO] [jar:test-jar {execution: attach-tests}]
[INFO] Building jar: <https://builds.apache.org/job/OpenJPA-22x-deploy/ws/2.2.x/openjpa-jdbc/target/openjpa-jdbc-2.2.3-SNAPSHOT-tests.jar>
[INFO] [ianal:verify-legal-files {execution: default}]
[INFO] Checking legal files in: openjpa-jdbc-2.2.3-SNAPSHOT.jar
[INFO] Checking legal files in: openjpa-jdbc-2.2.3-SNAPSHOT-tests.jar
[INFO] [apache-rat:check {execution: default}]
[INFO] Exclude: **/.*/**
[INFO] Exclude: **/target/**/*
[INFO] [install:install {execution: default-install}]
[INFO] Installing <https://builds.apache.org/job/OpenJPA-22x-deploy/ws/2.2.x/openjpa-jdbc/target/openjpa-jdbc-2.2.3-SNAPSHOT.jar>
to /home/jenkins/jenkins-slave/maven-repositories/1/org/apache/openjpa/openjpa-jdbc/2.2.3-SNAPSHOT/openjpa-jdbc-2.2.3-SNAPSHOT.jar
[INFO] Installing <https://builds.apache.org/job/OpenJPA-22x-deploy/ws/2.2.x/openjpa-jdbc/target/openjpa-jdbc-2.2.3-SNAPSHOT-tests.jar>
to /home/jenkins/jenkins-slave/maven-repositories/1/org/apache/openjpa/openjpa-jdbc/2.2.3-SNAPSHOT/openjpa-jdbc-2.2.3-SNAPSHOT-tests.jar
[INFO] [deploy:deploy {execution: default-deploy}]
[INFO] Retrieving previous build number from apache.snapshots.https
[INFO] ------------------------------------------------------------------------
[ERROR] BUILD ERROR
[INFO] ------------------------------------------------------------------------
[INFO] Error retrieving previous build number for artifact 'org.apache.openjpa:openjpa-jdbc:jar':
repository metadata for: 'snapshot org.apache.openjpa:openjpa-jdbc:2.2.3-SNAPSHOT' could not
be retrieved from repository: apache.snapshots.https due to an error: Error transferring file:
Server returned HTTP response code: 502 for URL: https://repository.apache.org/content/repositories/snapshots/org/apache/openjpa/openjpa-jdbc/2.2.3-SNAPSHOT/maven-metadata.xml.sha1

[INFO] ------------------------------------------------------------------------
[INFO] For more information, run Maven with the -e switch
[INFO] ------------------------------------------------------------------------
[INFO] Total time: 4 minutes 53 seconds
[INFO] Finished at: Tue Aug 26 06:53:03 UTC 2014
[INFO] Final Memory: 90M/475M
[INFO] ------------------------------------------------------------------------
[JENKINS] Archiving <https://builds.apache.org/job/OpenJPA-22x-deploy/ws/2.2.x/openjpa-lib/pom.xml>
to org.apache.openjpa/openjpa-lib/2.2.3-SNAPSHOT/openjpa-lib-2.2.3-SNAPSHOT.pom
[JENKINS] Archiving <https://builds.apache.org/job/OpenJPA-22x-deploy/ws/2.2.x/openjpa-lib/target/openjpa-lib-2.2.3-SNAPSHOT.jar>
to org.apache.openjpa/openjpa-lib/2.2.3-20140826.064837-35/openjpa-lib-2.2.3-20140826.064837-35.jar
[JENKINS] Archiving <https://builds.apache.org/job/OpenJPA-22x-deploy/ws/2.2.x/openjpa-lib/target/openjpa-lib-2.2.3-SNAPSHOT-tests.jar>
to org.apache.openjpa/openjpa-lib/2.2.3-20140826.064837-35/openjpa-lib-2.2.3-20140826.064837-35-tests.jar
Sending artifact delta relative to OpenJPA-22x-deploy ? OpenJPA Utilities Library #54
Archived 3 artifacts
Archive block size is 32768
Received 0 blocks and 589125 bytes
Compression is 0.0%
Took 0.34 sec
[JENKINS] Archiving <https://builds.apache.org/job/OpenJPA-22x-deploy/ws/2.2.x/openjpa-kernel/pom.xml>
to org.apache.openjpa/openjpa-kernel/2.2.3-SNAPSHOT/openjpa-kernel-2.2.3-SNAPSHOT.pom
[JENKINS] Archiving <https://builds.apache.org/job/OpenJPA-22x-deploy/ws/2.2.x/openjpa-kernel/target/openjpa-kernel-2.2.3-SNAPSHOT.jar>
to org.apache.openjpa/openjpa-kernel/2.2.3-20140826.064837-35/openjpa-kernel-2.2.3-20140826.064837-35.jar
[JENKINS] Archiving <https://builds.apache.org/job/OpenJPA-22x-deploy/ws/2.2.x/openjpa-kernel/target/openjpa-kernel-2.2.3-SNAPSHOT-tests.jar>
to org.apache.openjpa/openjpa-kernel/2.2.3-20140826.064837-35/openjpa-kernel-2.2.3-20140826.064837-35-tests.jar
Sending artifact delta relative to OpenJPA-22x-deploy ? OpenJPA Kernel #54
Archived 3 artifacts
Archive block size is 32768
Received 1 blocks and 1481396 bytes
Compression is 2.2%
Took 0.8 sec
[JENKINS] Archiving <https://builds.apache.org/job/OpenJPA-22x-deploy/ws/2.2.x/pom.xml>
to org.apache.openjpa/openjpa-parent/2.2.3-SNAPSHOT/openjpa-parent-2.2.3-SNAPSHOT.pom
[JENKINS] Archiving /home/jenkins/jenkins-slave/maven-repositories/1/org/apache/openjpa/openjpa-parent/2.2.3-SNAPSHOT/openjpa-parent-2.2.3-SNAPSHOT.pom
to org.apache.openjpa/openjpa-parent/2.2.3-20140826.064837-35/openjpa-parent-2.2.3-20140826.064837-35.pom
/home/jenkins/jenkins-slave/maven-repositories/1/org/apache/openjpa/openjpa-parent/2.2.3-SNAPSHOT/openjpa-parent-2.2.3-SNAPSHOT.pom
is not inside <https://builds.apache.org/job/OpenJPA-22x-deploy/ws/2.2.x/;> will archive
in a separate pass
Sending artifact delta relative to OpenJPA-22x-deploy ? OpenJPA Parent POM #54
Archived 1 artifacts
Archive block size is 32768
Received 1 blocks and 21272 bytes
Compression is 60.6%
Took 0.21 sec
Sending artifact delta relative to OpenJPA-22x-deploy ? OpenJPA Parent POM #54
Archived 1 artifacts
Archive block size is 32768
Received 1 blocks and 21292 bytes
Compression is 60.6%
Took 0.11 sec
[JENKINS] Archiving <https://builds.apache.org/job/OpenJPA-22x-deploy/ws/2.2.x/openjpa-jdbc/pom.xml>
to org.apache.openjpa/openjpa-jdbc/2.2.3-SNAPSHOT/openjpa-jdbc-2.2.3-SNAPSHOT.pom
[JENKINS] Archiving <https://builds.apache.org/job/OpenJPA-22x-deploy/ws/2.2.x/openjpa-jdbc/target/openjpa-jdbc-2.2.3-SNAPSHOT.jar>
to org.apache.openjpa/openjpa-jdbc/2.2.3-SNAPSHOT/openjpa-jdbc-2.2.3-SNAPSHOT.jar
[JENKINS] Archiving <https://builds.apache.org/job/OpenJPA-22x-deploy/ws/2.2.x/openjpa-jdbc/target/openjpa-jdbc-2.2.3-SNAPSHOT-tests.jar>
to org.apache.openjpa/openjpa-jdbc/2.2.3-SNAPSHOT/openjpa-jdbc-2.2.3-SNAPSHOT-tests.jar
Sending artifact delta relative to OpenJPA-22x-deploy ? OpenJPA JDBC #54
Archived 3 artifacts
Archive block size is 32768
Received 1 blocks and 1443764 bytes
Compression is 2.2%
Took 0.64 sec
Sending e-mails to: commits@openjpa.apache.org
channel stopped

Mime
View raw message