openjpa-commits mailing list archives

Site index · List index
Message view « Date » · « Thread »
Top « Date » · « Thread »
From Apache Jenkins Server <jenk...@builds.apache.org>
Subject Build failed in Jenkins: OpenJPA-trunk-deploy » OpenJPA Parent POM #445
Date Tue, 23 Sep 2014 06:53:49 GMT
See <https://builds.apache.org/job/OpenJPA-trunk-deploy/org.apache.openjpa$openjpa-parent/445/>

------------------------------------------
[...truncated 578 lines...]
5K downloaded  (plexus-compiler-manager-1.8.1.jar)
Downloading: http://repo1.maven.org/maven2/org/codehaus/plexus/plexus-compiler-javac/1.8.1/plexus-compiler-javac-1.8.1.jar
12K downloaded  (plexus-compiler-javac-1.8.1.jar)
[INFO] [compiler:testCompile {execution: test-source-compile}]
[INFO] No sources to compile
Downloading: http://repo1.maven.org/maven2/org/apache/maven/doxia/doxia-module-xhtml/1.0/doxia-module-xhtml-1.0.pom
1K downloaded  (doxia-module-xhtml-1.0.pom)
Downloading: http://repo1.maven.org/maven2/org/apache/maven/doxia/doxia-modules/1.0/doxia-modules-1.0.pom
2K downloaded  (doxia-modules-1.0.pom)
Downloading: http://repo1.maven.org/maven2/org/codehaus/plexus/plexus-utils/1.5.7/plexus-utils-1.5.7.pom
7K downloaded  (plexus-utils-1.5.7.pom)
Downloading: http://repo1.maven.org/maven2/org/apache/maven/doxia/doxia-core/1.0/doxia-core-1.0.pom
2K downloaded  (doxia-core-1.0.pom)
Downloading: http://repo1.maven.org/maven2/org/apache/maven/doxia/doxia-decoration-model/1.0/doxia-decoration-model-1.0.pom
3K downloaded  (doxia-decoration-model-1.0.pom)
Downloading: http://repo1.maven.org/maven2/org/apache/maven/doxia/doxia-sitetools/1.0/doxia-sitetools-1.0.pom
9K downloaded  (doxia-sitetools-1.0.pom)
Downloading: http://repo1.maven.org/maven2/org/apache/maven/doxia/doxia-site-renderer/1.0/doxia-site-renderer-1.0.pom
4K downloaded  (doxia-site-renderer-1.0.pom)
Downloading: http://repo1.maven.org/maven2/org/apache/maven/doxia/doxia-module-apt/1.0/doxia-module-apt-1.0.pom
2K downloaded  (doxia-module-apt-1.0.pom)
Downloading: http://repo1.maven.org/maven2/org/apache/maven/doxia/doxia-module-fml/1.0/doxia-module-fml-1.0.pom
2K downloaded  (doxia-module-fml-1.0.pom)
Downloading: http://repo1.maven.org/maven2/org/apache/maven/doxia/doxia-module-xdoc/1.0/doxia-module-xdoc-1.0.pom
2K downloaded  (doxia-module-xdoc-1.0.pom)
Downloading: http://repo1.maven.org/maven2/org/apache/maven/shared/maven-doxia-tools/1.0.2/maven-doxia-tools-1.0.2.pom
5K downloaded  (maven-doxia-tools-1.0.2.pom)
Downloading: http://repo1.maven.org/maven2/org/apache/maven/wagon/wagon-provider-api/1.0-beta-4/wagon-provider-api-1.0-beta-4.pom
906b downloaded  (wagon-provider-api-1.0-beta-4.pom)
Downloading: http://repo1.maven.org/maven2/org/apache/maven/wagon/wagon/1.0-beta-4/wagon-1.0-beta-4.pom
10K downloaded  (wagon-1.0-beta-4.pom)
Downloading: http://repo1.maven.org/maven2/org/mortbay/jetty/jetty/6.1.5/jetty-6.1.5.pom
4K downloaded  (jetty-6.1.5.pom)
Downloading: http://repo1.maven.org/maven2/org/mortbay/jetty/project/6.1.5/project-6.1.5.pom
12K downloaded  (project-6.1.5.pom)
Downloading: http://snapshots.repository.codehaus.org/org/mortbay/jetty/jetty-util/6.1.5/jetty-util-6.1.5.pom
[INFO] Unable to find resource 'org.mortbay.jetty:jetty-util:pom:6.1.5' in repository codehaus.org
(http://snapshots.repository.codehaus.org)
Downloading: http://people.apache.org/repo/m2-snapshot-repository//org/mortbay/jetty/jetty-util/6.1.5/jetty-util-6.1.5.pom
[INFO] Unable to find resource 'org.mortbay.jetty:jetty-util:pom:6.1.5' in repository apache.m2.incubator
(http://people.apache.org/repo/m2-snapshot-repository/)
Downloading: http://repo1.maven.org/maven2/org/mortbay/jetty/jetty-util/6.1.5/jetty-util-6.1.5.pom
3K downloaded  (jetty-util-6.1.5.pom)
Downloading: http://snapshots.repository.codehaus.org/org/mortbay/jetty/servlet-api-2.5/6.1.5/servlet-api-2.5-6.1.5.pom
[INFO] Unable to find resource 'org.mortbay.jetty:servlet-api-2.5:pom:6.1.5' in repository
codehaus.org (http://snapshots.repository.codehaus.org)
Downloading: http://people.apache.org/repo/m2-snapshot-repository//org/mortbay/jetty/servlet-api-2.5/6.1.5/servlet-api-2.5-6.1.5.pom
[INFO] Unable to find resource 'org.mortbay.jetty:servlet-api-2.5:pom:6.1.5' in repository
apache.m2.incubator (http://people.apache.org/repo/m2-snapshot-repository/)
Downloading: http://repo1.maven.org/maven2/org/mortbay/jetty/servlet-api-2.5/6.1.5/servlet-api-2.5-6.1.5.pom
3K downloaded  (servlet-api-2.5-6.1.5.pom)
Downloading: http://repo1.maven.org/maven2/commons-collections/commons-collections/3.2/commons-collections-3.2.jar
Downloading: http://repo1.maven.org/maven2/org/apache/maven/doxia/doxia-module-xhtml/1.0/doxia-module-xhtml-1.0.jar
Downloading: http://repo1.maven.org/maven2/org/apache/maven/shared/maven-doxia-tools/1.0.2/maven-doxia-tools-1.0.2.jar
Downloading: http://repo1.maven.org/maven2/org/mortbay/jetty/jetty/6.1.5/jetty-6.1.5.jar
Downloading: http://repo1.maven.org/maven2/org/codehaus/plexus/plexus-utils/1.5.1/plexus-utils-1.5.1.jar
21K downloaded  (doxia-module-xhtml-1.0.jar)
40K downloaded  (maven-doxia-tools-1.0.2.jar)
Downloading: http://repo1.maven.org/maven2/org/apache/maven/doxia/doxia-core/1.0/doxia-core-1.0.jar
205K downloaded  (plexus-utils-1.5.1.jar)
53K downloaded  (doxia-core-1.0.jar)
Downloading: http://repo1.maven.org/maven2/org/apache/maven/doxia/doxia-decoration-model/1.0/doxia-decoration-model-1.0.jar
474K downloaded  (jetty-6.1.5.jar)
557K downloaded  (commons-collections-3.2.jar)
47K downloaded  (doxia-decoration-model-1.0.jar)
Downloading: http://snapshots.repository.codehaus.org/org/mortbay/jetty/jetty-util/6.1.5/jetty-util-6.1.5.jar
Downloading: http://repo1.maven.org/maven2/org/apache/maven/doxia/doxia-site-renderer/1.0/doxia-site-renderer-1.0.jar
45K downloaded  (doxia-site-renderer-1.0.jar)
Downloading: http://repo1.maven.org/maven2/org/apache/maven/doxia/doxia-module-apt/1.0/doxia-module-apt-1.0.jar
45K downloaded  (doxia-module-apt-1.0.jar)
Downloading: http://repo1.maven.org/maven2/org/apache/maven/doxia/doxia-module-fml/1.0/doxia-module-fml-1.0.jar
18K downloaded  (doxia-module-fml-1.0.jar)
Downloading: http://repo1.maven.org/maven2/org/apache/maven/doxia/doxia-module-xdoc/1.0/doxia-module-xdoc-1.0.jar
27K downloaded  (doxia-module-xdoc-1.0.jar)
[INFO] Unable to find resource 'org.mortbay.jetty:jetty-util:jar:6.1.5' in repository codehaus.org
(http://snapshots.repository.codehaus.org)
Downloading: http://people.apache.org/repo/m2-snapshot-repository//org/mortbay/jetty/jetty-util/6.1.5/jetty-util-6.1.5.jar
[INFO] Unable to find resource 'org.mortbay.jetty:jetty-util:jar:6.1.5' in repository apache.m2.incubator
(http://people.apache.org/repo/m2-snapshot-repository/)
Downloading: http://repo1.maven.org/maven2/org/mortbay/jetty/jetty-util/6.1.5/jetty-util-6.1.5.jar
134K downloaded  (jetty-util-6.1.5.jar)
Downloading: http://snapshots.repository.codehaus.org/org/mortbay/jetty/servlet-api-2.5/6.1.5/servlet-api-2.5-6.1.5.jar
[INFO] Unable to find resource 'org.mortbay.jetty:servlet-api-2.5:jar:6.1.5' in repository
codehaus.org (http://snapshots.repository.codehaus.org)
Downloading: http://people.apache.org/repo/m2-snapshot-repository//org/mortbay/jetty/servlet-api-2.5/6.1.5/servlet-api-2.5-6.1.5.jar
[INFO] Unable to find resource 'org.mortbay.jetty:servlet-api-2.5:jar:6.1.5' in repository
apache.m2.incubator (http://people.apache.org/repo/m2-snapshot-repository/)
Downloading: http://repo1.maven.org/maven2/org/mortbay/jetty/servlet-api-2.5/6.1.5/servlet-api-2.5-6.1.5.jar
129K downloaded  (servlet-api-2.5-6.1.5.jar)
[INFO] [site:attach-descriptor {execution: default-attach-descriptor}]
[INFO] Unable to load parent project from a relative path: Could not find the model file '/jenkins/workspace/OpenJPA-trunk-deploy/pom.xml'.
for project unknown
[INFO] Parent project loaded from repository.
Downloading: http://repo1.maven.org/maven2/org/codehaus/groovy/maven/gmaven-mojo/1.0-rc-3/gmaven-mojo-1.0-rc-3.pom
2K downloaded  (gmaven-mojo-1.0-rc-3.pom)
Downloading: http://repo1.maven.org/maven2/org/codehaus/groovy/maven/gmaven/1.0-rc-3/gmaven-1.0-rc-3.pom
33K downloaded  (gmaven-1.0-rc-3.pom)
Downloading: http://repo1.maven.org/maven2/org/codehaus/groovy/maven/runtime/gmaven-runtime-api/1.0-rc-3/gmaven-runtime-api-1.0-rc-3.pom
1K downloaded  (gmaven-runtime-api-1.0-rc-3.pom)
Downloading: http://repo1.maven.org/maven2/org/codehaus/groovy/maven/runtime/gmaven-runtime/1.0-rc-3/gmaven-runtime-1.0-rc-3.pom
2K downloaded  (gmaven-runtime-1.0-rc-3.pom)
Downloading: http://repo1.maven.org/maven2/org/codehaus/groovy/maven/feature/gmaven-feature-api/1.0-rc-3/gmaven-feature-api-1.0-rc-3.pom
1K downloaded  (gmaven-feature-api-1.0-rc-3.pom)
Downloading: http://repo1.maven.org/maven2/org/codehaus/groovy/maven/feature/gmaven-feature/1.0-rc-3/gmaven-feature-1.0-rc-3.pom
1K downloaded  (gmaven-feature-1.0-rc-3.pom)
Downloading: http://repo1.maven.org/maven2/org/codehaus/groovy/maven/runtime/gmaven-runtime-default/1.0-rc-3/gmaven-runtime-default-1.0-rc-3.pom
1K downloaded  (gmaven-runtime-default-1.0-rc-3.pom)
Downloading: http://repo1.maven.org/maven2/org/slf4j/slf4j-api/1.5.0/slf4j-api-1.5.0.pom
2K downloaded  (slf4j-api-1.5.0.pom)
Downloading: http://repo1.maven.org/maven2/org/slf4j/slf4j-parent/1.5.0/slf4j-parent-1.5.0.pom
7K downloaded  (slf4j-parent-1.5.0.pom)
Downloading: http://repo1.maven.org/maven2/org/codehaus/groovy/maven/runtime/gmaven-runtime-1.5/1.0-rc-3/gmaven-runtime-1.5-1.0-rc-3.pom
2K downloaded  (gmaven-runtime-1.5-1.0-rc-3.pom)
Downloading: http://repo1.maven.org/maven2/org/codehaus/groovy/maven/feature/gmaven-feature-support/1.0-rc-3/gmaven-feature-support-1.0-rc-3.pom
1K downloaded  (gmaven-feature-support-1.0-rc-3.pom)
Downloading: http://repo1.maven.org/maven2/org/codehaus/groovy/maven/runtime/gmaven-runtime-support/1.0-rc-3/gmaven-runtime-support-1.0-rc-3.pom
2K downloaded  (gmaven-runtime-support-1.0-rc-3.pom)
Downloading: http://repo1.maven.org/maven2/org/codehaus/groovy/maven/gmaven-common/1.0-rc-3/gmaven-common-1.0-rc-3.pom
1K downloaded  (gmaven-common-1.0-rc-3.pom)
Downloading: http://repo1.maven.org/maven2/com/thoughtworks/qdox/qdox/1.6.3/qdox-1.6.3.pom
10K downloaded  (qdox-1.6.3.pom)
Downloading: http://repo1.maven.org/maven2/org/codehaus/groovy/groovy-all-minimal/1.5.6/groovy-all-minimal-1.5.6.pom
17K downloaded  (groovy-all-minimal-1.5.6.pom)
Downloading: http://repo1.maven.org/maven2/org/apache/ant/ant/1.7.1/ant-1.7.1.pom
9K downloaded  (ant-1.7.1.pom)
Downloading: http://repo1.maven.org/maven2/org/apache/ant/ant-parent/1.7.1/ant-parent-1.7.1.pom
4K downloaded  (ant-parent-1.7.1.pom)
Downloading: http://repo1.maven.org/maven2/org/apache/ant/ant-launcher/1.7.1/ant-launcher-1.7.1.pom
2K downloaded  (ant-launcher-1.7.1.pom)
Downloading: http://repo1.maven.org/maven2/org/codehaus/plexus/plexus-utils/1.1/plexus-utils-1.1.jar
Downloading: http://repo1.maven.org/maven2/org/codehaus/groovy/maven/runtime/gmaven-runtime-api/1.0-rc-3/gmaven-runtime-api-1.0-rc-3.jar
Downloading: http://repo1.maven.org/maven2/org/apache/ant/ant/1.7.1/ant-1.7.1.jar
Downloading: http://repo1.maven.org/maven2/org/codehaus/groovy/maven/gmaven-mojo/1.0-rc-3/gmaven-mojo-1.0-rc-3.jar
Downloading: http://repo1.maven.org/maven2/com/thoughtworks/qdox/qdox/1.6.3/qdox-1.6.3.jar
22K downloaded  (gmaven-runtime-api-1.0-rc-3.jar)
11K downloaded  (gmaven-mojo-1.0-rc-3.jar)
101K downloaded  (qdox-1.6.3.jar)
Downloading: http://repo1.maven.org/maven2/org/codehaus/groovy/groovy-all-minimal/1.5.6/groovy-all-minimal-1.5.6.jar
164K downloaded  (plexus-utils-1.1.jar)
Downloading: http://repo1.maven.org/maven2/org/codehaus/groovy/maven/feature/gmaven-feature-api/1.0-rc-3/gmaven-feature-api-1.0-rc-3.jar
Downloading: http://repo1.maven.org/maven2/org/slf4j/slf4j-api/1.5.0/slf4j-api-1.5.0.jar
17K downloaded  (gmaven-feature-api-1.0-rc-3.jar)
Downloading: http://repo1.maven.org/maven2/org/codehaus/groovy/maven/gmaven-common/1.0-rc-3/gmaven-common-1.0-rc-3.jar
16K downloaded  (slf4j-api-1.5.0.jar)
14K downloaded  (gmaven-common-1.0-rc-3.jar)
Downloading: http://repo1.maven.org/maven2/org/codehaus/groovy/maven/runtime/gmaven-runtime-default/1.0-rc-3/gmaven-runtime-default-1.0-rc-3.jar
Downloading: http://repo1.maven.org/maven2/org/codehaus/groovy/maven/feature/gmaven-feature-support/1.0-rc-3/gmaven-feature-support-1.0-rc-3.jar
11K downloaded  (gmaven-runtime-default-1.0-rc-3.jar)
15K downloaded  (gmaven-feature-support-1.0-rc-3.jar)
Downloading: http://repo1.maven.org/maven2/org/codehaus/groovy/maven/runtime/gmaven-runtime-1.5/1.0-rc-3/gmaven-runtime-1.5-1.0-rc-3.jar
45K downloaded  (gmaven-runtime-1.5-1.0-rc-3.jar)
1291K downloaded  (ant-1.7.1.jar)
Downloading: http://repo1.maven.org/maven2/org/codehaus/groovy/maven/runtime/gmaven-runtime-support/1.0-rc-3/gmaven-runtime-support-1.0-rc-3.jar
Downloading: http://repo1.maven.org/maven2/org/apache/ant/ant-launcher/1.7.1/ant-launcher-1.7.1.jar
74K downloaded  (gmaven-runtime-support-1.0-rc-3.jar)
11K downloaded  (ant-launcher-1.7.1.jar)
2744K downloaded  (groovy-all-minimal-1.5.6.jar)
[INFO] [ianal:verify-legal-files {execution: default}]
Downloading: http://repo1.maven.org/maven2/org/apache/rat/apache-rat-core/0.7/apache-rat-core-0.7.pom
2K downloaded  (apache-rat-core-0.7.pom)
Downloading: http://repo1.maven.org/maven2/org/apache/commons/commons-compress/1.0/commons-compress-1.0.pom
7K downloaded  (commons-compress-1.0.pom)
Downloading: http://repo1.maven.org/maven2/commons-cli/commons-cli/1.1/commons-cli-1.1.pom
4K downloaded  (commons-cli-1.1.pom)
Downloading: http://repo1.maven.org/maven2/org/codehaus/plexus/plexus-utils/1.4/plexus-utils-1.4.pom
1K downloaded  (plexus-utils-1.4.pom)
Downloading: http://repo1.maven.org/maven2/org/apache/maven/maven-plugin-api/2.0.4/maven-plugin-api-2.0.4.pom
643b downloaded  (maven-plugin-api-2.0.4.pom)
Downloading: http://repo1.maven.org/maven2/org/apache/maven/doxia/doxia-site-renderer/1.0-alpha-8/doxia-site-renderer-1.0-alpha-8.pom
1K downloaded  (doxia-site-renderer-1.0-alpha-8.pom)
Downloading: http://repo1.maven.org/maven2/org/apache/maven/doxia/doxia/1.0-alpha-8/doxia-1.0-alpha-8.pom
2K downloaded  (doxia-1.0-alpha-8.pom)
Downloading: http://repo1.maven.org/maven2/org/apache/maven/maven-parent/1/maven-parent-1.pom
6K downloaded  (maven-parent-1.pom)
Downloading: http://repo1.maven.org/maven2/org/apache/maven/doxia/doxia-core/1.0-alpha-8/doxia-core-1.0-alpha-8.pom
1K downloaded  (doxia-core-1.0-alpha-8.pom)
Downloading: http://repo1.maven.org/maven2/oro/oro/2.0.7/oro-2.0.7.pom
141b downloaded  (oro-2.0.7.pom)
Downloading: http://repo1.maven.org/maven2/org/apache/maven/doxia/doxia-sink-api/1.0-alpha-8/doxia-sink-api-1.0-alpha-8.pom
424b downloaded  (doxia-sink-api-1.0-alpha-8.pom)
Downloading: http://repo1.maven.org/maven2/org/codehaus/plexus/plexus-i18n/1.0-beta-6/plexus-i18n-1.0-beta-6.pom
771b downloaded  (plexus-i18n-1.0-beta-6.pom)
Downloading: http://repo1.maven.org/maven2/org/codehaus/plexus/plexus-components/1.1.4/plexus-components-1.1.4.pom
2K downloaded  (plexus-components-1.1.4.pom)
Downloading: http://repo1.maven.org/maven2/org/apache/maven/doxia/doxia-decoration-model/1.0-alpha-8/doxia-decoration-model-1.0-alpha-8.pom
1K downloaded  (doxia-decoration-model-1.0-alpha-8.pom)
Downloading: http://repo1.maven.org/maven2/org/apache/maven/reporting/maven-reporting-impl/2.0.4/maven-reporting-impl-2.0.4.pom
1K downloaded  (maven-reporting-impl-2.0.4.pom)
Downloading: http://repo1.maven.org/maven2/org/apache/maven/reporting/maven-reporting/2.0.4/maven-reporting-2.0.4.pom
700b downloaded  (maven-reporting-2.0.4.pom)
Downloading: http://repo1.maven.org/maven2/org/apache/maven/doxia/doxia-core/1.0-alpha-7/doxia-core-1.0-alpha-7.pom
1K downloaded  (doxia-core-1.0-alpha-7.pom)
Downloading: http://repo1.maven.org/maven2/org/apache/maven/reporting/maven-reporting-api/2.0.4/maven-reporting-api-2.0.4.pom
902b downloaded  (maven-reporting-api-2.0.4.pom)
Downloading: http://repo1.maven.org/maven2/org/apache/maven/doxia/doxia-site-renderer/1.0-alpha-7/doxia-site-renderer-1.0-alpha-7.pom
1K downloaded  (doxia-site-renderer-1.0-alpha-7.pom)
Downloading: http://repo1.maven.org/maven2/org/apache/maven/shared/maven-plugin-testing-harness/1.0-beta-1/maven-plugin-testing-harness-1.0-beta-1.pom
1K downloaded  (maven-plugin-testing-harness-1.0-beta-1.pom)
Downloading: http://repo1.maven.org/maven2/org/apache/maven/shared/maven-shared-components/1/maven-shared-components-1.pom
1K downloaded  (maven-shared-components-1.pom)
Downloading: http://repo1.maven.org/maven2/org/apache/maven/wagon/wagon-file/1.0-alpha-5/wagon-file-1.0-alpha-5.pom
5K downloaded  (wagon-file-1.0-alpha-5.pom)
Downloading: http://repo1.maven.org/maven2/org/apache/maven/wagon/wagon-provider-api/1.0-alpha-5/wagon-provider-api-1.0-alpha-5.pom
4K downloaded  (wagon-provider-api-1.0-alpha-5.pom)
Downloading: http://repo1.maven.org/maven2/org/apache/maven/wagon/wagon-http-lightweight/1.0-alpha-5/wagon-http-lightweight-1.0-alpha-5.pom
5K downloaded  (wagon-http-lightweight-1.0-alpha-5.pom)
Downloading: http://repo1.maven.org/maven2/org/apache/maven/wagon/wagon-ssh/1.0-alpha-5/wagon-ssh-1.0-alpha-5.pom
6K downloaded  (wagon-ssh-1.0-alpha-5.pom)
Downloading: http://repo1.maven.org/maven2/com/jcraft/jsch/0.1.23/jsch-0.1.23.pom
485b downloaded  (jsch-0.1.23.pom)
Downloading: http://repo1.maven.org/maven2/oro/oro/2.0.7/oro-2.0.7.jar
Downloading: http://repo1.maven.org/maven2/org/apache/maven/doxia/doxia-site-renderer/1.0-alpha-8/doxia-site-renderer-1.0-alpha-8.jar
Downloading: http://repo1.maven.org/maven2/org/apache/commons/commons-compress/1.0/commons-compress-1.0.jar
Downloading: http://repo1.maven.org/maven2/org/apache/maven/reporting/maven-reporting-impl/2.0.4/maven-reporting-impl-2.0.4.jar
33K downloaded  (doxia-site-renderer-1.0-alpha-8.jar)
13K downloaded  (maven-reporting-impl-2.0.4.jar)
63K downloaded  (oro-2.0.7.jar)
Downloading: http://repo1.maven.org/maven2/junit/junit/3.8.2/junit-3.8.2.jar
Downloading: http://repo1.maven.org/maven2/org/codehaus/plexus/plexus-utils/1.4/plexus-utils-1.4.jar
140K downloaded  (commons-compress-1.0.jar)
Downloading: http://repo1.maven.org/maven2/commons-cli/commons-cli/1.1/commons-cli-1.1.jar
Downloading: http://repo1.maven.org/maven2/org/apache/maven/shared/maven-plugin-testing-harness/1.0-beta-1/maven-plugin-testing-harness-1.0-beta-1.jar
17K downloaded  (maven-plugin-testing-harness-1.0-beta-1.jar)
117K downloaded  (junit-3.8.2.jar)
Downloading: http://repo1.maven.org/maven2/org/apache/rat/apache-rat-core/0.7/apache-rat-core-0.7.jar
35K downloaded  (commons-cli-1.1.jar)
177K downloaded  (plexus-utils-1.4.jar)
Downloading: http://repo1.maven.org/maven2/commons-logging/commons-logging/1.0.4/commons-logging-1.0.4.jar
Downloading: http://repo1.maven.org/maven2/org/apache/maven/doxia/doxia-core/1.0-alpha-8/doxia-core-1.0-alpha-8.jar
94K downloaded  (apache-rat-core-0.7.jar)
Downloading: http://repo1.maven.org/maven2/org/codehaus/plexus/plexus-i18n/1.0-beta-6/plexus-i18n-1.0-beta-6.jar
37K downloaded  (commons-logging-1.0.4.jar)
11K downloaded  (plexus-i18n-1.0-beta-6.jar)
199K downloaded  (doxia-core-1.0-alpha-8.jar)
Downloading: http://repo1.maven.org/maven2/org/apache/maven/doxia/doxia-decoration-model/1.0-alpha-8/doxia-decoration-model-1.0-alpha-8.jar
39K downloaded  (doxia-decoration-model-1.0-alpha-8.jar)
[INFO] [apache-rat:check {execution: default}]
[INFO] Exclude: **/.*/**
[INFO] Exclude: **/target/**/*
[INFO] [install:install {execution: default-install}]
[INFO] Installing <https://builds.apache.org/job/OpenJPA-trunk-deploy/org.apache.openjpa$openjpa-parent/ws/pom.xml>
to /jenkins/maven-repositories/0/org/apache/openjpa/openjpa-parent/2.4.0-SNAPSHOT/openjpa-parent-2.4.0-SNAPSHOT.pom
[INFO] [deploy:deploy {execution: default-deploy}]
[INFO] Retrieving previous build number from apache.snapshots.https
[WARNING] *** CHECKSUM FAILED - Checksum failed on download: local = 'fd294fa9255b688c30a079173963121bed7d6086';
remote = 'e6df935a18c99a550b166703e4442e9766cc61ec' - RETRYING
[WARNING] *** CHECKSUM FAILED - Checksum failed on download: local = 'fd294fa9255b688c30a079173963121bed7d6086';
remote = 'e6df935a18c99a550b166703e4442e9766cc61ec' - IGNORING
Uploading: https://repository.apache.org/content/repositories/snapshots/org/apache/openjpa/openjpa-parent/2.4.0-SNAPSHOT/openjpa-parent-2.4.0-20140923.065313-21.pom
[INFO] ------------------------------------------------------------------------
[ERROR] BUILD ERROR
[INFO] ------------------------------------------------------------------------
[INFO] Error deploying artifact: Failed to transfer file: https://repository.apache.org/content/repositories/snapshots/org/apache/openjpa/openjpa-parent/2.4.0-SNAPSHOT/openjpa-parent-2.4.0-20140923.065313-21.pom.
Return code is: 401

[INFO] ------------------------------------------------------------------------
[INFO] For more information, run Maven with the -e switch
[INFO] ------------------------------------------------------------------------
[INFO] Total time: 53 seconds
[INFO] Finished at: Tue Sep 23 06:53:30 UTC 2014
[INFO] Final Memory: 64M/507M
[INFO] ------------------------------------------------------------------------

Mime
View raw message