openjpa-commits mailing list archives

Site index · List index
Message view « Date » · « Thread »
Top « Date » · « Thread »
From Apache Jenkins Server <jenk...@builds.apache.org>
Subject Build failed in Jenkins: OpenJPA-trunk-deploy #448
Date Wed, 15 Oct 2014 06:50:43 GMT
See <https://builds.apache.org/job/OpenJPA-trunk-deploy/448/changes>

Changes:

[hthomann] OPENJPA-2535: Fixed issue with DBCS characters in identifiers - merged from 2.2.x
commit.

------------------------------------------
[...truncated 469 lines...]
[INFO] Starting audit...
Audit done.

[WARNING] Unable to locate Source XRef to link to - DISABLED
[INFO] [remote-resources:process {execution: default}]
[WARNING] org.apache.velocity.runtime.exception.ReferenceException: reference : template =
META-INF/DEPENDENCIES.vm [line 40,column 14] : $license.name is not a valid reference.
[WARNING] org.apache.velocity.runtime.exception.ReferenceException: reference : template =
META-INF/DEPENDENCIES.vm [line 40,column 14] : $license.name is not a valid reference.
[INFO] [resources:resources {execution: default-resources}]
[INFO] Using 'UTF-8' encoding to copy filtered resources.
[INFO] Copying 14 resources
[INFO] Copying 3 resources
[INFO] [compiler:compile {execution: default-compile}]
[INFO] Compiling 359 source files to <https://builds.apache.org/job/OpenJPA-trunk-deploy/ws/trunk/openjpa-jdbc/target/classes>
[INFO] [compiler:testCompile {execution: test-source-compile}]
[INFO] Compiling 8 source files to <https://builds.apache.org/job/OpenJPA-trunk-deploy/ws/trunk/openjpa-jdbc/target/test-classes>
[INFO] [resources:testResources {execution: default-testResources}]
[INFO] Using 'UTF-8' encoding to copy filtered resources.
[INFO] skip non existing resourceDirectory <https://builds.apache.org/job/OpenJPA-trunk-deploy/ws/trunk/openjpa-jdbc/src/test/resources>
[INFO] Copying 3 resources
[INFO] [compiler:testCompile {execution: default-testCompile}]
[INFO] Nothing to compile - all classes are up to date
[WARNING] DEPRECATED [systemProperties]: Use systemPropertyVariables instead.
[INFO] [surefire:test {execution: default-test}]
[INFO] Surefire report directory: <https://builds.apache.org/job/OpenJPA-trunk-deploy/ws/trunk/openjpa-jdbc/target/surefire-reports>

-------------------------------------------------------
 T E S T S
-------------------------------------------------------
Running org.apache.openjpa.jdbc.sql.identifier.TestDBIdentifiers
Tests run: 5, Failures: 0, Errors: 0, Skipped: 0, Time elapsed: 0.105 sec
Running org.apache.openjpa.jdbc.sql.TestDBDictionaryGeneratedSQL
Tests run: 5, Failures: 0, Errors: 0, Skipped: 0, Time elapsed: 0.444 sec
Running org.apache.openjpa.jdbc.meta.TestMappingDefaultsImpl
7  INFO   [main] openjpa.jdbc.JDBC - Using dictionary class "org.apache.openjpa.jdbc.sql.OracleDictionary".
Tests run: 1, Failures: 0, Errors: 0, Skipped: 0, Time elapsed: 0.213 sec
Running org.apache.openjpa.jdbc.sql.TestDB2Dictionary
Tests run: 5, Failures: 0, Errors: 0, Skipped: 0, Time elapsed: 0.288 sec
Running org.apache.openjpa.jdbc.sql.TestMySQLDictionary
Tests run: 3, Failures: 0, Errors: 0, Skipped: 0, Time elapsed: 0.274 sec
Running org.apache.openjpa.jdbc.kernel.TestSQLStoreParamsSubstitution
Tests run: 1, Failures: 0, Errors: 0, Skipped: 0, Time elapsed: 0.012 sec
Running org.apache.openjpa.jdbc.kernel.TestUpdateManagerFlushException
Tests run: 1, Failures: 0, Errors: 0, Skipped: 0, Time elapsed: 0.012 sec
Running org.apache.openjpa.jdbc.sql.TestDictionaryFactory
Tests run: 1, Failures: 0, Errors: 0, Skipped: 0, Time elapsed: 0.008 sec

Results :

Tests run: 22, Failures: 0, Errors: 0, Skipped: 0

[JENKINS] Recording test results
[INFO] [jar:jar {execution: default-jar}]
[INFO] Building jar: <https://builds.apache.org/job/OpenJPA-trunk-deploy/ws/trunk/openjpa-jdbc/target/openjpa-jdbc-2.4.0-SNAPSHOT.jar>
[INFO] [jar:jar {execution: default-jar}]
[INFO] [jar:test-jar {execution: attach-tests}]
[INFO] Building jar: <https://builds.apache.org/job/OpenJPA-trunk-deploy/ws/trunk/openjpa-jdbc/target/openjpa-jdbc-2.4.0-SNAPSHOT-tests.jar>
[INFO] [ianal:verify-legal-files {execution: default}]
[INFO] Checking legal files in: openjpa-jdbc-2.4.0-SNAPSHOT.jar
[INFO] Checking legal files in: openjpa-jdbc-2.4.0-SNAPSHOT-tests.jar
[INFO] [apache-rat:check {execution: default}]
[INFO] Exclude: **/.*/**
[INFO] Exclude: **/target/**/*
[INFO] [install:install {execution: default-install}]
[INFO] Installing <https://builds.apache.org/job/OpenJPA-trunk-deploy/ws/trunk/openjpa-jdbc/target/openjpa-jdbc-2.4.0-SNAPSHOT.jar>
to /home/jenkins/jenkins-slave/maven-repositories/2/org/apache/openjpa/openjpa-jdbc/2.4.0-SNAPSHOT/openjpa-jdbc-2.4.0-SNAPSHOT.jar
[INFO] Installing <https://builds.apache.org/job/OpenJPA-trunk-deploy/ws/trunk/openjpa-jdbc/target/openjpa-jdbc-2.4.0-SNAPSHOT-tests.jar>
to /home/jenkins/jenkins-slave/maven-repositories/2/org/apache/openjpa/openjpa-jdbc/2.4.0-SNAPSHOT/openjpa-jdbc-2.4.0-SNAPSHOT-tests.jar
[INFO] [deploy:deploy {execution: default-deploy}]
[INFO] Retrieving previous build number from apache.snapshots.https
[WARNING] *** CHECKSUM FAILED - Checksum failed on download: local = '69f5b36fb9793b512e414ad0f7945dd2cdcc1e5c';
remote = '6d11e5dde6e6cb85187dc4730f6f81ab34bbdc1a' - RETRYING
[WARNING] *** CHECKSUM FAILED - Checksum failed on download: local = '69f5b36fb9793b512e414ad0f7945dd2cdcc1e5c';
remote = '6d11e5dde6e6cb85187dc4730f6f81ab34bbdc1a' - IGNORING
Uploading: https://repository.apache.org/content/repositories/snapshots/org/apache/openjpa/openjpa-jdbc/2.4.0-SNAPSHOT/openjpa-jdbc-2.4.0-20141015.064719-16.jar
1409K uploaded  (openjpa-jdbc-2.4.0-20141015.064719-16.jar)
[INFO] Retrieving previous metadata from apache.snapshots.https
[WARNING] *** CHECKSUM FAILED - Checksum failed on download: local = '69f5b36fb9793b512e414ad0f7945dd2cdcc1e5c';
remote = '6d11e5dde6e6cb85187dc4730f6f81ab34bbdc1a' - RETRYING
[WARNING] *** CHECKSUM FAILED - Checksum failed on download: local = '69f5b36fb9793b512e414ad0f7945dd2cdcc1e5c';
remote = '6d11e5dde6e6cb85187dc4730f6f81ab34bbdc1a' - IGNORING
[INFO] Uploading repository metadata for: 'snapshot org.apache.openjpa:openjpa-jdbc:2.4.0-SNAPSHOT'
[INFO] Uploading project information for openjpa-jdbc 2.4.0-20141015.064719-16
[INFO] Retrieving previous metadata from apache.snapshots.https
[INFO] Uploading repository metadata for: 'artifact org.apache.openjpa:openjpa-jdbc'
[INFO] Retrieving previous build number from apache.snapshots.https
Uploading: https://repository.apache.org/content/repositories/snapshots/org/apache/openjpa/openjpa-jdbc/2.4.0-SNAPSHOT/openjpa-jdbc-2.4.0-20141015.064719-16-tests.jar
42K uploaded  (openjpa-jdbc-2.4.0-20141015.064719-16-tests.jar)
[INFO] ------------------------------------------------------------------------
[INFO] Building OpenJPA Persistence
[INFO]    task-segment: [clean, deploy]
[INFO] ------------------------------------------------------------------------
[INFO] [clean:clean {execution: default-clean}]
[INFO] Deleting file set: <https://builds.apache.org/job/OpenJPA-trunk-deploy/ws/trunk/openjpa-persistence/target>
(included: [**], excluded: [])
[INFO] [buildnumber:create {execution: default}]
[INFO] [enforcer:enforce {execution: default}]
[INFO] [checkstyle:checkstyle {execution: default}]
[INFO] Starting audit...
Audit done.

[WARNING] Unable to locate Source XRef to link to - DISABLED
[INFO] [remote-resources:process {execution: default}]
[WARNING] org.apache.velocity.runtime.exception.ReferenceException: reference : template =
META-INF/DEPENDENCIES.vm [line 40,column 14] : $license.name is not a valid reference.
[WARNING] org.apache.velocity.runtime.exception.ReferenceException: reference : template =
META-INF/DEPENDENCIES.vm [line 40,column 14] : $license.name is not a valid reference.
[INFO] [resources:resources {execution: default-resources}]
[INFO] Using 'UTF-8' encoding to copy filtered resources.
[INFO] Copying 14 resources
[INFO] Copying 3 resources
[INFO] [compiler:compile {execution: default-compile}]
[INFO] Compiling 234 source files to <https://builds.apache.org/job/OpenJPA-trunk-deploy/ws/trunk/openjpa-persistence/target/classes>
[INFO] [compiler:testCompile {execution: test-source-compile}]
[INFO] Compiling 2 source files to <https://builds.apache.org/job/OpenJPA-trunk-deploy/ws/trunk/openjpa-persistence/target/test-classes>
[INFO] [resources:testResources {execution: default-testResources}]
[INFO] Using 'UTF-8' encoding to copy filtered resources.
[INFO] Copying 3 resources
[INFO] Copying 3 resources
[INFO] [compiler:testCompile {execution: default-testCompile}]
[INFO] Nothing to compile - all classes are up to date
[WARNING] DEPRECATED [systemProperties]: Use systemPropertyVariables instead.
[INFO] [surefire:test {execution: default-test}]
[INFO] Surefire report directory: <https://builds.apache.org/job/OpenJPA-trunk-deploy/ws/trunk/openjpa-persistence/target/surefire-reports>

-------------------------------------------------------
 T E S T S
-------------------------------------------------------
Running org.apache.openjpa.persistence.TestEnumToKernelConstantMappings
Tests run: 7, Failures: 0, Errors: 0, Skipped: 0, Time elapsed: 0.143 sec
Running org.apache.openjpa.persistence.TestPersistenceProductDerivation
Tests run: 5, Failures: 0, Errors: 0, Skipped: 0, Time elapsed: 0.659 sec

Results :

Tests run: 12, Failures: 0, Errors: 0, Skipped: 0

[JENKINS] Recording test results
[INFO] [jar:jar {execution: default-jar}]
[INFO] Building jar: <https://builds.apache.org/job/OpenJPA-trunk-deploy/ws/trunk/openjpa-persistence/target/openjpa-persistence-2.4.0-SNAPSHOT.jar>
[INFO] [jar:jar {execution: default-jar}]
[INFO] [jar:test-jar {execution: attach-tests}]
[INFO] Building jar: <https://builds.apache.org/job/OpenJPA-trunk-deploy/ws/trunk/openjpa-persistence/target/openjpa-persistence-2.4.0-SNAPSHOT-tests.jar>
[INFO] [ianal:verify-legal-files {execution: default}]
[INFO] Checking legal files in: openjpa-persistence-2.4.0-SNAPSHOT.jar
[INFO] Checking legal files in: openjpa-persistence-2.4.0-SNAPSHOT-tests.jar
[INFO] [apache-rat:check {execution: default}]
[INFO] Exclude: **/.*/**
[INFO] Exclude: **/target/**/*
[INFO] [install:install {execution: default-install}]
[INFO] Installing <https://builds.apache.org/job/OpenJPA-trunk-deploy/ws/trunk/openjpa-persistence/target/openjpa-persistence-2.4.0-SNAPSHOT.jar>
to /home/jenkins/jenkins-slave/maven-repositories/2/org/apache/openjpa/openjpa-persistence/2.4.0-SNAPSHOT/openjpa-persistence-2.4.0-SNAPSHOT.jar
[INFO] Installing <https://builds.apache.org/job/OpenJPA-trunk-deploy/ws/trunk/openjpa-persistence/target/openjpa-persistence-2.4.0-SNAPSHOT-tests.jar>
to /home/jenkins/jenkins-slave/maven-repositories/2/org/apache/openjpa/openjpa-persistence/2.4.0-SNAPSHOT/openjpa-persistence-2.4.0-SNAPSHOT-tests.jar
[INFO] [deploy:deploy {execution: default-deploy}]
[INFO] Retrieving previous build number from apache.snapshots.https
[WARNING] *** CHECKSUM FAILED - Checksum failed on download: local = '61d742d27cace532d18c8492aef7116423bf95b5';
remote = '27ff8b82db392fff17f36dabe06aecfe16b983d3' - RETRYING
[WARNING] *** CHECKSUM FAILED - Checksum failed on download: local = '61d742d27cace532d18c8492aef7116423bf95b5';
remote = '27ff8b82db392fff17f36dabe06aecfe16b983d3' - IGNORING
Uploading: https://repository.apache.org/content/repositories/snapshots/org/apache/openjpa/openjpa-persistence/2.4.0-SNAPSHOT/openjpa-persistence-2.4.0-20141015.064719-16.jar
812K uploaded  (openjpa-persistence-2.4.0-20141015.064719-16.jar)
[INFO] Retrieving previous metadata from apache.snapshots.https
[WARNING] *** CHECKSUM FAILED - Checksum failed on download: local = '61d742d27cace532d18c8492aef7116423bf95b5';
remote = '27ff8b82db392fff17f36dabe06aecfe16b983d3' - RETRYING
[WARNING] *** CHECKSUM FAILED - Checksum failed on download: local = '61d742d27cace532d18c8492aef7116423bf95b5';
remote = '27ff8b82db392fff17f36dabe06aecfe16b983d3' - IGNORING
[INFO] Uploading repository metadata for: 'snapshot org.apache.openjpa:openjpa-persistence:2.4.0-SNAPSHOT'
[INFO] Uploading project information for openjpa-persistence 2.4.0-20141015.064719-16
[INFO] Retrieving previous metadata from apache.snapshots.https
[INFO] Uploading repository metadata for: 'artifact org.apache.openjpa:openjpa-persistence'
[INFO] Retrieving previous build number from apache.snapshots.https
Uploading: https://repository.apache.org/content/repositories/snapshots/org/apache/openjpa/openjpa-persistence/2.4.0-SNAPSHOT/openjpa-persistence-2.4.0-20141015.064719-16-tests.jar
29K uploaded  (openjpa-persistence-2.4.0-20141015.064719-16-tests.jar)
[INFO] ------------------------------------------------------------------------
[INFO] Building OpenJPA Persistence JDBC
[INFO]    task-segment: [clean, deploy]
[INFO] ------------------------------------------------------------------------
[INFO] [clean:clean {execution: default-clean}]
[INFO] Deleting file set: <https://builds.apache.org/job/OpenJPA-trunk-deploy/ws/trunk/openjpa-persistence-jdbc/target>
(included: [**], excluded: [])
[INFO] [buildnumber:create {execution: default}]
Downloading: http://repo1.maven.org/maven2/simple-jndi/simple-jndi/0.11.4/simple-jndi-0.11.4.pom
4K downloaded  (simple-jndi-0.11.4.pom)
Downloading: http://repo1.maven.org/maven2/simple-jndi/simple-jndi/0.11.4/simple-jndi-0.11.4.jar
41K downloaded  (simple-jndi-0.11.4.jar)
[INFO] [enforcer:enforce {execution: default}]
[INFO] [checkstyle:checkstyle {execution: default}]
[INFO] Starting audit...
<https://builds.apache.org/job/OpenJPA-trunk-deploy/ws/trunk/openjpa-persistence-jdbc/src/test/java/org/apache/openjpa/persistence/jdbc/dbcs/MyDBCSEntity.java>:32:24:
Got an exception - Unexpected character 0xa1 in identifier
Audit done.

[INFO] ------------------------------------------------------------------------
[ERROR] BUILD ERROR
[INFO] ------------------------------------------------------------------------
[INFO] An error has occurred in Checkstyle report generation.

Embedded error: Failed during checkstyle execution
There are 1 checkstyle errors.
[INFO] ------------------------------------------------------------------------
[INFO] For more information, run Maven with the -e switch
[INFO] ------------------------------------------------------------------------
[INFO] Total time: 3 minutes 35 seconds
[INFO] Finished at: Wed Oct 15 06:50:04 UTC 2014
[INFO] Final Memory: 100M/506M
[INFO] ------------------------------------------------------------------------
[JENKINS] Archiving <https://builds.apache.org/job/OpenJPA-trunk-deploy/ws/trunk/openjpa-lib/pom.xml>
to org.apache.openjpa/openjpa-lib/2.4.0-SNAPSHOT/openjpa-lib-2.4.0-SNAPSHOT.pom
[JENKINS] Archiving <https://builds.apache.org/job/OpenJPA-trunk-deploy/ws/trunk/openjpa-lib/target/openjpa-lib-2.4.0-SNAPSHOT.jar>
to org.apache.openjpa/openjpa-lib/2.4.0-20141015.064719-16/openjpa-lib-2.4.0-20141015.064719-16.jar
[JENKINS] Archiving <https://builds.apache.org/job/OpenJPA-trunk-deploy/ws/trunk/openjpa-lib/target/openjpa-lib-2.4.0-SNAPSHOT-tests.jar>
to org.apache.openjpa/openjpa-lib/2.4.0-20141015.064719-16/openjpa-lib-2.4.0-20141015.064719-16-tests.jar
Sending artifact delta relative to OpenJPA-trunk-deploy » OpenJPA Utilities Library #447
Archived 3 artifacts
Archive block size is 32768
Received 0 blocks and 582758 bytes
Compression is 0.0%
Took 0.46 sec
[JENKINS] Archiving <https://builds.apache.org/job/OpenJPA-trunk-deploy/ws/trunk/openjpa-kernel/pom.xml>
to org.apache.openjpa/openjpa-kernel/2.4.0-SNAPSHOT/openjpa-kernel-2.4.0-SNAPSHOT.pom
[JENKINS] Archiving <https://builds.apache.org/job/OpenJPA-trunk-deploy/ws/trunk/openjpa-kernel/target/openjpa-kernel-2.4.0-SNAPSHOT.jar>
to org.apache.openjpa/openjpa-kernel/2.4.0-20141015.064719-16/openjpa-kernel-2.4.0-20141015.064719-16.jar
[JENKINS] Archiving <https://builds.apache.org/job/OpenJPA-trunk-deploy/ws/trunk/openjpa-kernel/target/openjpa-kernel-2.4.0-SNAPSHOT-tests.jar>
to org.apache.openjpa/openjpa-kernel/2.4.0-20141015.064719-16/openjpa-kernel-2.4.0-20141015.064719-16-tests.jar
Sending artifact delta relative to OpenJPA-trunk-deploy » OpenJPA Kernel #447
Archived 3 artifacts
Archive block size is 32768
Received 2 blocks and 1455155 bytes
Compression is 4.3%
Took 2.7 sec
[JENKINS] Archiving <https://builds.apache.org/job/OpenJPA-trunk-deploy/ws/trunk/openjpa-persistence-jdbc/pom.xml>
to org.apache.openjpa/openjpa-persistence-jdbc/2.4.0-SNAPSHOT/openjpa-persistence-jdbc-2.4.0-SNAPSHOT.pom
Sending artifact delta relative to OpenJPA-trunk-deploy » OpenJPA Persistence JDBC #447
Archived 1 artifacts
Archive block size is 32768
Received 1 blocks and 26649 bytes
Compression is 55.1%
Took 0.41 sec
[JENKINS] Archiving <https://builds.apache.org/job/OpenJPA-trunk-deploy/ws/trunk/pom.xml>
to org.apache.openjpa/openjpa-parent/2.4.0-SNAPSHOT/openjpa-parent-2.4.0-SNAPSHOT.pom
[JENKINS] Archiving /home/jenkins/jenkins-slave/maven-repositories/2/org/apache/openjpa/openjpa-parent/2.4.0-SNAPSHOT/openjpa-parent-2.4.0-SNAPSHOT.pom
to org.apache.openjpa/openjpa-parent/2.4.0-20141015.064719-23/openjpa-parent-2.4.0-20141015.064719-23.pom
/home/jenkins/jenkins-slave/maven-repositories/2/org/apache/openjpa/openjpa-parent/2.4.0-SNAPSHOT/openjpa-parent-2.4.0-SNAPSHOT.pom
is not inside <https://builds.apache.org/job/OpenJPA-trunk-deploy/ws/trunk/;> will archive
in a separate pass
Sending artifact delta relative to OpenJPA-trunk-deploy » OpenJPA Parent POM #447
Archived 1 artifacts
Archive block size is 32768
Received 1 blocks and 21444 bytes
Compression is 60.4%
Took 0.17 sec
Sending artifact delta relative to OpenJPA-trunk-deploy » OpenJPA Parent POM #447
Archived 1 artifacts
Archive block size is 32768
Received 1 blocks and 21464 bytes
Compression is 60.4%
Took 52 ms
[JENKINS] Archiving <https://builds.apache.org/job/OpenJPA-trunk-deploy/ws/trunk/openjpa-persistence/pom.xml>
to org.apache.openjpa/openjpa-persistence/2.4.0-SNAPSHOT/openjpa-persistence-2.4.0-SNAPSHOT.pom
[JENKINS] Archiving <https://builds.apache.org/job/OpenJPA-trunk-deploy/ws/trunk/openjpa-persistence/target/openjpa-persistence-2.4.0-SNAPSHOT.jar>
to org.apache.openjpa/openjpa-persistence/2.4.0-20141015.064719-16/openjpa-persistence-2.4.0-20141015.064719-16.jar
[JENKINS] Archiving <https://builds.apache.org/job/OpenJPA-trunk-deploy/ws/trunk/openjpa-persistence/target/openjpa-persistence-2.4.0-SNAPSHOT-tests.jar>
to org.apache.openjpa/openjpa-persistence/2.4.0-20141015.064719-16/openjpa-persistence-2.4.0-20141015.064719-16-tests.jar
Sending artifact delta relative to OpenJPA-trunk-deploy » OpenJPA Persistence #447
Archived 3 artifacts
Archive block size is 32768
Received 0 blocks and 864970 bytes
Compression is 0.0%
Took 2.4 sec
[JENKINS] Archiving <https://builds.apache.org/job/OpenJPA-trunk-deploy/ws/trunk/openjpa-jdbc/pom.xml>
to org.apache.openjpa/openjpa-jdbc/2.4.0-SNAPSHOT/openjpa-jdbc-2.4.0-SNAPSHOT.pom
[JENKINS] Archiving <https://builds.apache.org/job/OpenJPA-trunk-deploy/ws/trunk/openjpa-jdbc/target/openjpa-jdbc-2.4.0-SNAPSHOT.jar>
to org.apache.openjpa/openjpa-jdbc/2.4.0-20141015.064719-16/openjpa-jdbc-2.4.0-20141015.064719-16.jar
[JENKINS] Archiving <https://builds.apache.org/job/OpenJPA-trunk-deploy/ws/trunk/openjpa-jdbc/target/openjpa-jdbc-2.4.0-SNAPSHOT-tests.jar>
to org.apache.openjpa/openjpa-jdbc/2.4.0-20141015.064719-16/openjpa-jdbc-2.4.0-20141015.064719-16-tests.jar
Sending artifact delta relative to OpenJPA-trunk-deploy » OpenJPA JDBC #447
Archived 3 artifacts
Archive block size is 32768
Received 1 blocks and 1457198 bytes
Compression is 2.2%
Took 2.5 sec
Sending e-mails to: commits@openjpa.apache.org
channel stopped

Mime
View raw message